<?xml version="1.0" encoding="UTF-8" standalone="no"?>
<!-- Generator: Adobe Illustrator 16.0.4, SVG Export Plug-In . SVG Version: 6.00 Build 0)  -->

<svg
   version="1.1"
   id="Layer_1"
   x="0px"
   y="0px"
   width="250"
   height="250"
   viewBox="0 0 250 250"
   enable-background="new 0 0 250 183.5"
   xml:space="preserve"
   sodipodi:docname="joystickrobotcontroller_icon.svg"
   inkscape:export-filename="/home/robofei/Repository/joystickrobotcontroller/share/icon/joystickrobotcontroller_icon.png"
   inkscape:export-xdpi="96"
   inkscape:export-ydpi="96"
   inkscape:version="1.1 (c4e8f9ed74, 2021-05-24)"
   xmlns:inkscape="http://www.inkscape.org/namespaces/inkscape"
   xmlns:sodipodi="http://sodipodi.sourceforge.net/DTD/sodipodi-0.dtd"
   xmlns="http://www.w3.org/2000/svg"
   xmlns:svg="http://www.w3.org/2000/svg"><defs
   id="defs9" /><sodipodi:namedview
   id="namedview7"
   pagecolor="#505050"
   bordercolor="#ffffff"
   borderopacity="1"
   inkscape:pageshadow="0"
   inkscape:pageopacity="0"
   inkscape:pagecheckerboard="1"
   showgrid="false"
   inkscape:zoom="2.5137637"
   inkscape:cx="104.8229"
   inkscape:cy="126.30463"
   inkscape:window-width="1920"
   inkscape:window-height="1000"
   inkscape:window-x="0"
   inkscape:window-y="48"
   inkscape:window-maximized="1"
   inkscape:current-layer="Layer_1"
   height="250px" />
<path
   fill="#1db288"
   d="m 22.489,206.614 c 1.554,0.172 3.136,0.171 4.69,0 4.478,-0.493 8.66,-2.386 12.838,-4.058 4.437,-1.771 8.333,-4.416 12.063,-7.354 1.197,-0.947 2.494,-1.813 3.618,-2.813 1.463,-1.298 2.987,-2.531 4.432,-3.854 1.875,-1.715 3.856,-3.312 5.69,-5.07 1.212,-1.156 2.446,-2.283 3.792,-3.271 4.684,-3.426 9.503,-6.668 15.017,-8.61 2.19,-0.771 4.418,-1.406 6.665,-1.972 L 167.551,47.216 c -2.848,1.364 -5.639,2.845 -8.389,4.399 -3.18,1.794 -6.658,2.391 -10.176,2.896 -4.576,0.657 -9.189,0.787 -13.799,0.858 -4.854,0.077 -9.705,0.103 -14.557,0.163 -7.577,0.093 -15.129,-0.14 -22.603,-1.549 C 94.253,53.272 90.829,51.687 87.513,49.83 84.475,48.128 81.337,46.634 78.199,45.134 77.98,45.029 77.61,44.943 77.455,45.054 76.43,45.775 75.615,44.999 74.824,44.64 73.761,44.152 73.482,42.931 72.874,42.02 72.776,41.875 72.8,41.676 72.54,41.637 63.016,40.234 53.824,41.364 44.97,45.191 c -2.405,1.04 -4.682,2.321 -6.978,3.561 -1.178,0.637 -2.232,1.502 -3.344,2.262 -0.419,0.287 -0.643,0.703 -0.731,1.177 -0.169,0.904 -0.543,1.771 -0.517,2.704 0.05,1.738 -1.415,2.592 -2.217,3.828 -0.725,1.12 -1.371,2.253 -1.883,3.502 -3.322,8.085 -6.562,16.2 -9.383,24.48 -2.177,6.388 -4.068,12.856 -5.727,19.396 -0.576,2.264 -1.261,4.513 -1.771,6.78 -1.245,5.54 -2.415,11.099 -3.303,16.711 -0.694,4.395 -1.438,8.776 -1.918,13.2 -0.568,5.244 -0.935,10.496 -1.502,15.746 -0.303,2.806 -0.286,13.962 -0.132,16.64 0.344,5.992 1.123,11.863 2.628,17.641 0.945,3.631 3.064,6.637 5.639,9.314 0.792,0.826 1.595,1.608 2.572,2.27 1.871,1.262 3.927,1.972 6.086,2.211 z"
   id="path2" />
<path
   fill="#1db288"
   d="m 225.17,206.864 v 0 c -2.678,0 -5.201,-0.639 -7.528,-1.328 l -0.574,-0.17 c -4.556,-1.346 -9.267,-2.736 -13.369,-5.521 -0.508,-0.345 -1.02,-0.682 -1.532,-1.019 -1.115,-0.734 -2.269,-1.493 -3.355,-2.319 -3.537,-2.684 -7.016,-5.635 -10.635,-9.022 -1.8,-1.689 -3.729,-3.403 -5.736,-5.096 -3.845,-3.243 -8.526,-6.904 -14.102,-9.472 -3.743,-1.727 -7.671,-2.797 -11.02,-3.616 -6.786,-1.659 -12.829,-2.482 -18.474,-2.517 -3.561,-0.023 -7.119,-0.045 -10.679,-0.045 -4.558,0 -8.359,0.036 -11.964,0.113 -3.101,0.068 -5.641,0.186 -7.992,0.368 -2.696,0.198 -5.142,0.487 -7.479,0.885 l -1.096,0.186 79.448,-127.516 0.222,-0.038 c 0.745,-0.126 1.49,-0.151 2.211,-0.175 0.61,-0.021 1.186,-0.04 1.763,-0.115 l 0.627,-0.006 c 3.067,0 6.417,0.147 7.058,0.177 l 0.12,0.021 c 0.054,0.016 0.137,0.023 0.225,0.031 l 0.135,0.013 c 3.313,0.373 6.517,1.091 9.52,2.133 0.529,0.185 2.92,1.056 3.204,1.182 4.221,1.884 7.961,3.86 11.434,6.042 0.915,0.575 1.396,1.312 1.607,2.467 0.074,0.408 0.113,0.825 0.151,1.241 0.09,0.966 0.175,1.878 0.724,2.656 0.188,0.267 0.387,0.523 0.584,0.78 0.494,0.64 1.006,1.301 1.364,2.126 0.48,1.102 0.989,2.191 1.498,3.281 0.765,1.638 1.555,3.331 2.237,5.05 l 0.5,1.257 c 1.376,3.458 2.8,7.035 4.058,10.614 0.326,0.926 0.663,1.849 1,2.771 0.655,1.798 1.334,3.656 1.923,5.517 1.272,4.004 2.731,8.664 3.956,13.283 1.821,6.847 3.185,12.436 4.293,17.586 1.295,6.005 2.331,12.069 3.081,18.023 l 0.069,0.555 c 1.084,8.624 2.204,17.542 2.446,26.411 0.034,1.251 -0.023,3.999 -0.042,4.902 l -0.005,0.254 c -0.061,3.731 -0.344,7.489 -0.841,11.169 -0.782,5.757 -1.924,11.844 -4.958,17.351 -1.829,3.333 -3.948,6.72 -7.922,8.311 -1.745,0.688 -3.402,1.074 -5.07,1.185 -0.364,0.024 -0.726,0.034 -1.085,0.034 z M 128.166,165.74 c 3.562,0 7.123,0.021 10.685,0.045 5.724,0.035 11.843,0.867 18.706,2.546 3.395,0.83 7.38,1.917 11.199,3.679 5.684,2.616 10.433,6.329 14.328,9.616 2.02,1.702 3.963,3.429 5.775,5.13 3.594,3.363 7.047,6.292 10.556,8.955 1.061,0.806 2.199,1.556 3.301,2.28 0.517,0.34 1.033,0.68 1.544,1.026 3.974,2.697 8.608,4.065 13.091,5.39 l 0.575,0.17 c 2.256,0.669 4.693,1.287 7.243,1.287 h 10e-4 c 0.337,0 0.676,-0.011 1.018,-0.033 1.563,-0.104 3.123,-0.468 4.768,-1.115 3.667,-1.469 5.6,-4.558 7.415,-7.863 2.955,-5.364 4.074,-11.343 4.844,-17.004 0.491,-3.64 0.771,-7.357 0.831,-11.05 l 0.005,-0.259 c 0.019,-0.897 0.076,-3.628 0.042,-4.854 -0.24,-8.82 -1.357,-17.713 -2.438,-26.313 l -0.069,-0.555 c -0.746,-5.926 -1.778,-11.961 -3.066,-17.938 -1.104,-5.135 -2.465,-10.708 -4.282,-17.54 -1.218,-4.598 -2.674,-9.243 -3.942,-13.237 -0.583,-1.84 -1.257,-3.688 -1.909,-5.476 -0.338,-0.925 -0.676,-1.851 -1.004,-2.781 -1.251,-3.56 -2.671,-7.127 -4.044,-10.576 l -0.5,-1.257 c -0.671,-1.692 -1.455,-3.372 -2.214,-4.996 -0.513,-1.098 -1.024,-2.195 -1.508,-3.305 -0.311,-0.711 -0.762,-1.296 -1.239,-1.915 -0.207,-0.268 -0.414,-0.537 -0.61,-0.816 -0.702,-0.995 -0.804,-2.085 -0.901,-3.139 -0.036,-0.388 -0.071,-0.775 -0.141,-1.155 -0.159,-0.873 -0.483,-1.377 -1.154,-1.799 -3.434,-2.156 -7.133,-4.111 -11.31,-5.975 -0.223,-0.099 -2.487,-0.928 -3.126,-1.151 -2.932,-1.018 -6.062,-1.719 -9.302,-2.084 l -0.11,-0.011 c -0.108,-0.009 -0.23,-0.02 -0.358,-0.051 -0.752,-0.034 -3.989,-0.174 -6.957,-0.174 l -0.56,0.002 c -0.562,0.078 -1.189,0.098 -1.796,0.119 -0.643,0.021 -1.252,0.042 -1.857,0.127 l -78.04,125.254 c 2.039,-0.313 4.171,-0.55 6.482,-0.72 2.368,-0.184 4.925,-0.302 8.045,-0.371 3.609,-0.077 7.418,-0.113 11.983,-0.113 z"
   id="path4"
   style="stroke:#1db288;stroke-width:3;stroke-miterlimit:4;stroke-dasharray:none;stroke-opacity:1" />
</svg>
