<?xml version="1.0" encoding="UTF-8" standalone="no"?>
<!-- Generator: Adobe Illustrator 16.0.0, SVG Export Plug-In . SVG Version: 6.00 Build 0)  -->

<svg
   version="1.1"
   id="Capa_1"
   x="0px"
   y="0px"
   width="20px"
   height="20px"
   viewBox="0 0 20 20"
   enable-background="new 0 0 20 20"
   xml:space="preserve"
   sodipodi:docname="Xbox_Right_stick_button_c.svg"
   inkscape:version="1.1.2 (0a00cf5339, 2022-02-04, custom)"
   xmlns:inkscape="http://www.inkscape.org/namespaces/inkscape"
   xmlns:sodipodi="http://sodipodi.sourceforge.net/DTD/sodipodi-0.dtd"
   xmlns="http://www.w3.org/2000/svg"
   xmlns:svg="http://www.w3.org/2000/svg"><defs
   id="defs49" /><sodipodi:namedview
   id="namedview47"
   pagecolor="#ffffff"
   bordercolor="#666666"
   borderopacity="1.0"
   inkscape:pageshadow="2"
   inkscape:pageopacity="0.0"
   inkscape:pagecheckerboard="0"
   showgrid="false"
   inkscape:zoom="15.743586"
   inkscape:cx="8.7337154"
   inkscape:cy="6.0659623"
   inkscape:window-width="1920"
   inkscape:window-height="987"
   inkscape:window-x="0"
   inkscape:window-y="56"
   inkscape:window-maximized="1"
   inkscape:current-layer="Capa_1" />
<g
   id="g44">
	<g
   id="g40">
		<g
   id="g28">
			<linearGradient
   id="SVGID_1_"
   gradientUnits="userSpaceOnUse"
   x1="10"
   y1="0"
   x2="10"
   y2="17.9003">
				<stop
   offset="0"
   style="stop-color:#5B5B5F"
   id="stop2" />
				<stop
   offset="0.0231"
   style="stop-color:#59595D"
   id="stop4" />
				<stop
   offset="0.4507"
   style="stop-color:#333335"
   id="stop6" />
				<stop
   offset="0.7912"
   style="stop-color:#1C1C1D"
   id="stop8" />
				<stop
   offset="1"
   style="stop-color:#141414"
   id="stop10" />
			</linearGradient>
			<circle
   fill="url(#SVGID_1_)"
   cx="10"
   cy="9.999"
   r="10"
   id="circle13" />
			<linearGradient
   id="SVGID_2_"
   gradientUnits="userSpaceOnUse"
   x1="0"
   y1="10"
   x2="20"
   y2="10">
				<stop
   offset="0"
   style="stop-color:#5B5B5F"
   id="stop15" />
				<stop
   offset="0.0231"
   style="stop-color:#59595D"
   id="stop17" />
				<stop
   offset="0.4507"
   style="stop-color:#333335"
   id="stop19" />
				<stop
   offset="0.7912"
   style="stop-color:#1C1C1D"
   id="stop21" />
				<stop
   offset="1"
   style="stop-color:#141414"
   id="stop23" />
			</linearGradient>
			<path
   fill="url(#SVGID_2_)"
   d="M10,2.399c4.191,0,7.6,3.409,7.6,7.6c0,4.191-3.408,7.601-7.6,7.601c-4.189,0-7.6-3.409-7.6-7.601     C2.4,5.809,5.811,2.399,10,2.399 M10,0C4.477,0,0,4.477,0,9.999C0,15.522,4.477,20,10,20s10-4.478,10-10.001     C20,4.477,15.523,0,10,0L10,0z"
   id="path26" />
		</g>
		<g
   id="g38">
			<polygon
   opacity="0.5"
   fill="#FFFFFF"
   points="12.008,2.925 10,2.925 7.994,2.925 10,5    "
   id="polygon30" />
			<polygon
   opacity="0.5"
   fill="#FFFFFF"
   points="15,10 17.076,12.006 17.076,10 17.076,7.993    "
   id="polygon32" />
			<polygon
   opacity="0.5"
   fill="#FFFFFF"
   points="2.926,10 2.926,12.006 5,10 2.926,7.993    "
   id="polygon34" />
			<polygon
   opacity="0.5"
   fill="#FFFFFF"
   points="7.994,17.075 10.002,17.075 12.008,17.075 10.002,15    "
   id="polygon36" />
		</g>
	</g>
	<path
   fill="#FFFFFF"
   d="M11.51,14.304v-2.217c0-0.415-0.094-0.711-0.285-0.889c-0.189-0.177-0.543-0.266-1.063-0.266H8.244v3.371   h-1.75V5.696h4.369c0.396,0,0.758,0.063,1.082,0.188c0.324,0.126,0.602,0.299,0.836,0.519c0.232,0.221,0.412,0.484,0.537,0.791   s0.188,0.638,0.188,0.991c0,0.467-0.109,0.88-0.33,1.238s-0.537,0.611-0.953,0.759c0.381,0.121,0.65,0.307,0.811,0.557   c0.16,0.251,0.24,0.627,0.24,1.128v2.438H11.51z M8.244,7.187v2.295H10.5c0.484,0,0.824-0.108,1.023-0.324s0.299-0.488,0.299-0.816   c0-0.337-0.098-0.613-0.293-0.83c-0.193-0.216-0.516-0.324-0.965-0.324H8.244z"
   id="path42" />
</g>
<path
   style="fill:#00ff00;stroke-width:0.0314961"
   d="M 2.9448819,9.7637795 V 8.9448819 H 3.418254 3.8916261 L 4.4274877,9.4704838 4.9633492,9.9960858 4.6712731,10.289381 4.3791969,10.582677 H 3.6620394 2.9448819 Z"
   id="path102" /><path
   style="fill:#00ff00;stroke-width:0.0314961"
   d="m 2.9448819,11.11811 v -0.535433 h 0.7139066 0.7139066 l -0.5485523,0.533853 -0.5485522,0.533852 -0.1653544,0.0016 -0.1653543,0.0016 z"
   id="path141" /><path
   style="fill:#00ff00;stroke-width:0.0314961"
   d="M 2.9448819,8.5017923 V 8.0587027 l 0.086614,0.062949 c 0.047638,0.034622 0.2564713,0.2340119 0.4640745,0.4430896 L 3.8730311,8.9448819 H 3.4089565 2.9448819 Z"
   id="path180" /><path
   style="fill:#00ff00;stroke-width:0.00642771"
   d="m 2.9278226,11.493429 c 0,-0.330409 0.0022,-0.502042 0.00643,-0.502042 0.0042,0 0.00643,0.114627 0.00643,0.331027 v 0.331027 l 0.1719413,2.05e-4 0.1719412,2.03e-4 -0.1285542,0.125127 c -0.070705,0.06882 -0.1509709,0.145684 -0.178369,0.170811 l -0.049815,0.04568 z"
   id="path219" /><path
   style="fill:#00ff00;stroke-width:0.00642771"
   d="M 2.9471058,9.7636939 V 8.9473746 l 0.4708299,2.82e-5 0.4708298,2.82e-5 L 4.4243007,9.4724137 4.959836,9.9973963 4.6685803,10.288705 4.3773246,10.580013 H 3.6622152 2.9471058 Z"
   id="path288" /><path
   style="fill:#00ff00;stroke-width:0.00642771"
   d="M 2.9471058,9.7636939 V 8.9473746 H 3.4180911 3.8890764 L 4.4244929,9.4723488 4.9599093,9.9973231 4.668617,10.288668 4.3773246,10.580013 H 3.6622152 2.9471058 Z"
   id="path327" /><path
   style="fill:#00ff00;stroke-width:0.00642771"
   d="M 2.9471058,9.7636939 V 8.9473746 h 0.4704475 0.4704476 l 0.061446,0.059678 c 0.033795,0.032823 0.2749418,0.2690941 0.5358816,0.5250468 L 4.9597643,9.9974681 4.6685444,10.288741 4.3773246,10.580013 H 3.6622152 2.9471058 Z"
   id="path366" /></svg>
