1	0.5A	F1
32	100KpF/50V	"C3, C6, C13, C14, C16, C18, C20, C21, C22, C23, C24, C25, C26, C28, C30, C31, C32, C33, C34, C35, C36, C37, C38, C50, C51, C52, C53, C55, C57, C58, C95, C96"
1	100nF/50V	C49
1	100R	R99
1	100uF/50V	C1
5	10K	"R87, R91, R92, R123, R127"
24	10nF/50V	"C61, C62, C65, C66, C70, C71, C74, C75, C79, C80, C83, C84, C88, C89, C92, C93, C99, C100, C103, C104, C108, C109, C112, C113"
30	10R	"R8, R10, R12, R14, R16, R18, R20, R22, R24, R26, R28, R30, R32, R34, R36, R38, R40, R42, R59, R61, R63, R65, R67, R69, R71, R73, R75, R77, R79, R81"
2	10uF/16V	"C8, C10"
9	"10uF/6,3V"	"C4, C9, C12, C67, C76, C85, C94, C105, C114"
6	1K	"R82, R83, R84, R85, R86, R90"
1	1K5 1%	R2
10	1nF/50V	"C39, C40, C41, C42, C43, C44, C45, C46, C47, C48"
1	220uF/6.3V	C2
2	22uF/16V	"C7, C56"
2	"22uF/6,3V"	"C5, C11"
1	240R 1%	R3
1	270R	R94
1	27pF/50V	C54
1	2K2	R5
23	300R	"R43, R44, R45, R46, R47, R48, R49, R50, R51, R52, R53, R54, R55, R56, R57, R100, R101, R102, R103, R105, R106, R107, R108"
30	330R	"R7, R9, R11, R13, R15, R17, R19, R21, R23, R25, R27, R29, R31, R33, R35, R37, R39, R41, R58, R60, R62, R64, R66, R68, R70, R72, R74, R76, R78, R80"
5	330uF/50V	"C15, C17, C19, C27, C29"
1	33uH/2A	L1
6	390R	"R6, R97, R110, R111, R112, R122"
1	390R 1%	R4
4	470R	"R119, R120, R125, R126"
24	47nF/50V	"C59, C60, C63, C64, C68, C69, C72, C73, C77, C78, C81, C82, C86, C87, C90, C91, C97, C98, C101, C102, C106, C107, C110, C111"
12	4K7	"R88, R89, R93, R95, R98, R113, R115, R116, R117, R118, R121, R124"
1	4K7 1%	R1
1	50MHZ	Q16
1	51R	R96
1	53047-02	X13
1	53047-03	X14
4	53047-04	"X8, X9, X10, X11"
1	5566-2	X1
1	56K	R114
1	87758-1416	X7
5	ACS712	"IC20, IC21, IC22, IC23, IC24"
1	AD79X8	IC26
1	AM3MM	LED3
1	D502J12S2AHQF	S1
1	DONE	LED1
1	FAN1112	IC2
2	HD-A103	"DIS1, DIS2"
15	IRF7389	"Q1, Q2, Q3, Q4, Q5, Q6, Q7, Q8, Q9, Q10, Q11, Q12, Q13, Q14, Q15"
2	IS61LV25616AL	"IC30, IC31"
1	LF25CDT	IC4
1	LM1086	IC3
1	LM2596-ADJ	IC1
1	LM358D	IC25
1	M0	M0
1	M1	M1
1	M2	M2
1	MAX6950	IC29
1	MBRA340T3	D2
1	MINI MODUL 2X4	SV1
4	MMBT3904	"T1, T2, T3, T4"
4	PTR1PAD1-13	"1V2, 2V5, 3V3, 5V"
1	S1G	D1
1	SJ4	SJ1
15	TC4427	"IC5, IC6, IC7, IC8, IC9, IC10, IC11, IC12, IC13, IC14, IC15, IC16, IC17, IC18, IC19"
1	TPPAD1-13	AGND
1	TPPAD1-20	GND
1	TRW24G-SINGLE	IC28
1	VD3MM	LED4
1	VERMELHO	ON
1	VM3MM	LED2
1	XC3S400PQ208	U1
1	XCF04S	IC27
