<?xml version="1.0" encoding="UTF-8" standalone="no"?>
<!-- Created with Inkscape (http://www.inkscape.org/) -->

<svg
   width="115.69701mm"
   height="59.165993mm"
   viewBox="0 0 115.69701 59.165993"
   version="1.1"
   id="svg2999"
   inkscape:version="1.1.2 (0a00cf5339, 2022-02-04)"
   sodipodi:docname="letras_pb_no_since.svg"
   inkscape:export-filename="/home/leonardo/Documentos/RoboFEI-SSL/ImagensRobo/Colorido/letras_remaster_final.png"
   inkscape:export-xdpi="1000"
   inkscape:export-ydpi="1000"
   xmlns:inkscape="http://www.inkscape.org/namespaces/inkscape"
   xmlns:sodipodi="http://sodipodi.sourceforge.net/DTD/sodipodi-0.dtd"
   xmlns="http://www.w3.org/2000/svg"
   xmlns:svg="http://www.w3.org/2000/svg"
   xmlns:rdf="http://www.w3.org/1999/02/22-rdf-syntax-ns#"
   xmlns:cc="http://creativecommons.org/ns#"
   xmlns:dc="http://purl.org/dc/elements/1.1/">
  <defs
     id="defs2993" />
  <sodipodi:namedview
     id="base"
     pagecolor="#3a3a3a"
     bordercolor="#666666"
     borderopacity="1.0"
     inkscape:pageopacity="0"
     inkscape:pageshadow="2"
     inkscape:zoom="1.4142136"
     inkscape:cx="191.27238"
     inkscape:cy="123.03658"
     inkscape:document-units="mm"
     inkscape:current-layer="g2956"
     showgrid="false"
     fit-margin-top="0"
     fit-margin-left="0"
     fit-margin-right="0"
     fit-margin-bottom="0"
     inkscape:window-width="1920"
     inkscape:window-height="1019"
     inkscape:window-x="0"
     inkscape:window-y="25"
     inkscape:window-maximized="1"
     inkscape:snap-global="true"
     inkscape:snap-bbox="true"
     inkscape:pagecheckerboard="0" />
  <metadata
     id="metadata2996">
    <rdf:RDF>
      <cc:Work
         rdf:about="">
        <dc:format>image/svg+xml</dc:format>
        <dc:type
           rdf:resource="http://purl.org/dc/dcmitype/StillImage" />
      </cc:Work>
    </rdf:RDF>
  </metadata>
  <g
     inkscape:label="Camada 1"
     inkscape:groupmode="layer"
     id="layer1"
     transform="translate(-47.427161,-12.905409)">
    <g
       transform="matrix(1.6913169,0,0,1.6913169,6.865313,-248.27652)"
       id="g2956">
      <path
         inkscape:connector-curvature="0"
         id="path2481"
         d="m 24.358523,180.44851 5.477324,-18.40527 -0.630588,-0.70265 0.01801,-2.61244 1.603497,-2.45028 1.423329,-1.39632 h 9.476845 l 2.43227,2.08094 v 3.89163 l 0.198185,0.22524 h 5.693314 l 0.378354,0.29728 0.378353,-0.29728 h 8.43187 l 0.909849,0.67563 0.909849,-0.67563 h 6.377953 l 0.108101,-1.61255 0.522487,-1.04498 0.612572,-1.02696 0.576538,-0.77473 0.576539,-0.55851 0.864807,-0.88283 0.342319,-0.29725 h 9.080481 l 1.360272,1.25212 v 2.73856 l -0.495452,2.12598 9.548917,-0.018 1.369275,1.35126 0.108097,2.95476 -3.234575,11.69955 -2.022039,2.76672 -1.576269,0.79342 -13.139625,-0.0237 -1.574402,2.54653 -1.574402,1.34183 -4.462439,0.0635 -1.432334,-1.40533 v -2.47731 h -5.486118 l -1.171093,-0.50448 -1.171093,0.50448 h -8.053517 l -0.720672,-0.50448 -0.720673,0.50448 h -7.044575 l -0.738689,-0.50448 -0.73869,0.50448 h -3.747498 l -0.630588,2.15296 -1.567463,1.6305 h -5.369011 l -1.423329,-1.2702 z"
         style="fill:none;stroke:#ffffff;stroke-width:0.749712;stroke-linecap:butt;stroke-linejoin:miter;stroke-miterlimit:4;stroke-dasharray:none;stroke-opacity:1;fill-opacity:1"
         sodipodi:nodetypes="ccccccccccccccccccccccccccccccccccccccccccccccccccccccc" />
      <path
         sodipodi:nodetypes="ccccccccccccccccccccccccccccccccc"
         inkscape:connector-curvature="0"
         id="path2483"
         d="m 30.129658,181.65879 h -2.993856 l 5.996618,-20.54196 h 2.97221 l -1.643436,5.95488 h 1.719875 l 0.586031,-0.59876 1.566997,-5.45265 v -0.42041 l -0.394934,-0.37586 h -6.344427 l 1.783574,-2.79005 h 7.070596 l 0.522333,0.15924 0.445893,0.40768 0.140138,0.33123 -0.02548,1.5033 -2.267686,7.56745 -0.343975,0.64973 -0.369454,0.28028 -0.509593,0.0128 -0.08918,0.28027 0.242057,0.29302 0.242056,0.21658 0.114123,0.77076 -0.101323,0.77076 -2.178508,7.44644 h -3.070295 l 2.140288,-7.35722 0.01274,-0.90453 -0.267536,-0.29936 h -1.261242 z"
         style="fill:#ffffff;fill-opacity:1;stroke:#ffffff;stroke-width:0.74999994px;stroke-linecap:butt;stroke-linejoin:miter;stroke-opacity:1" />
      <path
         style="fill:#ffffff;fill-opacity:1;stroke:#ffffff;stroke-width:4.79428387;stroke-linecap:butt;stroke-linejoin:miter;stroke-miterlimit:4;stroke-dasharray:none;stroke-opacity:1"
         d="M 178.96094 58.636719 C 178.96094 58.636719 152.19094 149.36542 151.78125 150.50391 L 193.70312 150.50391 L 198.54102 148.66602 L 201.53516 144.86523 L 209.71289 116.41797 L 210.28906 109.39258 L 209.36719 107.43359 L 206.14258 105.9375 L 206.60352 103.74805 L 211.20898 103.05859 L 213.85742 100.75391 L 223.30273 68.046875 L 223.41797 62.978516 L 221.68945 59.984375 L 218.11914 58.636719 L 178.96094 58.636719 z M 201.27734 69.416016 L 203.85547 71.447266 L 204.95703 73.876953 L 198.40625 96.451172 L 195.53906 99.896484 L 182.33203 99.900391 L 191.40234 69.419922 L 201.27734 69.416016 z M 191.26367 108.08398 L 193.8418 110.11523 L 194.94336 112.54492 L 188.39258 135.11914 L 185.52539 138.56445 L 172.31836 138.56836 L 181.38867 108.08789 L 191.26367 108.08398 z "
         id="path2521"
         transform="matrix(0.15643629,0,0,0.15643629,23.982406,154.42519)" />
      <path
         style="fill:#ffffff;fill-opacity:1;stroke:#ffffff;stroke-width:4.79428387px;stroke-linecap:butt;stroke-linejoin:miter;stroke-opacity:1"
         d="M 244.68164 58.636719 L 241.99414 60.482422 L 239.63281 62.4375 L 237.92188 64.798828 L 216.25977 140.29102 L 216.17773 146.72461 L 217.5625 148.92383 L 220.33203 150.50391 L 252.98828 150.50391 L 256.00195 149.81836 L 259.42188 147.29492 L 261.70117 143.38477 L 283.68945 67.242188 L 283.60938 63.576172 L 282.30664 60.5625 L 278.72266 58.636719 L 244.68164 58.636719 z M 254.45898 70.154297 L 262.8457 70.25 L 266.28711 71.966797 L 267.12109 75.308594 L 249.85938 133.62305 L 248.68555 136.07617 L 246.27148 139.04297 L 235.58203 138.62891 L 233.08594 136.50781 L 232.81445 132.90625 L 249.43164 75.214844 L 251.43164 71.923828 L 254.45898 70.154297 z "
         id="path2540"
         transform="matrix(0.15643629,0,0,0.15643629,23.982406,154.42519)" />
      <path
         sodipodi:nodetypes="ccccccccc"
         inkscape:connector-curvature="0"
         id="path2544"
         d="m 65.401043,181.82571 6.182839,-20.68696 h 3.17682 l -1.432259,4.94026 h 2.954758 l -0.756705,2.84666 H 72.60777 l -3.891633,12.90004 z"
         style="fill:#ffffff;fill-opacity:1;stroke:#ffffff;stroke-width:0.74999994px;stroke-linecap:butt;stroke-linejoin:miter;stroke-opacity:1" />
      <path
         sodipodi:nodetypes="ccccc"
         inkscape:connector-curvature="0"
         id="path2546"
         d="m 70.121449,160.16951 1.873749,-2.84666 h 7.06259 l -0.720667,2.84666 z"
         style="fill:#ffffff;fill-opacity:1;stroke:#ffffff;stroke-width:0.74999994px;stroke-linecap:butt;stroke-linejoin:miter;stroke-opacity:1" />
      <path
         sodipodi:nodetypes="ccccccccccccc"
         inkscape:connector-curvature="0"
         id="path2548"
         d="m 74.661687,178.1593 4.504206,-14.58461 h 5.513145 l -0.684637,2.37825 h -2.558393 l -1.18911,3.42321 h 2.594423 l -0.648608,2.5584 h -2.594422 l -1.153073,3.53129 h 2.918723 l -1.044975,2.69346 z"
         style="fill:#ffffff;fill-opacity:1;stroke:#ffffff;stroke-width:0.74999994px;stroke-linecap:butt;stroke-linejoin:miter;stroke-opacity:1" />
      <path
         sodipodi:nodetypes="ccccc"
         inkscape:connector-curvature="0"
         id="path2550"
         d="m 82.300818,178.1593 4.360065,-14.58461 h 2.95476 l -4.251968,14.58461 z"
         style="fill:#ffffff;fill-opacity:1;stroke:#ffffff;stroke-width:0.74999994px;stroke-linecap:butt;stroke-linejoin:miter;stroke-opacity:1" />
      <path
         style="fill:#ffffff;fill-opacity:1;stroke:#ffffff;stroke-width:4.79428387px;stroke-linecap:butt;stroke-linejoin:miter;stroke-opacity:1"
         d="M 123.70703 58.636719 L 121.01953 60.478516 L 118.6582 62.433594 L 116.94727 64.794922 L 95.285156 140.28711 L 95.203125 146.7207 L 96.587891 148.91992 L 99.357422 150.50391 L 132.01367 150.50391 L 135.02734 149.81641 L 138.44727 147.29102 L 140.72656 143.38281 L 162.71484 67.238281 L 162.63477 63.574219 L 161.33008 60.560547 L 157.74805 58.636719 L 123.70703 58.636719 z M 133.36328 70.414062 L 141.74805 70.507812 L 145.18945 72.226562 L 146.02539 75.568359 L 128.76367 133.88281 L 127.58984 136.33594 L 125.17578 139.30273 L 114.48633 138.88867 L 111.99023 136.76562 L 111.71875 133.16406 L 128.33594 75.474609 L 130.33594 72.181641 L 133.36328 70.414062 z "
         id="path2540-1"
         transform="matrix(0.15643629,0,0,0.15643629,23.982406,154.42519)" />
    </g>
  </g>
</svg>
