\relax 
\providecommand\hyper@newdestlabel[2]{}
\providecommand\HyField@AuxAddToFields[1]{}
\providecommand\HyField@AuxAddToCoFields[2]{}
\providecommand\babel@aux[2]{}
\@nameuse{bbl@beforestart}
\catcode `"\active 
\providecommand \oddpage@label [2]{}
\babel@aux{brazilian}{}
\@writefile{toc}{\contentsline {section}{\numberline {1}Introdução}{1}{section.1}\protected@file@percent }
\@writefile{lof}{\contentsline {figure}{\numberline {1}{\ignorespaces Imagem da arena do desafio desta atividade.}}{1}{figure.1}\protected@file@percent }
\newlabel{ref:arena}{{1}{1}{Imagem da arena do desafio desta atividade}{figure.1}{}}
\newlabel{eq:posx}{{1}{1}{Introdução}{equation.1.1}{}}
\newlabel{eq:velx}{{2}{1}{Introdução}{equation.1.2}{}}
\@writefile{lof}{\contentsline {figure}{\numberline {2}{\ignorespaces Cálculo da covariância fornecida pelo KF durante o trajeto do robô.}}{2}{figure.2}\protected@file@percent }
\newlabel{ref:graf}{{2}{2}{Cálculo da covariância fornecida pelo KF durante o trajeto do robô}{figure.2}{}}
\@writefile{toc}{\contentsline {section}{\numberline {2}Filtro de Kalman}{2}{section.2}\protected@file@percent }
\newlabel{eqKalman1}{{3}{2}{Filtro de Kalman}{equation.2.3}{}}
\newlabel{eqKalman2}{{4}{2}{Filtro de Kalman}{equation.2.4}{}}
\newlabel{eqKalman3}{{5}{3}{Filtro de Kalman}{equation.2.5}{}}
\newlabel{eqKalman45}{{6}{3}{Filtro de Kalman}{equation.2.6}{}}
\newlabel{eqKalman6}{{7}{3}{Filtro de Kalman}{equation.2.7}{}}
\newlabel{eqKalman7}{{8}{3}{Filtro de Kalman}{equation.2.8}{}}
\@writefile{toc}{\contentsline {section}{\numberline {3}{Código Fonte}}{4}{section.3}\protected@file@percent }
\@writefile{toc}{\contentsline {section}{\numberline {4}Realizando o desafio [Vídeo]}{14}{section.4}\protected@file@percent }
\newlabel{video}{{4}{14}{Realizando o desafio [Vídeo]}{section.4}{}}
\newlabel{LastPage}{{4}{14}{Realizando o desafio [Vídeo]}{page.14}{}}
\gdef\lastpage@lastpage{14}
\gdef\lastpage@lastpageHy{14}
\gdef \@abspage@last{14}
