\relax 
\providecommand\hyper@newdestlabel[2]{}
\providecommand\HyField@AuxAddToFields[1]{}
\providecommand\HyField@AuxAddToCoFields[2]{}
\providecommand\babel@aux[2]{}
\@nameuse{bbl@beforestart}
\catcode `"\active 
\abx@aux@refcontext{nty/global//global/global/global}
\babel@aux{portuguese}{}
\@writefile{toc}{\contentsline {section}{\numberline {1}Introdução ao DevOps}{1}{section.1}\protected@file@percent }
\@writefile{toc}{\contentsline {section}{\numberline {2}Configuração da organização sslRoboFEI}{1}{section.2}\protected@file@percent }
\@writefile{toc}{\contentsline {subsection}{\numberline {2.1}Alterando o nome}{1}{subsection.2.1}\protected@file@percent }
\@writefile{toc}{\contentsline {subsection}{\numberline {2.2}Deletar organização}{1}{subsection.2.2}\protected@file@percent }
\@writefile{toc}{\contentsline {subsection}{\numberline {2.3}Gerenciamento de projetos}{2}{subsection.2.3}\protected@file@percent }
\@writefile{toc}{\contentsline {subsection}{\numberline {2.4}Adicionando novos membros}{2}{subsection.2.4}\protected@file@percent }
\@writefile{toc}{\contentsline {subsection}{\numberline {2.5}Removendo membros}{2}{subsection.2.5}\protected@file@percent }
\@writefile{toc}{\contentsline {section}{\numberline {3}Configurações do projeto RoboFEI - SSL}{2}{section.3}\protected@file@percent }
\@writefile{toc}{\contentsline {subsection}{\numberline {3.1}Alterando o nome}{3}{subsection.3.1}\protected@file@percent }
\@writefile{toc}{\contentsline {subsection}{\numberline {3.2}Administradores do projeto}{3}{subsection.3.2}\protected@file@percent }
\@writefile{toc}{\contentsline {subsection}{\numberline {3.3}Deletar organização}{3}{subsection.3.3}\protected@file@percent }
\@writefile{toc}{\contentsline {subsection}{\numberline {3.4}Gerenciamento de times}{3}{subsection.3.4}\protected@file@percent }
\@writefile{toc}{\contentsline {subsection}{\numberline {3.5}Adicionando novos membros}{3}{subsection.3.5}\protected@file@percent }
\@writefile{toc}{\contentsline {subsection}{\numberline {3.6}Removendo membros}{3}{subsection.3.6}\protected@file@percent }
\@writefile{toc}{\contentsline {subsection}{\numberline {3.7}Permissões de membros}{4}{subsection.3.7}\protected@file@percent }
\@writefile{toc}{\contentsline {subsection}{\numberline {3.8}O conceito de \textit  {Sprints}}{4}{subsection.3.8}\protected@file@percent }
\@writefile{toc}{\contentsline {subsection}{\numberline {3.9}Áreas do projeto SSL}{4}{subsection.3.9}\protected@file@percent }
\@writefile{toc}{\contentsline {section}{\numberline {4}Gerenciando as tarefas}{5}{section.4}\protected@file@percent }
\@writefile{toc}{\contentsline {subsection}{\numberline {4.1}Visão geral}{5}{subsection.4.1}\protected@file@percent }
\@writefile{toc}{\contentsline {subsubsection}{\numberline {4.1.1}Dashboards}{5}{subsubsection.4.1.1}\protected@file@percent }
\@writefile{toc}{\contentsline {subsubsection}{\numberline {4.1.2}Wiki}{5}{subsubsection.4.1.2}\protected@file@percent }
\@writefile{toc}{\contentsline {subsection}{\numberline {4.2}Criação e atribuição de tarefas}{6}{subsection.4.2}\protected@file@percent }
\@writefile{toc}{\contentsline {subsubsection}{\numberline {4.2.1}Work items}{6}{subsubsection.4.2.1}\protected@file@percent }
\@writefile{toc}{\contentsline {subsection}{\numberline {4.3}Outras opções}{7}{subsection.4.3}\protected@file@percent }
\@writefile{toc}{\contentsline {section}{\numberline {5}Considerações finais}{7}{section.5}\protected@file@percent }
\abx@aux@read@bbl@mdfivesum{E75D7E0DB03F09D45B25DF2F538BB294}
\gdef \@abspage@last{8}
