<?xml version="1.0" encoding="UTF-8" standalone="no"?>
<!-- Created with Inkscape (http://www.inkscape.org/) -->

<svg
   xmlns:dc="http://purl.org/dc/elements/1.1/"
   xmlns:cc="http://creativecommons.org/ns#"
   xmlns:rdf="http://www.w3.org/1999/02/22-rdf-syntax-ns#"
   xmlns:svg="http://www.w3.org/2000/svg"
   xmlns="http://www.w3.org/2000/svg"
   xmlns:sodipodi="http://sodipodi.sourceforge.net/DTD/sodipodi-0.dtd"
   xmlns:inkscape="http://www.inkscape.org/namespaces/inkscape"
   width="42.135391mm"
   height="42.940884mm"
   viewBox="0 0 42.135391 42.940883"
   version="1.1"
   id="svg8"
   inkscape:version="0.92.5 (2060ec1f9f, 2020-04-08)"
   sodipodi:docname="robo_bola.svg">
  <defs
     id="defs2" />
  <sodipodi:namedview
     id="base"
     pagecolor="#ffffff"
     bordercolor="#666666"
     borderopacity="1.0"
     inkscape:pageopacity="0.0"
     inkscape:pageshadow="2"
     inkscape:zoom="3.959798"
     inkscape:cx="24.880101"
     inkscape:cy="85.961859"
     inkscape:document-units="mm"
     inkscape:current-layer="layer1"
     showgrid="false"
     inkscape:snap-smooth-nodes="true"
     fit-margin-top="0"
     fit-margin-left="0"
     fit-margin-right="0"
     fit-margin-bottom="0"
     inkscape:window-width="2560"
     inkscape:window-height="1000"
     inkscape:window-x="0"
     inkscape:window-y="44"
     inkscape:window-maximized="1" />
  <metadata
     id="metadata5">
    <rdf:RDF>
      <cc:Work
         rdf:about="">
        <dc:format>image/svg+xml</dc:format>
        <dc:type
           rdf:resource="http://purl.org/dc/dcmitype/StillImage" />
        <dc:title></dc:title>
      </cc:Work>
    </rdf:RDF>
  </metadata>
  <g
     inkscape:label="Camada 1"
     inkscape:groupmode="layer"
     id="layer1"
     transform="translate(-83.932304,-122.86549)">
    <circle
       style="opacity:1;vector-effect:none;fill:#e58100;fill-opacity:1;fill-rule:nonzero;stroke:#e58100;stroke-width:2.6766901;stroke-linecap:round;stroke-linejoin:round;stroke-miterlimit:4;stroke-dasharray:none;stroke-dashoffset:0;stroke-opacity:1;paint-order:normal"
       id="path820-50"
       cx="104.57887"
       cy="128.32182"
       r="4.1179848" />
    <path
       style="opacity:1;vector-effect:none;fill:#000000;fill-opacity:1;fill-rule:nonzero;stroke:none;stroke-width:3.08190513;stroke-linecap:round;stroke-linejoin:round;stroke-miterlimit:4;stroke-dasharray:none;stroke-dashoffset:0;stroke-opacity:1;paint-order:normal"
       id="path875"
       sodipodi:type="arc"
       sodipodi:cx="105"
       sodipodi:cy="145.5307"
       sodipodi:rx="21.067696"
       sodipodi:ry="20.275675"
       sodipodi:start="5.4977871"
       sodipodi:end="3.9269908"
       sodipodi:open="true"
       d="m 119.89711,131.19363 a 21.067696,20.275675 0 0 1 4.5669,22.09623 A 21.067696,20.275675 0 0 1 105,165.80638 21.067696,20.275675 0 0 1 85.535987,153.28987 21.067696,20.275675 0 0 1 90.102889,131.19363" />
    <circle
       style="opacity:1;vector-effect:none;fill:#e600ff;fill-opacity:1;fill-rule:nonzero;stroke:#e600ff;stroke-width:2.6766901;stroke-linecap:round;stroke-linejoin:round;stroke-miterlimit:4;stroke-dasharray:none;stroke-dashoffset:0;stroke-opacity:1;paint-order:normal"
       id="path820-5"
       cx="93.90831"
       cy="138.55496"
       r="4.1179848" />
    <circle
       style="opacity:1;vector-effect:none;fill:#00bd41;fill-opacity:1;fill-rule:nonzero;stroke:#00bd41;stroke-width:2.6766901;stroke-linecap:round;stroke-linejoin:round;stroke-miterlimit:4;stroke-dasharray:none;stroke-dashoffset:0;stroke-opacity:1;paint-order:normal"
       id="path820-1"
       cx="116.09168"
       cy="138.55496"
       r="4.1179848" />
    <circle
       style="opacity:1;vector-effect:none;fill:#0f0fb7;fill-opacity:1;fill-rule:nonzero;stroke:#0f0fb7;stroke-width:2.6766901;stroke-linecap:round;stroke-linejoin:round;stroke-miterlimit:4;stroke-dasharray:none;stroke-dashoffset:0;stroke-opacity:1;paint-order:normal"
       id="path820"
       cx="104.99999"
       cy="147.44167"
       r="4.1179848" />
    <circle
       style="opacity:1;vector-effect:none;fill:#00bd41;fill-opacity:1;fill-rule:nonzero;stroke:#00bd41;stroke-width:2.6766901;stroke-linecap:round;stroke-linejoin:round;stroke-miterlimit:4;stroke-dasharray:none;stroke-dashoffset:0;stroke-opacity:1;paint-order:normal"
       id="path820-0"
       cx="96.146683"
       cy="156.3284"
       r="4.1179848" />
    <circle
       style="opacity:1;vector-effect:none;fill:#e600ff;fill-opacity:1;fill-rule:nonzero;stroke:#e600ff;stroke-width:2.6766901;stroke-linecap:round;stroke-linejoin:round;stroke-miterlimit:4;stroke-dasharray:none;stroke-dashoffset:0;stroke-opacity:1;paint-order:normal"
       id="path820-8"
       cx="113.8533"
       cy="156.3284"
       r="4.1179848" />
  </g>
</svg>
