{
    "AuxAudioDevice1": {
        "balance": 0.5,
        "deinterlace_field_order": 0,
        "deinterlace_mode": 0,
        "enabled": true,
        "flags": 0,
        "hotkeys": {
            "libobs.mute": [],
            "libobs.push-to-mute": [],
            "libobs.push-to-talk": [],
            "libobs.unmute": []
        },
        "id": "pulse_input_capture",
        "mixers": 255,
        "monitoring_type": 0,
        "muted": true,
        "name": "Mic/Aux",
        "prev_ver": 452984833,
        "private_settings": {},
        "push-to-mute": false,
        "push-to-mute-delay": 0,
        "push-to-talk": false,
        "push-to-talk-delay": 0,
        "settings": {
            "device_id": "default"
        },
        "sync": 0,
        "versioned_id": "pulse_input_capture",
        "volume": 0.33790403604507446
    },
    "DesktopAudioDevice1": {
        "balance": 0.5,
        "deinterlace_field_order": 0,
        "deinterlace_mode": 0,
        "enabled": true,
        "flags": 0,
        "hotkeys": {
            "libobs.mute": [],
            "libobs.push-to-mute": [],
            "libobs.push-to-talk": [],
            "libobs.unmute": []
        },
        "id": "pulse_output_capture",
        "mixers": 255,
        "monitoring_type": 0,
        "muted": true,
        "name": "Desktop Audio",
        "prev_ver": 452984833,
        "private_settings": {},
        "push-to-mute": false,
        "push-to-mute-delay": 0,
        "push-to-talk": false,
        "push-to-talk-delay": 0,
        "settings": {
            "device_id": "default"
        },
        "sync": 0,
        "versioned_id": "pulse_output_capture",
        "volume": 0.0
    },
    "current_program_scene": "Jogo",
    "current_scene": "Jogo",
    "current_transition": "Fade",
    "groups": [],
    "modules": {
        "advanced-scene-switcher": {
            "Address": "",
            "ClientEnabled": false,
            "ClientPort": 55555,
            "LockToIPv4": false,
            "SendPreview": true,
            "SendSceneChange": true,
            "SendSceneChangeAll": true,
            "ServerEnabled": false,
            "ServerPort": 55555,
            "active": true,
            "adjustActiveTransitionType": true,
            "audioFallbackDuration": 0.0,
            "audioFallbackEnable": false,
            "audioFallbackScene": "",
            "audioFallbackTargetType": 0,
            "audioFallbackTransition": "",
            "audioSwitches": [],
            "audioTabPos": 13,
            "autoStartEvent": 0,
            "cooldown": 0.0,
            "cooldownUnit": 0,
            "defTransitionDelay": 300,
            "defaultTransitions": [],
            "disableHints": false,
            "displayUnit": 0,
            "exeTabPos": 5,
            "executableSwitches": [],
            "fileSwitches": [],
            "fileTabPos": 8,
            "generalTabPos": 0,
            "idleEnable": false,
            "idleSceneName": "",
            "idleTabPos": 11,
            "idleTargetType": 0,
            "idleTime": 60,
            "idleTransitionName": "",
            "ignoreIdleWindows": [],
            "ignoreWindows": [],
            "interval": 300,
            "macroTabPos": 1,
            "macros": [],
            "mediaSwitches": [],
            "mediaTabPos": 7,
            "networkTabPos": 15,
            "noMatchDelay": 0.0,
            "noMatchDelayUnit": 0,
            "non_matching_scene": "",
            "pauseEntries": [],
            "pauseTabPos": 3,
            "priority0": 0,
            "priority1": 1,
            "priority10": 10,
            "priority2": 2,
            "priority3": 3,
            "priority4": 4,
            "priority5": 5,
            "priority6": 6,
            "priority7": 7,
            "priority8": 8,
            "priority9": 9,
            "randomSwitches": [],
            "randomTabPos": 9,
            "readEnabled": false,
            "readPath": "",
            "regionTabPos": 6,
            "saveWindowGeo": false,
            "sceneGroupTabPos": 16,
            "sceneGroups": [],
            "sceneRoundTrip": [],
            "sceneTransitions": [],
            "screenRegion": [],
            "sequenceTabPos": 12,
            "startHotkey": [],
            "startup_behavior": 0,
            "stopHotkey": [],
            "switch_if_not_matching": 0,
            "switches": [],
            "tansitionOverrideOverride": false,
            "threadPriority": 3,
            "timeSwitches": [],
            "timeTabPos": 10,
            "titleTabPos": 4,
            "toggleHotkey": [],
            "transitionTabPos": 2,
            "triggerTabPos": 17,
            "triggers": [],
            "verbose": false,
            "version": "1474509cb9409f85fafefa14da65530f27b2d24c",
            "videoSwitches": [],
            "videoTabPos": 14,
            "windowHeight": -1,
            "windowPosX": 0,
            "windowPosY": 0,
            "windowWidth": -1,
            "writeEnabled": false,
            "writePath": ""
        },
        "auto-scene-switcher": {
            "active": false,
            "interval": 300,
            "non_matching_scene": "",
            "switch_if_not_matching": false,
            "switches": []
        },
        "copyTransformHotkey": [],
        "decklink_captions": {
            "source": ""
        },
        "downstream_keyers": [
            {
                "disable_tie_hotkey": [],
                "enable_tie_hotkey": [],
                "hide_transition": "",
                "hide_transition_duration": 0,
                "name": "DSK 1",
                "null_hotkey": [],
                "scene": "",
                "scenes": [],
                "show_transition": "",
                "show_transition_duration": 0,
                "transition": "",
                "transition_duration": 300
            }
        ],
        "downstream_keyers_channel": 7,
        "output-timer": {
            "autoStartRecordTimer": false,
            "autoStartStreamTimer": false,
            "pauseRecordTimer": true,
            "recordTimerHours": 0,
            "recordTimerMinutes": 0,
            "recordTimerSeconds": 30,
            "streamTimerHours": 0,
            "streamTimerMinutes": 0,
            "streamTimerSeconds": 30
        },
        "pasteTransformHotkey": [],
        "scripts-tool": [
            {
                "path": "/usr/share/obs/obs-plugins/frontend-tools/scripts/countdown.lua",
                "settings": {
                    "reset_hotkey": [],
                    "source": "Countdown",
                    "stop_text": ""
                }
            }
        ],
        "transition-table": {
            "disable_hotkey": [],
            "enable_hotkey": [],
            "transitions": []
        }
    },
    "name": "RoboFEI",
    "preview_locked": false,
    "quick_transitions": [
        {
            "duration": 300,
            "fade_to_black": false,
            "hotkeys": [],
            "id": 1,
            "name": "Cut"
        },
        {
            "duration": 300,
            "fade_to_black": false,
            "hotkeys": [],
            "id": 2,
            "name": "Fade"
        },
        {
            "duration": 300,
            "fade_to_black": true,
            "hotkeys": [],
            "id": 3,
            "name": "Fade"
        }
    ],
    "saved_projectors": [],
    "scaling_enabled": false,
    "scaling_level": 0,
    "scaling_off_x": 0.0,
    "scaling_off_y": 0.0,
    "scene_order": [
        {
            "name": "Scene"
        },
        {
            "name": "Gravar"
        },
        {
            "name": "Jogo"
        },
        {
            "name": "Out"
        },
        {
            "name": "Intro"
        }
    ],
    "sources": [
        {
            "balance": 0.5,
            "deinterlace_field_order": 0,
            "deinterlace_mode": 0,
            "enabled": true,
            "flags": 0,
            "hotkeys": {},
            "id": "text_ft2_source",
            "mixers": 0,
            "monitoring_type": 0,
            "muted": false,
            "name": "Score_amarelo",
            "prev_ver": 452984833,
            "private_settings": {},
            "push-to-mute": false,
            "push-to-mute-delay": 0,
            "push-to-talk": false,
            "push-to-talk-delay": 0,
            "settings": {
                "color1": 4278190080,
                "color2": 4278190080,
                "from_file": true,
                "text_file": "/home/leonardo/Documentos/RoboFEI-SSL/ImagensRobo/Overlay/Dados/amarelo_score.txt"
            },
            "sync": 0,
            "versioned_id": "text_ft2_source_v2",
            "volume": 1.0
        },
        {
            "balance": 0.5,
            "deinterlace_field_order": 0,
            "deinterlace_mode": 0,
            "enabled": true,
            "flags": 0,
            "hotkeys": {},
            "id": "text_ft2_source",
            "mixers": 0,
            "monitoring_type": 0,
            "muted": false,
            "name": "Score_azul",
            "prev_ver": 452984833,
            "private_settings": {},
            "push-to-mute": false,
            "push-to-mute-delay": 0,
            "push-to-talk": false,
            "push-to-talk-delay": 0,
            "settings": {
                "color1": 4278190080,
                "color2": 4278190080,
                "from_file": true,
                "text_file": "/home/leonardo/Documentos/RoboFEI-SSL/ImagensRobo/Overlay/Dados/azul_score.txt"
            },
            "sync": 0,
            "versioned_id": "text_ft2_source_v2",
            "volume": 1.0
        },
        {
            "balance": 0.5,
            "deinterlace_field_order": 0,
            "deinterlace_mode": 0,
            "enabled": true,
            "flags": 0,
            "hotkeys": {},
            "id": "text_ft2_source",
            "mixers": 0,
            "monitoring_type": 0,
            "muted": false,
            "name": "Time_amarelo",
            "prev_ver": 452984833,
            "private_settings": {},
            "push-to-mute": false,
            "push-to-mute-delay": 0,
            "push-to-talk": false,
            "push-to-talk-delay": 0,
            "settings": {
                "color1": 4278190080,
                "color2": 4278190080,
                "from_file": true,
                "text_file": "/home/leonardo/Documentos/RoboFEI-SSL/ImagensRobo/Overlay/Dados/amarelo_nome.txt"
            },
            "sync": 0,
            "versioned_id": "text_ft2_source_v2",
            "volume": 1.0
        },
        {
            "balance": 0.5,
            "deinterlace_field_order": 0,
            "deinterlace_mode": 0,
            "enabled": true,
            "flags": 0,
            "hotkeys": {},
            "id": "text_ft2_source",
            "mixers": 0,
            "monitoring_type": 0,
            "muted": false,
            "name": "Time_azul",
            "prev_ver": 452984833,
            "private_settings": {},
            "push-to-mute": false,
            "push-to-mute-delay": 0,
            "push-to-talk": false,
            "push-to-talk-delay": 0,
            "settings": {
                "antialiasing": true,
                "color1": 4278190080,
                "color2": 4278190080,
                "drop_shadow": false,
                "font": {
                    "face": "Sans Serif",
                    "flags": 0,
                    "size": 256,
                    "style": ""
                },
                "from_file": true,
                "log_lines": 6,
                "outline": false,
                "text": "",
                "text_file": "/home/leonardo/Documentos/RoboFEI-SSL/ImagensRobo/Overlay/Dados/azul_nome.txt",
                "word_wrap": false
            },
            "sync": 0,
            "versioned_id": "text_ft2_source_v2",
            "volume": 1.0
        },
        {
            "balance": 0.5,
            "deinterlace_field_order": 0,
            "deinterlace_mode": 0,
            "enabled": true,
            "flags": 0,
            "hotkeys": {},
            "id": "image_source",
            "mixers": 0,
            "monitoring_type": 0,
            "muted": false,
            "name": "Grupos",
            "prev_ver": 452984833,
            "private_settings": {},
            "push-to-mute": false,
            "push-to-mute-delay": 0,
            "push-to-talk": false,
            "push-to-talk-delay": 0,
            "settings": {
                "file": "/home/leonardo/Documentos/RoboFEI-SSL/ssl3.jpg"
            },
            "sync": 0,
            "versioned_id": "image_source",
            "volume": 1.0
        },
        {
            "balance": 0.5,
            "deinterlace_field_order": 0,
            "deinterlace_mode": 0,
            "enabled": true,
            "flags": 0,
            "hotkeys": {},
            "id": "text_ft2_source",
            "mixers": 0,
            "monitoring_type": 0,
            "muted": false,
            "name": "Times",
            "prev_ver": 452984833,
            "private_settings": {},
            "push-to-mute": false,
            "push-to-mute-delay": 0,
            "push-to-talk": false,
            "push-to-talk-delay": 0,
            "settings": {
                "antialiasing": true,
                "color1": 4294967295,
                "color2": 4294967295,
                "drop_shadow": false,
                "font": {
                    "face": "Sans Serif",
                    "flags": 0,
                    "size": 256,
                    "style": ""
                },
                "from_file": true,
                "log_lines": 6,
                "outline": false,
                "text": "Teste",
                "word_wrap": false
            },
            "sync": 0,
            "versioned_id": "text_ft2_source_v2",
            "volume": 1.0
        },
        {
            "balance": 0.5,
            "deinterlace_field_order": 0,
            "deinterlace_mode": 0,
            "enabled": true,
            "flags": 0,
            "hotkeys": {},
            "id": "image_source",
            "mixers": 0,
            "monitoring_type": 0,
            "muted": false,
            "name": "overlay_intro",
            "prev_ver": 452984833,
            "private_settings": {},
            "push-to-mute": false,
            "push-to-mute-delay": 0,
            "push-to-talk": false,
            "push-to-talk-delay": 0,
            "settings": {
                "file": "/home/leonardo/Documentos/RoboFEI-SSL/ImagensRobo/Overlay/overlay_ssl_intro.png"
            },
            "sync": 0,
            "versioned_id": "image_source",
            "volume": 1.0
        },
        {
            "balance": 0.5,
            "deinterlace_field_order": 0,
            "deinterlace_mode": 0,
            "enabled": true,
            "flags": 0,
            "hotkeys": {},
            "id": "text_ft2_source",
            "mixers": 0,
            "monitoring_type": 0,
            "muted": false,
            "name": "Countdown",
            "prev_ver": 452984833,
            "private_settings": {},
            "push-to-mute": false,
            "push-to-mute-delay": 0,
            "push-to-talk": false,
            "push-to-talk-delay": 0,
            "settings": {
                "antialiasing": true,
                "color1": 4278190080,
                "color2": 4278190080,
                "drop_shadow": false,
                "font": {
                    "face": "Sans Serif",
                    "flags": 0,
                    "size": 256,
                    "style": ""
                },
                "log_lines": 6,
                "log_mode": false,
                "outline": false,
                "text": "00:04:59",
                "word_wrap": false
            },
            "sync": 0,
            "versioned_id": "text_ft2_source_v2",
            "volume": 1.0
        },
        {
            "balance": 0.5,
            "deinterlace_field_order": 0,
            "deinterlace_mode": 0,
            "enabled": true,
            "flags": 0,
            "hotkeys": {
                "OBSBasic.SelectScene": [],
                "libobs.hide_scene_item.Countdown": [],
                "libobs.hide_scene_item.Grupos": [],
                "libobs.hide_scene_item.Resultados_txt": [],
                "libobs.hide_scene_item.Times": [],
                "libobs.hide_scene_item.fundo": [],
                "libobs.hide_scene_item.overlay_intro": [],
                "libobs.show_scene_item.Countdown": [],
                "libobs.show_scene_item.Grupos": [],
                "libobs.show_scene_item.Resultados_txt": [],
                "libobs.show_scene_item.Times": [],
                "libobs.show_scene_item.fundo": [],
                "libobs.show_scene_item.overlay_intro": []
            },
            "id": "scene",
            "mixers": 0,
            "monitoring_type": 0,
            "muted": false,
            "name": "Intro",
            "prev_ver": 452984833,
            "private_settings": {},
            "push-to-mute": false,
            "push-to-mute-delay": 0,
            "push-to-talk": false,
            "push-to-talk-delay": 0,
            "settings": {
                "custom_size": false,
                "id_counter": 7,
                "items": [
                    {
                        "align": 5,
                        "bounds": {
                            "x": 0.0,
                            "y": 0.0
                        },
                        "bounds_align": 0,
                        "bounds_type": 0,
                        "crop_bottom": 0,
                        "crop_left": 0,
                        "crop_right": 0,
                        "crop_top": 0,
                        "group_item_backup": false,
                        "hide_transition": {
                            "duration": 0
                        },
                        "id": 4,
                        "locked": false,
                        "name": "fundo",
                        "pos": {
                            "x": 0.0,
                            "y": 0.0
                        },
                        "private_settings": {},
                        "rot": 0.0,
                        "scale": {
                            "x": 1.0,
                            "y": 1.0
                        },
                        "scale_filter": "disable",
                        "show_transition": {
                            "duration": 0
                        },
                        "visible": true
                    },
                    {
                        "align": 5,
                        "bounds": {
                            "x": 0.0,
                            "y": 0.0
                        },
                        "bounds_align": 0,
                        "bounds_type": 0,
                        "crop_bottom": 0,
                        "crop_left": 402,
                        "crop_right": 0,
                        "crop_top": 50,
                        "group_item_backup": false,
                        "hide_transition": {
                            "duration": 0
                        },
                        "id": 2,
                        "locked": false,
                        "name": "Countdown",
                        "pos": {
                            "x": 1043.0,
                            "y": 88.0
                        },
                        "private_settings": {},
                        "rot": 0.0,
                        "scale": {
                            "x": 0.2860962450504303,
                            "y": 0.28571429848670959
                        },
                        "scale_filter": "disable",
                        "show_transition": {
                            "duration": 0
                        },
                        "visible": true
                    },
                    {
                        "align": 5,
                        "bounds": {
                            "x": 0.0,
                            "y": 0.0
                        },
                        "bounds_align": 0,
                        "bounds_type": 0,
                        "crop_bottom": 0,
                        "crop_left": 0,
                        "crop_right": 0,
                        "crop_top": 0,
                        "group_item_backup": false,
                        "hide_transition": {
                            "duration": 0
                        },
                        "id": 3,
                        "locked": false,
                        "name": "overlay_intro",
                        "pos": {
                            "x": 0.0,
                            "y": 0.0
                        },
                        "private_settings": {},
                        "rot": 0.0,
                        "scale": {
                            "x": 1.0,
                            "y": 1.0
                        },
                        "scale_filter": "disable",
                        "show_transition": {
                            "duration": 0
                        },
                        "visible": true
                    },
                    {
                        "align": 5,
                        "bounds": {
                            "x": 0.0,
                            "y": 0.0
                        },
                        "bounds_align": 0,
                        "bounds_type": 0,
                        "crop_bottom": 0,
                        "crop_left": 0,
                        "crop_right": 0,
                        "crop_top": 0,
                        "group_item_backup": false,
                        "hide_transition": {
                            "duration": 0
                        },
                        "id": 5,
                        "locked": false,
                        "name": "Times",
                        "pos": {
                            "x": 0.0,
                            "y": 0.0
                        },
                        "private_settings": {},
                        "rot": 0.0,
                        "scale": {
                            "x": 1.0,
                            "y": 1.0
                        },
                        "scale_filter": "disable",
                        "show_transition": {
                            "duration": 0
                        },
                        "visible": true
                    },
                    {
                        "align": 5,
                        "bounds": {
                            "x": 0.0,
                            "y": 0.0
                        },
                        "bounds_align": 0,
                        "bounds_type": 0,
                        "crop_bottom": 0,
                        "crop_left": 0,
                        "crop_right": 0,
                        "crop_top": 0,
                        "group_item_backup": false,
                        "hide_transition": {
                            "duration": 0
                        },
                        "id": 6,
                        "locked": false,
                        "name": "Resultados_txt",
                        "pos": {
                            "x": 1521.0,
                            "y": 101.0
                        },
                        "private_settings": {},
                        "rot": 0.0,
                        "scale": {
                            "x": 0.91206032037734985,
                            "y": 0.91179978847503662
                        },
                        "scale_filter": "disable",
                        "show_transition": {
                            "duration": 0
                        },
                        "visible": true
                    },
                    {
                        "align": 5,
                        "bounds": {
                            "x": 0.0,
                            "y": 0.0
                        },
                        "bounds_align": 0,
                        "bounds_type": 0,
                        "crop_bottom": 0,
                        "crop_left": 0,
                        "crop_right": 0,
                        "crop_top": 0,
                        "group_item_backup": false,
                        "hide_transition": {
                            "duration": 0
                        },
                        "id": 7,
                        "locked": false,
                        "name": "Grupos",
                        "pos": {
                            "x": 218.0,
                            "y": 304.0
                        },
                        "private_settings": {},
                        "rot": 0.0,
                        "scale": {
                            "x": 1.0,
                            "y": 1.0
                        },
                        "scale_filter": "disable",
                        "show_transition": {
                            "duration": 0
                        },
                        "visible": true
                    }
                ]
            },
            "sync": 0,
            "versioned_id": "scene",
            "volume": 1.0
        },
        {
            "balance": 0.5,
            "deinterlace_field_order": 0,
            "deinterlace_mode": 0,
            "enabled": true,
            "flags": 0,
            "hotkeys": {},
            "id": "text_pango_source",
            "mixers": 0,
            "monitoring_type": 0,
            "muted": false,
            "name": "Resultados_txt",
            "prev_ver": 452984833,
            "private_settings": {},
            "push-to-mute": false,
            "push-to-mute-delay": 0,
            "push-to-talk": false,
            "push-to-talk-delay": 0,
            "settings": {
                "color1": 4278190080,
                "drop_shadow": false,
                "encoding.enable": false,
                "font": {
                    "face": "JetBrainsMonoExtraBold Nerd Font",
                    "flags": 1,
                    "size": 36,
                    "style": "Extra Bold"
                },
                "font_file_size": 36,
                "from_file": true,
                "lang.enable": false,
                "log_mode": false,
                "text_file": "/home/leonardo/SSL/Times_overlay/Resultados.txt"
            },
            "sync": 0,
            "versioned_id": "text_pango_source",
            "volume": 1.0
        },
        {
            "balance": 0.5,
            "deinterlace_field_order": 0,
            "deinterlace_mode": 0,
            "enabled": true,
            "flags": 0,
            "hotkeys": {},
            "id": "image_source",
            "mixers": 0,
            "monitoring_type": 0,
            "muted": false,
            "name": "fundo",
            "prev_ver": 452984833,
            "private_settings": {},
            "push-to-mute": false,
            "push-to-mute-delay": 0,
            "push-to-talk": false,
            "push-to-talk-delay": 0,
            "settings": {
                "file": "/home/leonardo/Documentos/RoboFEI-SSL/ImagensRobo/Overlay/fundo.png"
            },
            "sync": 0,
            "versioned_id": "image_source",
            "volume": 1.0
        },
        {
            "balance": 0.5,
            "deinterlace_field_order": 0,
            "deinterlace_mode": 0,
            "enabled": true,
            "flags": 0,
            "hotkeys": {},
            "id": "image_source",
            "mixers": 0,
            "monitoring_type": 0,
            "muted": false,
            "name": "overlay_out",
            "prev_ver": 452984833,
            "private_settings": {},
            "push-to-mute": false,
            "push-to-mute-delay": 0,
            "push-to-talk": false,
            "push-to-talk-delay": 0,
            "settings": {
                "file": "/home/leonardo/Documentos/RoboFEI-SSL/ImagensRobo/Overlay/overlay_ssl_out.png"
            },
            "sync": 0,
            "versioned_id": "image_source",
            "volume": 1.0
        },
        {
            "balance": 0.5,
            "deinterlace_field_order": 0,
            "deinterlace_mode": 0,
            "enabled": true,
            "flags": 0,
            "hotkeys": {
                "OBSBasic.SelectScene": [],
                "libobs.hide_scene_item.Resultados_txt": [],
                "libobs.hide_scene_item.fundo": [],
                "libobs.hide_scene_item.overlay_out": [],
                "libobs.show_scene_item.Resultados_txt": [],
                "libobs.show_scene_item.fundo": [],
                "libobs.show_scene_item.overlay_out": []
            },
            "id": "scene",
            "mixers": 0,
            "monitoring_type": 0,
            "muted": false,
            "name": "Out",
            "prev_ver": 452984833,
            "private_settings": {},
            "push-to-mute": false,
            "push-to-mute-delay": 0,
            "push-to-talk": false,
            "push-to-talk-delay": 0,
            "settings": {
                "custom_size": false,
                "id_counter": 3,
                "items": [
                    {
                        "align": 5,
                        "bounds": {
                            "x": 0.0,
                            "y": 0.0
                        },
                        "bounds_align": 0,
                        "bounds_type": 0,
                        "crop_bottom": 0,
                        "crop_left": 0,
                        "crop_right": 0,
                        "crop_top": 0,
                        "group_item_backup": false,
                        "hide_transition": {
                            "duration": 0
                        },
                        "id": 2,
                        "locked": false,
                        "name": "fundo",
                        "pos": {
                            "x": 0.0,
                            "y": 0.0
                        },
                        "private_settings": {},
                        "rot": 0.0,
                        "scale": {
                            "x": 1.0,
                            "y": 1.0
                        },
                        "scale_filter": "disable",
                        "show_transition": {
                            "duration": 0
                        },
                        "visible": true
                    },
                    {
                        "align": 5,
                        "bounds": {
                            "x": 0.0,
                            "y": 0.0
                        },
                        "bounds_align": 0,
                        "bounds_type": 0,
                        "crop_bottom": 0,
                        "crop_left": 0,
                        "crop_right": 0,
                        "crop_top": 0,
                        "group_item_backup": false,
                        "hide_transition": {
                            "duration": 0
                        },
                        "id": 1,
                        "locked": false,
                        "name": "overlay_out",
                        "pos": {
                            "x": 0.0,
                            "y": 0.0
                        },
                        "private_settings": {},
                        "rot": 0.0,
                        "scale": {
                            "x": 1.0,
                            "y": 1.0
                        },
                        "scale_filter": "disable",
                        "show_transition": {
                            "duration": 0
                        },
                        "visible": true
                    },
                    {
                        "align": 5,
                        "bounds": {
                            "x": 0.0,
                            "y": 0.0
                        },
                        "bounds_align": 0,
                        "bounds_type": 0,
                        "crop_bottom": 0,
                        "crop_left": 0,
                        "crop_right": 0,
                        "crop_top": 0,
                        "group_item_backup": false,
                        "hide_transition": {
                            "duration": 0
                        },
                        "id": 3,
                        "locked": false,
                        "name": "Resultados_txt",
                        "pos": {
                            "x": 1518.0,
                            "y": 103.0
                        },
                        "private_settings": {},
                        "rot": 0.0,
                        "scale": {
                            "x": 0.91457283496856689,
                            "y": 0.91418355703353882
                        },
                        "scale_filter": "disable",
                        "show_transition": {
                            "duration": 0
                        },
                        "visible": true
                    }
                ]
            },
            "sync": 0,
            "versioned_id": "scene",
            "volume": 1.0
        },
        {
            "balance": 0.5,
            "deinterlace_field_order": 0,
            "deinterlace_mode": 0,
            "enabled": true,
            "flags": 0,
            "hotkeys": {
                "OBSBasic.SelectScene": [],
                "libobs.hide_scene_item.FEI-SW": [],
                "libobs.show_scene_item.FEI-SW": []
            },
            "id": "scene",
            "mixers": 0,
            "monitoring_type": 0,
            "muted": false,
            "name": "Gravar",
            "prev_ver": 452984833,
            "private_settings": {},
            "push-to-mute": false,
            "push-to-mute-delay": 0,
            "push-to-talk": false,
            "push-to-talk-delay": 0,
            "settings": {
                "custom_size": false,
                "id_counter": 2,
                "items": [
                    {
                        "align": 5,
                        "bounds": {
                            "x": 1239.0,
                            "y": 712.0
                        },
                        "bounds_align": 0,
                        "bounds_type": 2,
                        "crop_bottom": 0,
                        "crop_left": 0,
                        "crop_right": 0,
                        "crop_top": 0,
                        "group_item_backup": false,
                        "hide_transition": {
                            "duration": 0
                        },
                        "id": 2,
                        "locked": false,
                        "name": "FEI-SW",
                        "pos": {
                            "x": 0.0,
                            "y": 0.0
                        },
                        "private_settings": {},
                        "rot": 0.0,
                        "scale": {
                            "x": 1.0,
                            "y": 1.0
                        },
                        "scale_filter": "disable",
                        "show_transition": {
                            "duration": 0
                        },
                        "visible": true
                    }
                ]
            },
            "sync": 0,
            "versioned_id": "scene",
            "volume": 1.0
        },
        {
            "balance": 0.5,
            "deinterlace_field_order": 0,
            "deinterlace_mode": 0,
            "enabled": true,
            "flags": 0,
            "hotkeys": {},
            "id": "xcomposite_input",
            "mixers": 0,
            "monitoring_type": 0,
            "muted": false,
            "name": "FEI-SW",
            "prev_ver": 452984833,
            "private_settings": {},
            "push-to-mute": false,
            "push-to-mute-delay": 0,
            "push-to-talk": false,
            "push-to-talk-delay": 0,
            "settings": {
                "capture_window": "109051910\r\nRoboFeiSSL\r\nRoboFeiSSL",
                "cut_bot": 32,
                "cut_left": 38,
                "cut_right": 643,
                "cut_top": 259,
                "exclude_alpha": false,
                "include_border": false,
                "lock_x": false,
                "show_cursor": false,
                "swap_redblue": false
            },
            "sync": 0,
            "versioned_id": "xcomposite_input",
            "volume": 1.0
        },
        {
            "balance": 0.5,
            "deinterlace_field_order": 0,
            "deinterlace_mode": 0,
            "enabled": true,
            "flags": 0,
            "hotkeys": {},
            "id": "xcomposite_input",
            "mixers": 0,
            "monitoring_type": 0,
            "muted": false,
            "name": "Window Capture (Xcomposite)",
            "prev_ver": 452984833,
            "private_settings": {},
            "push-to-mute": false,
            "push-to-mute-delay": 0,
            "push-to-talk": false,
            "push-to-talk-delay": 0,
            "settings": {
                "capture_window": "115343371\r\nclock /home/leonardo\r\nkitty"
            },
            "sync": 0,
            "versioned_id": "xcomposite_input",
            "volume": 1.0
        },
        {
            "balance": 0.5,
            "deinterlace_field_order": 0,
            "deinterlace_mode": 0,
            "enabled": true,
            "flags": 0,
            "hotkeys": {
                "OBSBasic.SelectScene": [],
                "libobs.hide_scene_item.Controller": [],
                "libobs.hide_scene_item.FEI-SW": [],
                "libobs.hide_scene_item.UAI-SW": [],
                "libobs.hide_scene_item.Window Capture (Xcomposite)": [],
                "libobs.show_scene_item.Controller": [],
                "libobs.show_scene_item.FEI-SW": [],
                "libobs.show_scene_item.UAI-SW": [],
                "libobs.show_scene_item.Window Capture (Xcomposite)": []
            },
            "id": "scene",
            "mixers": 0,
            "monitoring_type": 0,
            "muted": false,
            "name": "Scene",
            "prev_ver": 452984833,
            "private_settings": {},
            "push-to-mute": false,
            "push-to-mute-delay": 0,
            "push-to-talk": false,
            "push-to-talk-delay": 0,
            "settings": {
                "custom_size": false,
                "id_counter": 5,
                "items": [
                    {
                        "align": 5,
                        "bounds": {
                            "x": 0.0,
                            "y": 0.0
                        },
                        "bounds_align": 0,
                        "bounds_type": 0,
                        "crop_bottom": 0,
                        "crop_left": 0,
                        "crop_right": 0,
                        "crop_top": 0,
                        "group_item_backup": false,
                        "hide_transition": {
                            "duration": 0
                        },
                        "id": 1,
                        "locked": false,
                        "name": "Window Capture (Xcomposite)",
                        "pos": {
                            "x": 1618.0,
                            "y": 0.0
                        },
                        "private_settings": {},
                        "rot": 0.0,
                        "scale": {
                            "x": 0.15729166567325592,
                            "y": 0.15736040472984314
                        },
                        "scale_filter": "disable",
                        "show_transition": {
                            "duration": 0
                        },
                        "visible": false
                    },
                    {
                        "align": 5,
                        "bounds": {
                            "x": 0.0,
                            "y": 0.0
                        },
                        "bounds_align": 0,
                        "bounds_type": 0,
                        "crop_bottom": 0,
                        "crop_left": 0,
                        "crop_right": 0,
                        "crop_top": 0,
                        "group_item_backup": false,
                        "hide_transition": {
                            "duration": 0
                        },
                        "id": 3,
                        "locked": false,
                        "name": "UAI-SW",
                        "pos": {
                            "x": 629.0,
                            "y": 0.0
                        },
                        "private_settings": {},
                        "rot": 0.0,
                        "scale": {
                            "x": 0.94926470518112183,
                            "y": 0.94917124509811401
                        },
                        "scale_filter": "disable",
                        "show_transition": {
                            "duration": 0
                        },
                        "visible": true
                    },
                    {
                        "align": 5,
                        "bounds": {
                            "x": 0.0,
                            "y": 0.0
                        },
                        "bounds_align": 0,
                        "bounds_type": 0,
                        "crop_bottom": 0,
                        "crop_left": 0,
                        "crop_right": 0,
                        "crop_top": 0,
                        "group_item_backup": false,
                        "hide_transition": {
                            "duration": 0
                        },
                        "id": 2,
                        "locked": false,
                        "name": "FEI-SW",
                        "pos": {
                            "x": 790.0,
                            "y": 855.0
                        },
                        "private_settings": {},
                        "rot": 0.0,
                        "scale": {
                            "x": 1.1546763181686401,
                            "y": 1.1538461446762085
                        },
                        "scale_filter": "disable",
                        "show_transition": {
                            "duration": 0
                        },
                        "visible": true
                    },
                    {
                        "align": 5,
                        "bounds": {
                            "x": 0.0,
                            "y": 0.0
                        },
                        "bounds_align": 0,
                        "bounds_type": 0,
                        "crop_bottom": 0,
                        "crop_left": 0,
                        "crop_right": 0,
                        "crop_top": 0,
                        "group_item_backup": false,
                        "hide_transition": {
                            "duration": 0
                        },
                        "id": 5,
                        "locked": false,
                        "name": "Controller",
                        "pos": {
                            "x": 0.0,
                            "y": 0.0
                        },
                        "private_settings": {},
                        "rot": 0.0,
                        "scale": {
                            "x": 1.454965353012085,
                            "y": 1.4543946981430054
                        },
                        "scale_filter": "disable",
                        "show_transition": {
                            "duration": 0
                        },
                        "visible": true
                    }
                ]
            },
            "sync": 0,
            "versioned_id": "scene",
            "volume": 1.0
        },
        {
            "balance": 0.5,
            "deinterlace_field_order": 0,
            "deinterlace_mode": 0,
            "enabled": true,
            "flags": 0,
            "hotkeys": {},
            "id": "xcomposite_input",
            "mixers": 0,
            "monitoring_type": 0,
            "muted": false,
            "name": "UAI-SW",
            "prev_ver": 452984833,
            "private_settings": {},
            "push-to-mute": false,
            "push-to-mute-delay": 0,
            "push-to-talk": false,
            "push-to-talk-delay": 0,
            "settings": {
                "capture_window": "111149066\r\nMainWindow\r\nUaiSystem",
                "cut_bot": 60,
                "cut_left": 280,
                "cut_right": 280,
                "cut_top": 20,
                "swap_redblue": false
            },
            "sync": 0,
            "versioned_id": "xcomposite_input",
            "volume": 1.0
        },
        {
            "balance": 0.5,
            "deinterlace_field_order": 0,
            "deinterlace_mode": 0,
            "enabled": true,
            "flags": 0,
            "hotkeys": {},
            "id": "xcomposite_input",
            "mixers": 0,
            "monitoring_type": 0,
            "muted": false,
            "name": "Controller",
            "prev_ver": 452984833,
            "private_settings": {},
            "push-to-mute": false,
            "push-to-mute-delay": 0,
            "push-to-talk": false,
            "push-to-talk-delay": 0,
            "settings": {
                "capture_window": "83886126\r\nssl-game-controller - Brave\r\nbrave-browser",
                "cut_bot": 300,
                "cut_left": 847,
                "cut_right": 0,
                "cut_top": 102
            },
            "sync": 0,
            "versioned_id": "xcomposite_input",
            "volume": 1.0
        },
        {
            "balance": 0.5,
            "deinterlace_field_order": 0,
            "deinterlace_mode": 0,
            "enabled": true,
            "flags": 0,
            "hotkeys": {
                "OBSBasic.SelectScene": [],
                "libobs.hide_scene_item.Overlay_img": [],
                "libobs.hide_scene_item.Score_amarelo": [],
                "libobs.hide_scene_item.Score_azul": [],
                "libobs.hide_scene_item.Time_amarelo": [],
                "libobs.hide_scene_item.Time_azul": [],
                "libobs.hide_scene_item.Window Capture (Xcomposite) 2": [],
                "libobs.hide_scene_item.fundo": [],
                "libobs.show_scene_item.Overlay_img": [],
                "libobs.show_scene_item.Score_amarelo": [],
                "libobs.show_scene_item.Score_azul": [],
                "libobs.show_scene_item.Time_amarelo": [],
                "libobs.show_scene_item.Time_azul": [],
                "libobs.show_scene_item.Window Capture (Xcomposite) 2": [],
                "libobs.show_scene_item.fundo": []
            },
            "id": "scene",
            "mixers": 0,
            "monitoring_type": 0,
            "muted": false,
            "name": "Jogo",
            "prev_ver": 452984833,
            "private_settings": {},
            "push-to-mute": false,
            "push-to-mute-delay": 0,
            "push-to-talk": false,
            "push-to-talk-delay": 0,
            "settings": {
                "custom_size": false,
                "id_counter": 14,
                "items": [
                    {
                        "align": 5,
                        "bounds": {
                            "x": 0.0,
                            "y": 0.0
                        },
                        "bounds_align": 0,
                        "bounds_type": 0,
                        "crop_bottom": 0,
                        "crop_left": 0,
                        "crop_right": 0,
                        "crop_top": 0,
                        "group_item_backup": false,
                        "hide_transition": {
                            "duration": 0
                        },
                        "id": 9,
                        "locked": false,
                        "name": "fundo",
                        "pos": {
                            "x": 0.0,
                            "y": 0.0
                        },
                        "private_settings": {},
                        "rot": 0.0,
                        "scale": {
                            "x": 1.0,
                            "y": 1.0
                        },
                        "scale_filter": "disable",
                        "show_transition": {
                            "duration": 0
                        },
                        "visible": true
                    },
                    {
                        "align": 5,
                        "bounds": {
                            "x": 0.0,
                            "y": 0.0
                        },
                        "bounds_align": 0,
                        "bounds_type": 0,
                        "crop_bottom": 0,
                        "crop_left": 0,
                        "crop_right": 0,
                        "crop_top": 0,
                        "group_item_backup": false,
                        "hide_transition": {
                            "duration": 0
                        },
                        "id": 2,
                        "locked": false,
                        "name": "Window Capture (Xcomposite) 2",
                        "pos": {
                            "x": 12.0,
                            "y": 154.0
                        },
                        "private_settings": {},
                        "rot": 0.0,
                        "scale": {
                            "x": 1.1555024385452271,
                            "y": 1.4991843700408936
                        },
                        "scale_filter": "disable",
                        "show_transition": {
                            "duration": 0
                        },
                        "visible": true
                    },
                    {
                        "align": 5,
                        "bounds": {
                            "x": 1920.0,
                            "y": 1080.0
                        },
                        "bounds_align": 0,
                        "bounds_type": 2,
                        "crop_bottom": 0,
                        "crop_left": 0,
                        "crop_right": 0,
                        "crop_top": 0,
                        "group_item_backup": false,
                        "hide_transition": {
                            "duration": 0
                        },
                        "id": 1,
                        "locked": false,
                        "name": "Overlay_img",
                        "pos": {
                            "x": 0.0,
                            "y": 0.0
                        },
                        "private_settings": {},
                        "rot": 0.0,
                        "scale": {
                            "x": 1.0,
                            "y": 1.0
                        },
                        "scale_filter": "disable",
                        "show_transition": {
                            "duration": 0
                        },
                        "visible": true
                    },
                    {
                        "align": 5,
                        "bounds": {
                            "x": 0.0,
                            "y": 0.0
                        },
                        "bounds_align": 0,
                        "bounds_type": 0,
                        "crop_bottom": 0,
                        "crop_left": 0,
                        "crop_right": 0,
                        "crop_top": 0,
                        "group_item_backup": false,
                        "hide_transition": {
                            "duration": 0
                        },
                        "id": 11,
                        "locked": false,
                        "name": "Time_azul",
                        "pos": {
                            "x": 20.0,
                            "y": 52.0
                        },
                        "private_settings": {},
                        "rot": 0.0,
                        "scale": {
                            "x": 0.20769231021404266,
                            "y": 0.20769231021404266
                        },
                        "scale_filter": "disable",
                        "show_transition": {
                            "duration": 0
                        },
                        "visible": true
                    },
                    {
                        "align": 5,
                        "bounds": {
                            "x": 0.0,
                            "y": 0.0
                        },
                        "bounds_align": 0,
                        "bounds_type": 0,
                        "crop_bottom": 0,
                        "crop_left": 0,
                        "crop_right": 0,
                        "crop_top": 0,
                        "group_item_backup": false,
                        "hide_transition": {
                            "duration": 0
                        },
                        "id": 12,
                        "locked": false,
                        "name": "Time_amarelo",
                        "pos": {
                            "x": 1234.0,
                            "y": 60.0
                        },
                        "private_settings": {},
                        "rot": 0.0,
                        "scale": {
                            "x": 0.17344589531421661,
                            "y": 0.17307692766189575
                        },
                        "scale_filter": "disable",
                        "show_transition": {
                            "duration": 0
                        },
                        "visible": true
                    },
                    {
                        "align": 5,
                        "bounds": {
                            "x": 0.0,
                            "y": 0.0
                        },
                        "bounds_align": 0,
                        "bounds_type": 0,
                        "crop_bottom": 0,
                        "crop_left": 0,
                        "crop_right": 0,
                        "crop_top": 0,
                        "group_item_backup": false,
                        "hide_transition": {
                            "duration": 0
                        },
                        "id": 13,
                        "locked": false,
                        "name": "Score_azul",
                        "pos": {
                            "x": 282.0,
                            "y": 40.0
                        },
                        "private_settings": {},
                        "rot": 0.0,
                        "scale": {
                            "x": 0.28220859169960022,
                            "y": 0.2807692289352417
                        },
                        "scale_filter": "disable",
                        "show_transition": {
                            "duration": 0
                        },
                        "visible": true
                    },
                    {
                        "align": 5,
                        "bounds": {
                            "x": 0.0,
                            "y": 0.0
                        },
                        "bounds_align": 0,
                        "bounds_type": 0,
                        "crop_bottom": 0,
                        "crop_left": 0,
                        "crop_right": 0,
                        "crop_top": 0,
                        "group_item_backup": false,
                        "hide_transition": {
                            "duration": 0
                        },
                        "id": 14,
                        "locked": false,
                        "name": "Score_amarelo",
                        "pos": {
                            "x": 1144.0,
                            "y": 39.0
                        },
                        "private_settings": {},
                        "rot": 0.0,
                        "scale": {
                            "x": 0.28220859169960022,
                            "y": 0.2807692289352417
                        },
                        "scale_filter": "disable",
                        "show_transition": {
                            "duration": 0
                        },
                        "visible": true
                    }
                ]
            },
            "sync": 0,
            "versioned_id": "scene",
            "volume": 1.0
        },
        {
            "balance": 0.5,
            "deinterlace_field_order": 0,
            "deinterlace_mode": 0,
            "enabled": true,
            "flags": 0,
            "hotkeys": {},
            "id": "image_source",
            "mixers": 0,
            "monitoring_type": 0,
            "muted": false,
            "name": "Overlay_img",
            "prev_ver": 452984833,
            "private_settings": {},
            "push-to-mute": false,
            "push-to-mute-delay": 0,
            "push-to-talk": false,
            "push-to-talk-delay": 0,
            "settings": {
                "file": "/home/leonardo/Documentos/RoboFEI-SSL/ImagensRobo/Overlay/overlay_ssl.png",
                "linear_alpha": false
            },
            "sync": 0,
            "versioned_id": "image_source",
            "volume": 1.0
        },
        {
            "balance": 0.5,
            "deinterlace_field_order": 0,
            "deinterlace_mode": 0,
            "enabled": true,
            "flags": 0,
            "hotkeys": {},
            "id": "xcomposite_input",
            "mixers": 0,
            "monitoring_type": 0,
            "muted": false,
            "name": "Window Capture (Xcomposite) 2",
            "prev_ver": 452984833,
            "private_settings": {},
            "push-to-mute": false,
            "push-to-mute-delay": 0,
            "push-to-talk": false,
            "push-to-talk-delay": 0,
            "settings": {
                "capture_window": "119537674\r\ngrSim\r\ngrSim",
                "cut_bot": 303,
                "cut_left": 842,
                "cut_right": 464,
                "cut_top": 87,
                "exclude_alpha": false,
                "include_border": false,
                "lock_x": false,
                "show_cursor": true,
                "swap_redblue": false
            },
            "sync": 0,
            "versioned_id": "xcomposite_input",
            "volume": 1.0
        }
    ],
    "transition_duration": 300,
    "transitions": []
}
