<?xml version="1.0" encoding="UTF-8" standalone="no"?>
<!-- Created with Inkscape (http://www.inkscape.org/) -->

<svg
   xmlns:dc="http://purl.org/dc/elements/1.1/"
   xmlns:cc="http://creativecommons.org/ns#"
   xmlns:rdf="http://www.w3.org/1999/02/22-rdf-syntax-ns#"
   xmlns:svg="http://www.w3.org/2000/svg"
   xmlns="http://www.w3.org/2000/svg"
   xmlns:sodipodi="http://sodipodi.sourceforge.net/DTD/sodipodi-0.dtd"
   xmlns:inkscape="http://www.inkscape.org/namespaces/inkscape"
   width="115.69701mm"
   height="59.165993mm"
   viewBox="0 0 115.69701 59.165993"
   version="1.1"
   id="svg2999"
   inkscape:version="0.92.5 (2060ec1f9f, 2020-04-08)"
   sodipodi:docname="texto_branco.svg"
   inkscape:export-filename="/home/leonardo/Documentos/RoboFEI-SSL/ImagensRobo/Colorido/letras_remaster_final.png"
   inkscape:export-xdpi="1000"
   inkscape:export-ydpi="1000">
  <defs
     id="defs2993" />
  <sodipodi:namedview
     id="base"
     pagecolor="#474a4c"
     bordercolor="#666666"
     borderopacity="1.0"
     inkscape:pageopacity="0"
     inkscape:pageshadow="2"
     inkscape:zoom="4"
     inkscape:cx="329.95123"
     inkscape:cy="63.247845"
     inkscape:document-units="mm"
     inkscape:current-layer="g2956"
     showgrid="false"
     fit-margin-top="0"
     fit-margin-left="0"
     fit-margin-right="0"
     fit-margin-bottom="0"
     inkscape:window-width="1920"
     inkscape:window-height="1000"
     inkscape:window-x="0"
     inkscape:window-y="44"
     inkscape:window-maximized="1"
     inkscape:snap-global="true"
     inkscape:snap-bbox="true" />
  <metadata
     id="metadata2996">
    <rdf:RDF>
      <cc:Work
         rdf:about="">
        <dc:format>image/svg+xml</dc:format>
        <dc:type
           rdf:resource="http://purl.org/dc/dcmitype/StillImage" />
        <dc:title></dc:title>
      </cc:Work>
    </rdf:RDF>
  </metadata>
  <g
     inkscape:label="Camada 1"
     inkscape:groupmode="layer"
     id="layer1"
     transform="translate(-47.427161,-12.905409)">
    <g
       transform="matrix(1.6913169,0,0,1.6913169,6.865313,-248.27652)"
       id="g2956">
      <path
         inkscape:connector-curvature="0"
         id="path2481"
         d="m 24.358523,180.44851 5.477324,-18.40527 -0.630588,-0.70265 0.01801,-2.61244 1.603497,-2.45028 1.423329,-1.39632 h 9.476845 l 2.43227,2.08094 v 3.89163 l 0.198185,0.22524 h 5.693314 l 0.378354,0.29728 0.378353,-0.29728 h 8.43187 l 0.909849,0.67563 0.909849,-0.67563 h 6.377953 l 0.108101,-1.61255 0.522487,-1.04498 0.612572,-1.02696 0.576538,-0.77473 0.576539,-0.55851 0.864807,-0.88283 0.342319,-0.29725 h 9.080481 l 1.360272,1.25212 v 2.73856 l -0.495452,2.12598 9.548917,-0.018 1.369275,1.35126 0.108097,2.95476 -3.531292,11.9992 3.164156,3.24303 v 0.52378 0.70136 5.54918 l -1.488596,1.72961 H 68.319767 l -1.540436,-1.45936 v -3.0989 h -2.351192 l -1.432334,-1.40533 v -2.47731 h -5.486118 l -1.171093,-0.50448 -1.171093,0.50448 h -8.053517 l -0.720672,-0.50448 -0.720673,0.50448 h -7.044575 l -0.738689,-0.50448 -0.73869,0.50448 h -3.747498 l -0.630588,2.15296 -1.567463,1.6305 h -5.369011 l -1.423329,-1.2702 z"
         style="fill:none;stroke:#ffffff;stroke-width:0.74971166;stroke-linecap:butt;stroke-linejoin:miter;stroke-opacity:1;stroke-miterlimit:4;stroke-dasharray:none"
         sodipodi:nodetypes="cccccccccccccccccccccccccccccccccccccccccccccccccccccccccc" />
      <path
         sodipodi:nodetypes="ccccccccccccccccccccccccccccccccc"
         inkscape:connector-curvature="0"
         id="path2483"
         d="m 30.129658,181.65879 h -2.993856 l 5.996618,-20.54196 h 2.97221 l -1.643436,5.95488 h 1.719875 l 0.586031,-0.59876 1.566997,-5.45265 v -0.42041 l -0.394934,-0.37586 h -6.344427 l 1.783574,-2.79005 h 7.070596 l 0.522333,0.15924 0.445893,0.40768 0.140138,0.33123 -0.02548,1.5033 -2.267686,7.56745 -0.343975,0.64973 -0.369454,0.28028 -0.509593,0.0128 -0.08918,0.28027 0.242057,0.29302 0.242056,0.21658 0.114123,0.77076 -0.101323,0.77076 -2.178508,7.44644 h -3.070295 l 2.140288,-7.35722 0.01274,-0.90453 -0.267536,-0.29936 h -1.261242 z"
         style="fill:#ffffff;fill-opacity:1;stroke:#ffffff;stroke-width:0.74999994px;stroke-linecap:butt;stroke-linejoin:miter;stroke-opacity:1" />
      <path
         style="fill:#ffffff;fill-opacity:1;stroke:#ffffff;stroke-width:4.79428387;stroke-linecap:butt;stroke-linejoin:miter;stroke-miterlimit:4;stroke-dasharray:none;stroke-opacity:1"
         d="M 178.96094 58.636719 C 178.96094 58.636719 152.19094 149.36542 151.78125 150.50391 L 193.70312 150.50391 L 198.54102 148.66602 L 201.53516 144.86523 L 209.71289 116.41797 L 210.28906 109.39258 L 209.36719 107.43359 L 206.14258 105.9375 L 206.60352 103.74805 L 211.20898 103.05859 L 213.85742 100.75391 L 223.30273 68.046875 L 223.41797 62.978516 L 221.68945 59.984375 L 218.11914 58.636719 L 178.96094 58.636719 z M 201.27734 69.416016 L 203.85547 71.447266 L 204.95703 73.876953 L 198.40625 96.451172 L 195.53906 99.896484 L 182.33203 99.900391 L 191.40234 69.419922 L 201.27734 69.416016 z M 191.26367 108.08398 L 193.8418 110.11523 L 194.94336 112.54492 L 188.39258 135.11914 L 185.52539 138.56445 L 172.31836 138.56836 L 181.38867 108.08789 L 191.26367 108.08398 z "
         id="path2521"
         transform="matrix(0.15643629,0,0,0.15643629,23.982406,154.42519)" />
      <path
         style="fill:#ffffff;fill-opacity:1;stroke:#ffffff;stroke-width:4.79428387px;stroke-linecap:butt;stroke-linejoin:miter;stroke-opacity:1"
         d="M 244.68164 58.636719 L 241.99414 60.482422 L 239.63281 62.4375 L 237.92188 64.798828 L 216.25977 140.29102 L 216.17773 146.72461 L 217.5625 148.92383 L 220.33203 150.50391 L 252.98828 150.50391 L 256.00195 149.81836 L 259.42188 147.29492 L 261.70117 143.38477 L 283.68945 67.242188 L 283.60938 63.576172 L 282.30664 60.5625 L 278.72266 58.636719 L 244.68164 58.636719 z M 254.45898 70.154297 L 262.8457 70.25 L 266.28711 71.966797 L 267.12109 75.308594 L 249.85938 133.62305 L 248.68555 136.07617 L 246.27148 139.04297 L 235.58203 138.62891 L 233.08594 136.50781 L 232.81445 132.90625 L 249.43164 75.214844 L 251.43164 71.923828 L 254.45898 70.154297 z "
         id="path2540"
         transform="matrix(0.15643629,0,0,0.15643629,23.982406,154.42519)" />
      <path
         sodipodi:nodetypes="ccccccccc"
         inkscape:connector-curvature="0"
         id="path2544"
         d="m 65.401043,181.82571 6.182839,-20.68696 h 3.17682 l -1.432259,4.94026 h 2.954758 l -0.756705,2.84666 H 72.60777 l -3.891633,12.90004 z"
         style="fill:#ffffff;fill-opacity:1;stroke:#ffffff;stroke-width:0.74999994px;stroke-linecap:butt;stroke-linejoin:miter;stroke-opacity:1" />
      <path
         sodipodi:nodetypes="ccccc"
         inkscape:connector-curvature="0"
         id="path2546"
         d="m 70.121449,160.16951 1.873749,-2.84666 h 7.06259 l -0.720667,2.84666 z"
         style="fill:#fffff0;fill-opacity:1;stroke:#ffffff;stroke-width:0.74999994px;stroke-linecap:butt;stroke-linejoin:miter;stroke-opacity:1" />
      <path
         sodipodi:nodetypes="ccccccccccccc"
         inkscape:connector-curvature="0"
         id="path2548"
         d="m 74.661687,178.1593 4.504206,-14.58461 h 5.513145 l -0.684637,2.37825 h -2.558393 l -1.18911,3.42321 h 2.594423 l -0.648608,2.5584 h -2.594422 l -1.153073,3.53129 h 2.918723 l -1.044975,2.69346 z"
         style="fill:#ffffff;fill-opacity:1;stroke:#ffffff;stroke-width:0.74999994px;stroke-linecap:butt;stroke-linejoin:miter;stroke-opacity:1" />
      <path
         sodipodi:nodetypes="ccccc"
         inkscape:connector-curvature="0"
         id="path2550"
         d="m 82.300818,178.1593 4.360065,-14.58461 h 2.95476 l -4.251968,14.58461 z"
         style="fill:#ffffff;fill-opacity:1;stroke:#ffffff;stroke-width:0.74999994px;stroke-linecap:butt;stroke-linejoin:miter;stroke-opacity:1" />
      <path
         sodipodi:nodetypes="cccccccccccccc"
         inkscape:connector-curvature="0"
         id="path2552"
         d="m 69.419241,185.60176 h 0.961855 l 0.0064,-0.40131 h -1.031924 l 4e-6,-1.45232 1.633881,1.8e-4 -0.0096,0.47137 -0.891787,-0.006 v 0.45863 l 0.891787,0.0127 0.0032,1.43324 H 69.35873 l -0.0032,-0.51597 z"
         style="fill:#ffffff;fill-opacity:1;stroke:#ffffff;stroke-width:0.14999999;stroke-linecap:butt;stroke-linejoin:miter;stroke-miterlimit:4;stroke-dasharray:none;stroke-opacity:0.99843132" />
      <path
         inkscape:connector-curvature="0"
         id="path2554"
         d="m 71.432396,186.08012 0.0054,-2.32501 h 0.783969 l -0.01067,2.36323 -0.783968,0.006 z"
         style="fill:#ffffff;fill-opacity:1;stroke:#ffffff;stroke-width:0.13725096;stroke-linecap:butt;stroke-linejoin:miter;stroke-miterlimit:4;stroke-dasharray:none;stroke-opacity:0.99843132" />
      <path
         inkscape:connector-curvature="0"
         id="path2560"
         d="m 71.448649,183.48633 -0.0064,-0.60514 h 0.738909 l 0.0064,0.60514 z"
         style="fill:#ffffff;fill-opacity:1;stroke:#ffffff;stroke-width:0.14999999;stroke-linecap:butt;stroke-linejoin:miter;stroke-miterlimit:4;stroke-dasharray:none;stroke-opacity:0.99843132" />
      <path
         sodipodi:nodetypes="ccccccccc"
         inkscape:connector-curvature="0"
         id="path2564"
         d="m 72.601922,186.12957 v -2.37155 h 1.789882 v 2.37155 h -0.712752 l 7.14e-4,-1.6009 h -0.453485 v 1.6009 z"
         style="fill:#ffffff;fill-opacity:1;stroke:#ffffff;stroke-width:0.14999999;stroke-linecap:butt;stroke-linejoin:miter;stroke-miterlimit:4;stroke-dasharray:none;stroke-opacity:0.99843132" />
      <path
         sodipodi:nodetypes="cccccccccccccc"
         inkscape:connector-curvature="0"
         id="path2566"
         d="m 76.630019,185.5642 v 0.5657 h -1.683185 l -0.20071,-0.14649 v -2.05199 l 0.20071,-0.19457 h 1.683185 v 0.6923 h -1.026952 l -0.171161,0.18918 v 0.67563 l 0.171161,0.2162 1.026952,-0.009 z"
         style="fill:#ffffff;fill-opacity:1;stroke:#ffffff;stroke-width:0.14999999;stroke-linecap:butt;stroke-linejoin:miter;stroke-miterlimit:4;stroke-dasharray:none;stroke-opacity:0.99843132" />
      <path
         style="fill:#ffffff;fill-opacity:1;stroke:#ffffff;stroke-width:0.95885676;stroke-linecap:butt;stroke-linejoin:miter;stroke-miterlimit:4;stroke-dasharray:none;stroke-opacity:0.99843132"
         d="M 340.26562 187.23438 L 338.82422 188.74219 L 338.82422 201.27344 L 340.26562 202.67969 L 349.98047 202.67969 L 349.98047 198.84766 L 343.55273 198.84766 L 342.97656 198.25195 L 342.97656 197.56055 L 343.55273 196.89258 L 349.08203 196.89258 L 349.98047 195.66797 L 349.98047 188.74219 L 349.08203 187.23438 L 340.26562 187.23438 z M 342.11719 189.89648 L 345.70703 189.89648 L 346.6875 191.02539 L 346.6875 193.08008 L 345.69531 194.1543 L 342.11719 194.1543 L 342.11719 189.89648 z "
         id="path2568"
         transform="matrix(0.15643629,0,0,0.15643629,23.982406,154.42519)" />
      <path
         sodipodi:nodetypes="cccccccccccccccccccccccc"
         inkscape:connector-curvature="0"
         id="path2591"
         d="m 81.078776,183.3466 -0.22671,-0.17076 v -0.38815 l 0.22671,-0.17357 h 1.475174 l 0.18391,0.20767 v 1.70579 l -0.18391,0.22698 h -1.043118 v 0.5656 l 0.280027,0.27257 h 0.868524 l 0.07848,0.1184 v 0.30832 l -0.07848,0.13764 h -1.580604 l -0.22671,-0.32485 v -1.33788 l 0.22671,-0.26699 h 0.805982 l 0.137869,-0.14036 v -0.56708 l -0.137869,-0.17349 z"
         style="fill:#ffffff;fill-opacity:1;stroke:#ffffff;stroke-width:0.14999999;stroke-linecap:butt;stroke-linejoin:miter;stroke-miterlimit:4;stroke-dasharray:none;stroke-opacity:0.99843132" />
      <path
         style="fill:#ffffff;fill-opacity:1;stroke:#ffffff;stroke-width:0.95885676;stroke-linecap:butt;stroke-linejoin:miter;stroke-miterlimit:4;stroke-dasharray:none;stroke-opacity:0.99843132"
         d="M 380.39258 180.1543 L 378.96289 181.76953 L 378.96289 201.02344 L 380.39258 202.56055 L 388.15234 202.56055 L 389.66211 201.02344 L 389.66211 181.76953 L 388.15234 180.1543 L 380.39258 180.1543 z M 382.82422 183.35352 L 386.13281 183.35352 L 386.83203 185.10742 L 386.83203 197.27539 L 386.125 198.97852 L 382.83984 198.97852 L 382.16406 197.27539 L 382.16406 185.12305 L 382.82422 183.35352 z "
         transform="matrix(0.15643629,0,0,0.15643629,23.982406,154.42519)"
         id="path2593" />
      <path
         style="fill:#ffffff;fill-opacity:1;stroke:#ffffff;stroke-width:0.95885676;stroke-linecap:butt;stroke-linejoin:miter;stroke-miterlimit:4;stroke-dasharray:none;stroke-opacity:0.99843132"
         d="M 394.30469 179.97656 L 392.875 181.5918 L 392.875 200.8457 L 394.30469 202.38281 L 402.06641 202.38281 L 403.57422 200.8457 L 403.57422 181.5918 L 402.06641 179.97656 L 394.30469 179.97656 z M 396.69727 183.2168 L 400.00586 183.2168 L 400.70508 184.9707 L 400.70508 197.13867 L 399.99805 198.8418 L 396.71289 198.8418 L 396.03711 197.13867 L 396.03711 184.98633 L 396.69727 183.2168 z "
         transform="matrix(0.15643629,0,0,0.15643629,23.982406,154.42519)"
         id="path2593-0" />
      <path
         sodipodi:nodetypes="ccccccccccccccccccccccccc"
         inkscape:connector-curvature="0"
         id="path2910"
         d="m 87.545915,185.61157 v 0.26516 l 0.128595,0.16159 h 1.545222 l 0.169873,-0.22373 v -3.02867 l -0.169873,-0.21338 H 87.67451 l -0.128595,0.21338 v 0.23204 l 0.138975,0.1823 h 0.822415 l 0.145011,0.21545 v 0.37288 l -0.145011,0.21117 H 87.68489 l -0.138975,0.10758 v 0.32731 l 0.128638,0.13673 h 0.832752 l 0.145011,0.21544 v 0.41019 l -0.145011,0.25484 h -0.766507 z"
         style="fill:#ffffff;fill-opacity:1;stroke:#ffffff;stroke-width:0.14999999;stroke-linecap:butt;stroke-linejoin:miter;stroke-miterlimit:4;stroke-dasharray:none;stroke-opacity:0.99843132" />
      <path
         style="fill:#ffffff;fill-opacity:1;stroke:#ffffff;stroke-width:4.79428387px;stroke-linecap:butt;stroke-linejoin:miter;stroke-opacity:1"
         d="M 123.70703 58.636719 L 121.01953 60.478516 L 118.6582 62.433594 L 116.94727 64.794922 L 95.285156 140.28711 L 95.203125 146.7207 L 96.587891 148.91992 L 99.357422 150.50391 L 132.01367 150.50391 L 135.02734 149.81641 L 138.44727 147.29102 L 140.72656 143.38281 L 162.71484 67.238281 L 162.63477 63.574219 L 161.33008 60.560547 L 157.74805 58.636719 L 123.70703 58.636719 z M 133.36328 70.414062 L 141.74805 70.507812 L 145.18945 72.226562 L 146.02539 75.568359 L 128.76367 133.88281 L 127.58984 136.33594 L 125.17578 139.30273 L 114.48633 138.88867 L 111.99023 136.76562 L 111.71875 133.16406 L 128.33594 75.474609 L 130.33594 72.181641 L 133.36328 70.414062 z "
         id="path2540-1"
         transform="matrix(0.15643629,0,0,0.15643629,23.982406,154.42519)" />
    </g>
  </g>
</svg>
