\BOOKMARK [1][-]{section.1}{\376\377\000I\000n\000t\000r\000o\000d\000u\000\347\000\343\000o\000\040\000a\000o\000\040\000D\000e\000v\000O\000p\000s}{}% 1
\BOOKMARK [1][-]{section.2}{\376\377\000C\000o\000n\000f\000i\000g\000u\000r\000a\000\347\000\343\000o\000\040\000d\000a\000\040\000o\000r\000g\000a\000n\000i\000z\000a\000\347\000\343\000o\000\040\000s\000s\000l\000R\000o\000b\000o\000F\000E\000I}{}% 2
\BOOKMARK [2][-]{subsection.2.1}{\376\377\000A\000l\000t\000e\000r\000a\000n\000d\000o\000\040\000o\000\040\000n\000o\000m\000e}{section.2}% 3
\BOOKMARK [2][-]{subsection.2.2}{\376\377\000D\000e\000l\000e\000t\000a\000r\000\040\000o\000r\000g\000a\000n\000i\000z\000a\000\347\000\343\000o}{section.2}% 4
\BOOKMARK [2][-]{subsection.2.3}{\376\377\000G\000e\000r\000e\000n\000c\000i\000a\000m\000e\000n\000t\000o\000\040\000d\000e\000\040\000p\000r\000o\000j\000e\000t\000o\000s}{section.2}% 5
\BOOKMARK [2][-]{subsection.2.4}{\376\377\000A\000d\000i\000c\000i\000o\000n\000a\000n\000d\000o\000\040\000n\000o\000v\000o\000s\000\040\000m\000e\000m\000b\000r\000o\000s}{section.2}% 6
\BOOKMARK [2][-]{subsection.2.5}{\376\377\000R\000e\000m\000o\000v\000e\000n\000d\000o\000\040\000m\000e\000m\000b\000r\000o\000s}{section.2}% 7
\BOOKMARK [1][-]{section.3}{\376\377\000C\000o\000n\000f\000i\000g\000u\000r\000a\000\347\000\365\000e\000s\000\040\000d\000o\000\040\000p\000r\000o\000j\000e\000t\000o\000\040\000R\000o\000b\000o\000F\000E\000I\000\040\000-\000\040\000S\000S\000L}{}% 8
\BOOKMARK [2][-]{subsection.3.1}{\376\377\000A\000l\000t\000e\000r\000a\000n\000d\000o\000\040\000o\000\040\000n\000o\000m\000e}{section.3}% 9
\BOOKMARK [2][-]{subsection.3.2}{\376\377\000A\000d\000m\000i\000n\000i\000s\000t\000r\000a\000d\000o\000r\000e\000s\000\040\000d\000o\000\040\000p\000r\000o\000j\000e\000t\000o}{section.3}% 10
\BOOKMARK [2][-]{subsection.3.3}{\376\377\000D\000e\000l\000e\000t\000a\000r\000\040\000o\000r\000g\000a\000n\000i\000z\000a\000\347\000\343\000o}{section.3}% 11
\BOOKMARK [2][-]{subsection.3.4}{\376\377\000G\000e\000r\000e\000n\000c\000i\000a\000m\000e\000n\000t\000o\000\040\000d\000e\000\040\000t\000i\000m\000e\000s}{section.3}% 12
\BOOKMARK [2][-]{subsection.3.5}{\376\377\000A\000d\000i\000c\000i\000o\000n\000a\000n\000d\000o\000\040\000n\000o\000v\000o\000s\000\040\000m\000e\000m\000b\000r\000o\000s}{section.3}% 13
\BOOKMARK [2][-]{subsection.3.6}{\376\377\000R\000e\000m\000o\000v\000e\000n\000d\000o\000\040\000m\000e\000m\000b\000r\000o\000s}{section.3}% 14
\BOOKMARK [2][-]{subsection.3.7}{\376\377\000P\000e\000r\000m\000i\000s\000s\000\365\000e\000s\000\040\000d\000e\000\040\000m\000e\000m\000b\000r\000o\000s}{section.3}% 15
\BOOKMARK [2][-]{subsection.3.8}{\376\377\000O\000\040\000c\000o\000n\000c\000e\000i\000t\000o\000\040\000d\000e\000\040\000S\000p\000r\000i\000n\000t\000s}{section.3}% 16
\BOOKMARK [2][-]{subsection.3.9}{\376\377\000\301\000r\000e\000a\000s\000\040\000d\000o\000\040\000p\000r\000o\000j\000e\000t\000o\000\040\000S\000S\000L}{section.3}% 17
\BOOKMARK [1][-]{section.4}{\376\377\000G\000e\000r\000e\000n\000c\000i\000a\000n\000d\000o\000\040\000a\000s\000\040\000t\000a\000r\000e\000f\000a\000s}{}% 18
\BOOKMARK [2][-]{subsection.4.1}{\376\377\000V\000i\000s\000\343\000o\000\040\000g\000e\000r\000a\000l}{section.4}% 19
\BOOKMARK [3][-]{subsubsection.4.1.1}{\376\377\000D\000a\000s\000h\000b\000o\000a\000r\000d\000s}{subsection.4.1}% 20
\BOOKMARK [3][-]{subsubsection.4.1.2}{\376\377\000W\000i\000k\000i}{subsection.4.1}% 21
\BOOKMARK [2][-]{subsection.4.2}{\376\377\000C\000r\000i\000a\000\347\000\343\000o\000\040\000e\000\040\000a\000t\000r\000i\000b\000u\000i\000\347\000\343\000o\000\040\000d\000e\000\040\000t\000a\000r\000e\000f\000a\000s}{section.4}% 22
\BOOKMARK [3][-]{subsubsection.4.2.1}{\376\377\000W\000o\000r\000k\000\040\000i\000t\000e\000m\000s}{subsection.4.2}% 23
\BOOKMARK [2][-]{subsection.4.3}{\376\377\000O\000u\000t\000r\000a\000s\000\040\000o\000p\000\347\000\365\000e\000s}{section.4}% 24
\BOOKMARK [1][-]{section.5}{\376\377\000C\000o\000n\000s\000i\000d\000e\000r\000a\000\347\000\365\000e\000s\000\040\000f\000i\000n\000a\000i\000s}{}% 25
