\relax 
\providecommand\hyper@newdestlabel[2]{}
\providecommand\HyField@AuxAddToFields[1]{}
\providecommand\HyField@AuxAddToCoFields[2]{}
\providecommand\babel@aux[2]{}
\@nameuse{bbl@beforestart}
\catcode `"\active 
\abx@aux@refcontext{nty/global//global/global/global}
\babel@aux{portuguese}{}
\@writefile{lol}{\contentsline {lstlisting}{\numberline {1}{\ignorespaces Exemplo do código do exercício.}}{1}{lstlisting.1}\protected@file@percent }
\@writefile{lol}{\contentsline {lstlisting}{\numberline {2}{\ignorespaces Trecho para utilizar no execPar - para desenhar as linhas do grafico}}{2}{lstlisting.2}\protected@file@percent }
\abx@aux@read@bbl@mdfivesum{E75D7E0DB03F09D45B25DF2F538BB294}
\gdef \@abspage@last{2}
