(footprint "EA_DOGM204" (version 20211014) (generator pcbnew)
  (layer "F.Cu")
  (tedit 0)
  (descr "LCD 20x4")
  (attr through_hole)
  (fp_text reference "LCD**" (at -34.29 -15.24 90 unlocked) (layer "F.SilkS")
    (effects (font (size 1 1) (thickness 0.15)))
    (tstamp d8327e30-cd6c-4a9a-8ba3-60c105ed6a85)
  )
  (fp_text value "EA_DOGM204" (at 0 -5.08 unlocked) (layer "F.Fab")
    (effects (font (size 1 1) (thickness 0.15)))
    (tstamp 56b34a97-9cd5-4310-9c24-7ac9a661c710)
  )
  (fp_text user "${REFERENCE}" (at 0 2.5 unlocked) (layer "F.Fab")
    (effects (font (size 1 1) (thickness 0.15)))
    (tstamp fb8d33dc-4c0e-4148-81b3-3b18a50b7f0d)
  )
  (fp_rect (start -33 -19.05) (end 33 19.05) (layer "F.SilkS") (width 0.12) (fill none) (tstamp 8fb1832b-146e-462f-a9ca-4248b1aee8f1))
  (pad "1" thru_hole circle (at -26.67 19.05) (size 1.524 1.524) (drill 0.762) (layers *.Cu *.Mask) (tstamp 6d5bafc8-1a7f-4b82-b6ae-db5d4f097d03))
  (pad "2" thru_hole circle (at -24.13 19.05) (size 1.524 1.524) (drill 0.762) (layers *.Cu *.Mask) (tstamp 39839fac-7007-4c4a-95df-6543b4d26373))
  (pad "3" thru_hole circle (at -21.59 19.05) (size 1.524 1.524) (drill 0.762) (layers *.Cu *.Mask) (tstamp 26228fd9-9577-4eca-84d2-e1c9437612c6))
  (pad "20" thru_hole circle (at 21.59 19.05) (size 1.524 1.524) (drill 0.762) (layers *.Cu *.Mask) (tstamp 9dc5be97-43d3-444b-aba6-50f0b08cef6c))
  (pad "21" thru_hole circle (at 24.13 19.05) (size 1.524 1.524) (drill 0.762) (layers *.Cu *.Mask) (tstamp b43e2144-0e1b-49c1-9c3e-f62af326cf56))
  (pad "22" thru_hole circle (at 26.67 19.05) (size 1.524 1.524) (drill 0.762) (layers *.Cu *.Mask) (tstamp 1cc74e91-0884-44db-a28c-3a8777ef2e95))
  (pad "23" thru_hole circle (at 26.67 -19.05) (size 1.524 1.524) (drill 0.762) (layers *.Cu *.Mask) (tstamp 3de82907-10f9-49e2-a79b-fd95dace03f8))
  (pad "24" thru_hole circle (at 24.13 -19.05) (size 1.524 1.524) (drill 0.762) (layers *.Cu *.Mask) (tstamp 5dda7606-b759-4402-bb28-391f66b7f974))
  (pad "25" thru_hole circle (at 21.59 -19.05) (size 1.524 1.524) (drill 0.762) (layers *.Cu *.Mask) (tstamp 8bdd7f36-cf70-4fad-b1f8-f41bf4cdcfa4))
  (pad "26" thru_hole circle (at 19.05 -19.05) (size 1.524 1.524) (drill 0.762) (layers *.Cu *.Mask) (tstamp 4d5fdee9-3dfe-478f-8151-e43811a6eb4a))
  (pad "27" thru_hole circle (at 16.51 -19.05) (size 1.524 1.524) (drill 0.762) (layers *.Cu *.Mask) (tstamp d3bdff19-e6e6-4297-87bb-53d0c9b4289b))
  (pad "28" thru_hole circle (at 13.97 -19.05) (size 1.524 1.524) (drill 0.762) (layers *.Cu *.Mask) (tstamp 3fa14a1e-0d57-4a93-985f-a06407264924))
  (pad "29" thru_hole circle (at 11.43 -19.05) (size 1.524 1.524) (drill 0.762) (layers *.Cu *.Mask) (tstamp 384169ca-1950-4861-821b-699cdcd504b4))
  (pad "30" thru_hole circle (at 8.89 -19.05) (size 1.524 1.524) (drill 0.762) (layers *.Cu *.Mask) (tstamp 24fb3819-9b59-4ddc-94e8-567d03bf8544))
  (pad "31" thru_hole circle (at 6.35 -19.05) (size 1.524 1.524) (drill 0.762) (layers *.Cu *.Mask) (tstamp b2fcff2e-1be2-4b7d-9043-f1ba937382f5))
  (pad "32" thru_hole circle (at 3.81 -19.05) (size 1.524 1.524) (drill 0.762) (layers *.Cu *.Mask) (tstamp f550a225-bbd7-44a1-85c2-818fee27eee0))
  (pad "33" thru_hole circle (at 1.27 -19.05) (size 1.524 1.524) (drill 0.762) (layers *.Cu *.Mask) (tstamp dbbc7a75-ffdb-4d25-af35-34270f9f32b9))
  (pad "34" thru_hole circle (at -1.27 -19.05) (size 1.524 1.524) (drill 0.762) (layers *.Cu *.Mask) (tstamp 63938037-ce42-4289-a2ff-599316523041))
  (pad "35" thru_hole circle (at -3.81 -19.05) (size 1.524 1.524) (drill 0.762) (layers *.Cu *.Mask) (tstamp 058f4007-4891-4cb8-9842-86614c99f7cd))
  (pad "36" thru_hole circle (at -6.35 -19.05) (size 1.524 1.524) (drill 0.762) (layers *.Cu *.Mask) (tstamp 15e7650a-d5a3-4036-9e25-b19437a0d1ae))
  (pad "37" thru_hole circle (at -8.89 -19.05) (size 1.524 1.524) (drill 0.762) (layers *.Cu *.Mask) (tstamp 916e5386-53c7-414f-8878-e2fe43ce2ccc))
  (pad "38" thru_hole circle (at -11.43 -19.05) (size 1.524 1.524) (drill 0.762) (layers *.Cu *.Mask) (tstamp 07d5aa62-accf-4c24-9de4-8ced46c5ebc1))
  (pad "39" thru_hole circle (at -13.97 -19.05) (size 1.524 1.524) (drill 0.762) (layers *.Cu *.Mask) (tstamp 2275df15-79f2-4607-8a89-62e6e6eb4515))
  (pad "40" thru_hole circle (at -16.51 -19.05) (size 1.524 1.524) (drill 0.762) (layers *.Cu *.Mask) (tstamp a1aa1ec5-f298-41b4-9a79-6007c6edc25c))
  (pad "41" thru_hole circle (at -19.05 -19.05) (size 1.524 1.524) (drill 0.762) (layers *.Cu *.Mask) (tstamp a51731c0-ef53-4dc2-ba42-4e3093caeb7c))
  (pad "42" thru_hole circle (at -21.59 -19.05) (size 1.524 1.524) (drill 0.762) (layers *.Cu *.Mask) (tstamp 61643329-6bc8-4e69-b0c2-3b85a0e44517))
  (pad "43" thru_hole circle (at -24.13 -19.05) (size 1.524 1.524) (drill 0.762) (layers *.Cu *.Mask) (tstamp 9f8bbef4-1273-4120-9167-61e1ddeee10b))
  (pad "44" thru_hole circle (at -26.67 -19.05) (size 1.524 1.524) (drill 0.762) (layers *.Cu *.Mask) (tstamp 680daf45-e80f-48ad-8746-d88046721ae4))
)
