(footprint "R-785.0-1.0-SIP3" (version 20211014) (generator pcbnew)
  (layer "F.Cu")
  (tedit 0)
  (descr "Recom R-785.0-1.0 Switching Regulator, 5 V, 1 A")
  (tags "regulator")
  (attr through_hole)
  (fp_text reference "REF**" (at 0 3.35 unlocked) (layer "F.SilkS")
    (effects (font (size 1 1) (thickness 0.15)))
    (tstamp 971398cb-8e6d-43b3-91d3-9cdaa2e2ccd4)
  )
  (fp_text value "R-785.0-1.0" (at 0 4.85 unlocked) (layer "F.Fab")
    (effects (font (size 1 1) (thickness 0.15)))
    (tstamp f85e58fa-2716-4096-a003-70d2f4923c04)
  )
  (fp_text user "Vout" (at 2.54 -1.27 90 unlocked) (layer "F.SilkS")
    (effects (font (size 1 1) (thickness 0.15)) (justify left))
    (tstamp 581e360b-3824-4315-a3b2-a59cbdbef665)
  )
  (fp_text user "Vin" (at -2.54 -1.27 90 unlocked) (layer "F.SilkS")
    (effects (font (size 1 1) (thickness 0.15)) (justify left))
    (tstamp 7a754f56-324a-46f2-9420-0c6c0d30c8fb)
  )
  (fp_text user "Gnd" (at 0 -1.27 90 unlocked) (layer "F.SilkS")
    (effects (font (size 1 1) (thickness 0.15)) (justify left))
    (tstamp 7a868be2-f91f-4627-9518-7f900a949fff)
  )
  (fp_text user "${REFERENCE}" (at 0 6.35 unlocked) (layer "F.Fab")
    (effects (font (size 1 1) (thickness 0.15)))
    (tstamp 2675523a-7718-4913-9825-5d1845a0b9e7)
  )
  (fp_rect (start -5.75 -5.55) (end 5.75 2) (layer "F.SilkS") (width 0.12) (fill none) (tstamp cb4a2763-210e-4dbb-9284-7b371e020ce4))
  (pad "1" thru_hole circle (at -2.54 0) (size 1.524 1.524) (drill 0.762) (layers *.Cu *.Mask) (tstamp 18c53f9d-ec5c-499b-9bab-4d386200f8a9))
  (pad "2" thru_hole circle (at 0 0) (size 1.524 1.524) (drill 0.762) (layers *.Cu *.Mask) (tstamp 1fcf1641-4375-4f8b-adcd-176bbba6d5ac))
  (pad "3" thru_hole circle (at 2.54 0) (size 1.524 1.524) (drill 0.762) (layers *.Cu *.Mask) (tstamp cd0eec0e-519f-48fd-bb50-4f1303252e6e))
)
