[
  {
    "eventType": "DELAYED_MESSAGE_POSTED",
    "timestamp": 1566742052939,
    "actionCode": -1,
    "delayTime": 1000,
    "canScrollTo": false,
    "elementDescriptors": []
  },
  {
    "eventType": "VIEW_CLICKED",
    "timestamp": 1566742060638,
    "replacementText": "Button3",
    "actionCode": -1,
    "delayTime": 0,
    "canScrollTo": false,
    "elementDescriptors": [
      {
        "className": "android.widget.Button",
        "recyclerViewChildPosition": -1,
        "adapterViewChildPosition": -1,
        "groupViewChildPosition": 0,
        "resourceId": "",
        "contentDescription": "",
        "text": "Button3"
      },
      {
        "className": "android.widget.AbsoluteLayout",
        "recyclerViewChildPosition": -1,
        "adapterViewChildPosition": -1,
        "groupViewChildPosition": 1,
        "resourceId": "",
        "contentDescription": "",
        "text": ""
      },
      {
        "className": "com.unity3d.player.UnityPlayer",
        "recyclerViewChildPosition": -1,
        "adapterViewChildPosition": -1,
        "groupViewChildPosition": 0,
        "resourceId": "",
        "contentDescription": "",
        "text": ""
      }
    ]
  },
  {
    "eventType": "VIEW_CLICKED",
    "timestamp": 1566742065624,
    "replacementText": "Button2",
    "actionCode": -1,
    "delayTime": 0,
    "canScrollTo": false,
    "elementDescriptors": [
      {
        "className": "android.widget.Button",
        "recyclerViewChildPosition": -1,
        "adapterViewChildPosition": -1,
        "groupViewChildPosition": 1,
        "resourceId": "",
        "contentDescription": "",
        "text": "Button2"
      },
      {
        "className": "android.widget.AbsoluteLayout",
        "recyclerViewChildPosition": -1,
        "adapterViewChildPosition": -1,
        "groupViewChildPosition": 1,
        "resourceId": "",
        "contentDescription": "",
        "text": ""
      },
      {
        "className": "com.unity3d.player.UnityPlayer",
        "recyclerViewChildPosition": -1,
        "adapterViewChildPosition": -1,
        "groupViewChildPosition": 0,
        "resourceId": "",
        "contentDescription": "",
        "text": ""
      }
    ]
  },
  {
    "eventType": "VIEW_CLICKED",
    "timestamp": 1566742070219,
    "replacementText": "Button1",
    "actionCode": -1,
    "delayTime": 0,
    "canScrollTo": false,
    "elementDescriptors": [
      {
        "className": "android.widget.Button",
        "recyclerViewChildPosition": -1,
        "adapterViewChildPosition": -1,
        "groupViewChildPosition": 2,
        "resourceId": "",
        "contentDescription": "",
        "text": "Button1"
      },
      {
        "className": "android.widget.AbsoluteLayout",
        "recyclerViewChildPosition": -1,
        "adapterViewChildPosition": -1,
        "groupViewChildPosition": 1,
        "resourceId": "",
        "contentDescription": "",
        "text": ""
      },
      {
        "className": "com.unity3d.player.UnityPlayer",
        "recyclerViewChildPosition": -1,
        "adapterViewChildPosition": -1,
        "groupViewChildPosition": 0,
        "resourceId": "",
        "contentDescription": "",
        "text": ""
      }
    ]
  }
]