%YAML 1.1
%TAG !u! tag:unity3d.com,2011:
--- !u!114 &11400000
MonoBehaviour:
  m_ObjectHideFlags: 0
  m_CorrespondingSourceObject: {fileID: 0}
  m_PrefabInstance: {fileID: 0}
  m_PrefabAsset: {fileID: 0}
  m_GameObject: {fileID: 0}
  m_Enabled: 1
  m_EditorHideFlags: 0
  m_Script: {fileID: 11500000, guid: bbb281ee3bf0b054c82ac2347e9e782c, type: 3}
  m_Name: FirebaseStorageGroup
  m_EditorClassIdentifier: 
  m_GroupName: FirebaseStorageGroup
  m_Data:
    m_SerializedData: []
  m_GUID: 42a0a20f503534f5c882078aa85d6106
  m_SerializeEntries:
  - m_GUID: 0e4ff081d05124b69bb4e3d3d9faa6cf
    m_Address: Assets/Textures/RemoteImage.jpg
    m_ReadOnly: 0
    m_SerializedLabels: []
  m_ReadOnly: 0
  m_Settings: {fileID: 11400000, guid: e51a99209da4145f9abd51489af1307d, type: 2}
  m_SchemaSet:
    m_Schemas:
    - {fileID: 11400000, guid: 2ea2a70ae3d8e4ed3beff5cf2e6338c3, type: 2}
    - {fileID: 11400000, guid: ec21f32503336403cb65b0493f1fe49f, type: 2}
