%YAML 1.1
%TAG !u! tag:unity3d.com,2011:
--- !u!114 &11400000
MonoBehaviour:
  m_ObjectHideFlags: 0
  m_CorrespondingSourceObject: {fileID: 0}
  m_PrefabInstance: {fileID: 0}
  m_PrefabAsset: {fileID: 0}
  m_GameObject: {fileID: 0}
  m_Enabled: 1
  m_EditorHideFlags: 0
  m_Script: {fileID: 11500000, guid: e5d17a21594effb4e9591490b009e7aa, type: 3}
  m_Name: 03ef5aff1261f435fa1fd09849e20ffe_BundledAssetGroupSchema
  m_EditorClassIdentifier: 
  m_Group: {fileID: 11400000, guid: 7d2618ebe15de4fdda610e4a7dde4515, type: 2}
  m_Compression: 1
  m_IncludeInBuild: 1
  m_BundledAssetProviderType:
    m_AssemblyName: Unity.ResourceManager, Version=0.0.0.0, Culture=neutral, PublicKeyToken=null
    m_ClassName: UnityEngine.ResourceManagement.ResourceProviders.BundledAssetProvider
  m_ForceUniqueProvider: 0
  m_UseAssetBundleCache: 1
  m_UseAssetBundleCrc: 1
  m_Timeout: 0
  m_ChunkedTransfer: 0
  m_RedirectLimit: -1
  m_RetryCount: 0
  m_BuildPath:
    m_Id: 55ba2d310f6d44936bdc8f2ec226c8c3
  m_LoadPath:
    m_Id: 25521ea8ef3614332a1f9904e7bd0da4
  m_BundleMode: 1
  m_AssetBundleProviderType:
    m_AssemblyName: RobinBird.FirebaseTools, Version=0.0.0.0, Culture=neutral, PublicKeyToken=null
    m_ClassName: RobinBird.FirebaseTools.Storage.Addressables.FirebaseStorageAssetBundleProvider
  m_BundleNaming: 1
