{
    "_id": "uwJQUFLymAWtJu1a",
    "data": {
        "actionCategory": {
            "value": ""
        },
        "actionType": {
            "value": "passive"
        },
        "actions": {
            "value": ""
        },
        "description": {
            "chat": "",
            "unidentified": "",
            "value": "<p><span id=\"ctl00_MainContent_DetailedOutput\"><strong>Prerequisites</strong> expert in Athletics, Pathfinder Agent Dedication<br></span></p>\n<hr>\n<p>You are trained to preserve the archaeological value of your location when entering. You don't take a penalty to Force Open doors, windows, or containers without a crowbar. If you roll a success on a check to Force Open, you get a critical success instead.&nbsp;</p>"
        },
        "featType": {
            "value": "archetype"
        },
        "level": {
            "value": "6"
        },
        "prerequisites": {
            "value": "expert in Athletics, Pathfinder Agent Dedication"
        },
        "rarity": {
            "value": "common"
        },
        "source": {
            "value": ""
        },
        "traits": {
            "custom": "",
            "rarity": {
                "value": "uncommon"
            },
            "value": [
                "uncommon",
                "skill",
                "archetype"
            ]
        },
        "usage": {
            "value": "held-in-one-hand"
        }
    },
    "flags": {},
    "img": "systems/pf2e/icons/features/feats/feats.jpg",
    "name": "Forced Entry",
    "permission": {
        "default": 0
    },
    "type": "feat"
}
