{
    "_id": "pKnX7MGZayqZui0Z",
    "data": {
        "actionCategory": {
            "value": ""
        },
        "actionType": {
            "value": "passive"
        },
        "actions": {
            "value": ""
        },
        "description": {
            "chat": "",
            "unidentified": "",
            "value": "<p><strong>Prerequisites</strong> Master in Acrobatics</p>\n<hr>\n<p>You move with grace in flight and can perform amazing aerial stunts.</p>\n<p>You gain a +2 circumstance bonus to Acrobatics checks to @Compendium[pf2e.actionspf2e.Qf1ylAbdVi1rkc8M]{Maneuver in Flight} and can combine two maneuvers into a single action, such as reversing direction while making a steep ascent or descent or hovering in gale-force winds. The DC of the Acrobatics check is equal to the DC of the most difficult maneuver + 5.</p>\n<p>If you're legendary in Acrobatics, you can combine three such maneuvers into a single action; the DC of the Acrobatics check is equal to the DC of the most difficult maneuver + 10. Regardless of the combination, these maneuvers rarely allow you to move farther than your @Compendium[pf2e.actionspf2e.cS9nfDRGD83bNU1p]{Fly} Speed.</p>"
        },
        "featType": {
            "value": "skill"
        },
        "level": {
            "value": "7"
        },
        "prerequisites": {
            "value": "master in Acrobatics"
        },
        "rarity": {
            "value": "common"
        },
        "source": {
            "value": ""
        },
        "traits": {
            "rarity": {
                "value": "common"
            },
            "value": [
                "general",
                "skill"
            ]
        },
        "usage": {
            "value": ""
        }
    },
    "flags": {},
    "img": "systems/pf2e/icons/features/feats/feats.jpg",
    "name": "Aerobatics Mastery",
    "permission": {
        "default": 0
    },
    "type": "feat"
}
