{
    "_id": "znMvKqcRDilIVMwA",
    "data": {
        "ability": {
            "value": ""
        },
        "area": {
            "areaType": "",
            "value": null
        },
        "areasize": {
            "value": ""
        },
        "components": {
            "value": "somatic, verbal"
        },
        "cost": {
            "value": ""
        },
        "damage": {
            "applyMod": false,
            "value": ""
        },
        "damageType": {
            "value": ""
        },
        "description": {
            "chat": "",
            "unidentified": "",
            "value": "<p>To mislead pursuers, the Lacunafex developed the means to swap visages. You trade appearances with the target, with the effects depending on the result of the target&rsquo;s Will saving throw. Willing and @Compendium[pf2e.conditionspf2e.fBnFDH2MTzgFijKf]{Unconscious} targets automatically critically fail this saving throw.</p>\n<hr />\n<p><span id=\"ctl00_MainContent_DetailedOutput\"><strong>Critical Success</strong> No effect.</span></p>\n<p><span id=\"ctl00_MainContent_DetailedOutput\"><strong>Success</strong> You take on the target&rsquo;s appearance, and they take yours. This has the same effects as a 1st-level @Compendium[pf2e.spells-srd.i35dpZFI7jZcRoBo]{Illusory Disguise}&nbsp;spell, except that the target can&rsquo;t Dismiss the disguise. The duration is 1 minute or until Dismissed.</span></p>\n<p><span id=\"ctl00_MainContent_DetailedOutput\"><strong>Failure</strong> As success, but the duration is 1 hour or until Dismissed.</span></p>\n<p><span id=\"ctl00_MainContent_DetailedOutput\"><strong>Critical Failure</strong> As success, but the duration is 24 hours.&nbsp;</span></p>"
        },
        "duration": {
            "value": "varies"
        },
        "level": {
            "value": 1
        },
        "location": {
            "value": ""
        },
        "materials": {
            "value": "You have the humanoid trait"
        },
        "prepared": {
            "value": ""
        },
        "primarycheck": {
            "value": ""
        },
        "range": {
            "value": "touch"
        },
        "rarity": {
            "value": "common"
        },
        "rules": [],
        "save": {
            "basic": "",
            "value": "will"
        },
        "scaling": {
            "formula": "",
            "mode": "none"
        },
        "school": {
            "value": "ill"
        },
        "secondarycasters": {
            "value": ""
        },
        "secondarycheck": {
            "value": ""
        },
        "source": {
            "value": ""
        },
        "spellCategorie": {
            "value": "spell"
        },
        "spellCategory": {
            "value": ""
        },
        "spellType": {
            "value": "save"
        },
        "sustained": {
            "value": false
        },
        "target": {
            "value": "you and 1 other humanoid"
        },
        "time": {
            "value": "2"
        },
        "traditions": {
            "custom": "",
            "value": [
                "arcane",
                "occult"
            ]
        },
        "traits": {
            "custom": "",
            "rarity": {
                "value": "uncommon"
            },
            "value": [
                "illusion",
                "visual"
            ]
        },
        "usage": {
            "value": "held-in-one-hand"
        }
    },
    "effects": [],
    "flags": {},
    "img": "systems/pf2e/icons/spells/exchange-image.jpg",
    "name": "Exchange Image",
    "permission": {
        "default": 0
    },
    "type": "spell"
}
