{
    "_id": "85tRKGZUTFa6pKpG",
    "data": {
        "actionCategory": {
            "value": ""
        },
        "actionType": {
            "value": "passive"
        },
        "actions": {
            "value": null
        },
        "description": {
            "chat": "",
            "unidentified": "",
            "value": "<p>Growing up, you never tried to lie to get what you wanted, and even when necessary, lying makes you uncomfortable. The especially faithful might even have thought that you were blessed by the dwarven god of duty, <a class=\"entity-link\" draggable=\"true\" data-pack=\"pf2e.deities\" data-id=\"zhPhYge7VJbIlJvA\"> Kols</a>. You gain a +1 circumstance bonus to Perception checks to <a class=\"entity-link\" draggable=\"true\" data-pack=\"pf2e.actionspf2e\" data-id=\"1xRFPTFtWtGJ9ELw\"> Sense Motive</a> and to Perception DCs against attempts to <a class=\"entity-link\" draggable=\"true\" data-pack=\"pf2e.actionspf2e\" data-id=\"ewwCglB7XOPLUz72\"> Lie</a> to you. Furthermore, you gain a +2 circumstance bonus to Diplomacy checks to convince others you speak the truth when you are telling the truth, and you take a –4 circumstance penalty to lie and to your Deception DC against <a class=\"entity-link\" draggable=\"true\" data-pack=\"pf2e.actionspf2e\" data-id=\"1xRFPTFtWtGJ9ELw\"> Sense Motive</a>.</p>"
        },
        "featType": {
            "value": "ancestryfeature"
        },
        "level": {
            "value": "1"
        },
        "prerequisites": {
            "value": null
        },
        "rarity": {
            "value": "common"
        },
        "rules": [],
        "source": {
            "value": ""
        },
        "traits": {
            "custom": "",
            "rarity": {
                "value": "common"
            },
            "value": [
                "dwarf"
            ]
        },
        "usage": {
            "value": "held-in-one-hand"
        }
    },
    "effects": [],
    "flags": {},
    "img": "systems/pf2e/icons/features/ancestry/oathkeeper-dwarf.jpg",
    "name": "Oathkeeper Dwarf",
    "permission": {
        "default": 0
    },
    "type": "feat"
}
