{
    "_id": "V5kv7e1r2qV2k3lf",
    "data": {
        "brokenThreshold": {
            "value": 0
        },
        "bulkCapacity": {
            "value": ""
        },
        "collapsed": {
            "value": false
        },
        "containerId": {
            "value": ""
        },
        "description": {
            "chat": "",
            "unidentified": "",
            "value": "<p>This aeon stone must be activated to provide a benefit.</p>\n<hr>\n<p><strong>Activate&nbsp;</strong><span style=\"font-family: 'Pathfinder2eActions'; font-size: 1.8em; display: inline;\">2</span>&nbsp; envision, Interact;</p>\n<p><strong>Effect </strong>You activate the aeon stone to gain the effects of a 1st-level <a class=\"entity-link\" draggable=\"true\" data-pack=\"pf2e.spells-srd\" data-id=\"i35dpZFI7jZcRoBo\"><i class=\"fas fa-suitcase\"></i> Illusory Disguise</a>.</p>\n<p>The resonant power allows you to render all of your aeon stones and your wayfinder <a class=\"entity-link\" draggable=\"true\" data-pack=\"pf2e.conditionspf2e\" data-id=\"zJxUflt9np0q4yML\"><i class=\"fas fa-book-open\"></i> Invisible</a> whenever you use the activation to gain the effects of illusory disguise.</p>"
        },
        "equipped": {
            "value": false
        },
        "equippedBulk": {
            "value": ""
        },
        "hardness": {
            "value": 0
        },
        "hp": {
            "value": 0
        },
        "identified": {
            "value": false
        },
        "invested": {
            "value": false
        },
        "level": {
            "value": "6"
        },
        "maxHp": {
            "value": 0
        },
        "negateBulk": {
            "value": "0"
        },
        "preciousMaterial": {
            "value": ""
        },
        "preciousMaterialGrade": {
            "value": ""
        },
        "price": {
            "value": "225 gp"
        },
        "quantity": {
            "value": "1"
        },
        "rarity": {
            "value": "common"
        },
        "rules": [],
        "source": {
            "value": ""
        },
        "stackGroup": {
            "value": ""
        },
        "traits": {
            "custom": "",
            "rarity": {
                "value": "uncommon"
            },
            "usage": {
                "value": "held-in-one-hand"
            },
            "value": [
                "invested",
                "magical",
                "transmutation"
            ]
        },
        "usage": {
            "value": "held-in-one-hand"
        },
        "weight": {
            "value": "-"
        }
    },
    "effects": [],
    "flags": {
        "core": {
            "sourceId": "Item.XXyn4JyjNHSyWqGn"
        }
    },
    "img": "systems/pf2e/icons/equipment/worn-items/other-worn-items/aeon-stone-western-star.jpg",
    "name": "Aeon Stone (Western Star)",
    "permission": {
        "default": 0
    },
    "type": "equipment"
}
