{
    "_id": "ROAUR1GhC19Pjk9C",
    "data": {
        "actionCategory": {
            "value": ""
        },
        "actionType": {
            "value": "passive"
        },
        "actions": {
            "value": ""
        },
        "description": {
            "chat": "",
            "unidentified": "",
            "value": "<p><strong>Prerequisites </strong>@Compendium[pf2e.feats-srd.uxHWqFbYD0ZvkeF8]{Scroll Trickster Dedication}</p>\n<hr>\n<p>You have a vast and overflowing collection of scroll scraps, riddled with errors and misspellings and leaking energy like a sieve. With enough care, you can coax these scroll scraps into functioning—briefly.</p>\n<p>Each day during your daily preparations, you can create a single temporary scroll containing a 1st-level spell. The spell must be a common spell from the <em>Core Rulebook</em>, or another spell you learned via @Compendium[pf2e.actionspf2e.Q5iIYCFdqJFM31GW]{Learn a Spell}, and it must come from a tradition in which you have the corresponding skill trained.</p>\n<p>This scroll is an unstable, temporary item and loses its magic the next time you make your daily preparations if you haven't already used it. It can't be used to Learn the Spell.</p>\n<p>At 8th level, add a second temporary scroll containing a 2nd-level spell.</p>"
        },
        "featType": {
            "value": "archetype"
        },
        "level": {
            "value": "6"
        },
        "prerequisites": {
            "value": "Scroll Trickster Dedication"
        },
        "rarity": {
            "value": "common"
        },
        "source": {
            "value": ""
        },
        "traits": {
            "rarity": {
                "value": "common"
            },
            "value": [
                "archetype"
            ]
        },
        "usage": {
            "value": ""
        }
    },
    "flags": {},
    "img": "systems/pf2e/icons/features/feats/feats.jpg",
    "name": "Basic Scroll Cache",
    "permission": {
        "default": 0
    },
    "type": "feat"
}
