{
    "_id": "69h9D3syUYLgIPr7",
    "data": {
        "actionCategory": {
            "value": ""
        },
        "actionType": {
            "value": "passive"
        },
        "actions": {
            "value": ""
        },
        "description": {
            "chat": "",
            "unidentified": "",
            "value": "<p><strong>Prerequisites </strong><a class=\"entity-link\" data-pack=\"pf2e.feats-srd\" data-id=\"7qBuzHY8kEG8SdEP\" draggable=\"true\"><i class=\"fas fa-suitcase\"></i> Cat's Luck</a></p>\n<hr>\n<p>You are luckier even than most catfolk. You can trigger Cat's Luck when you fail or critically fail a Fortitude or Will saving throw in addition to Reflex saving throws. You still can use Cat's Luck only once per day.</p>"
        },
        "featType": {
            "value": "ancestry"
        },
        "level": {
            "value": "5"
        },
        "prerequisites": {
            "value": "Cat's Luck"
        },
        "rarity": {
            "value": "common"
        },
        "source": {
            "value": ""
        },
        "traits": {
            "rarity": {
                "value": "common"
            },
            "value": [
                "catfolk"
            ]
        },
        "usage": {
            "value": ""
        }
    },
    "flags": {},
    "img": "systems/pf2e/icons/features/feats/feats.jpg",
    "name": "Expanded Luck",
    "permission": {
        "default": 0
    },
    "type": "feat"
}
