{
    "_id": "jsXDbQAAH3yMchPU",
    "data": {
        "actionCategory": {
            "value": ""
        },
        "actionType": {
            "value": "reaction"
        },
        "actions": {
            "value": ""
        },
        "description": {
            "chat": "",
            "unidentified": "",
            "value": "<p><strong>Prerequisites </strong>@Compendium[pf2e.feats-srd.u6SDVWbzHnBBPNMo]{Linguist Dedication}</p>\n<p><strong>Trigger</strong> Another creature within 60 feet uses a linguistic effect in a language you understand.</p>\n<hr>\n<p>You interpret a creature's words, repeating their message in a different language that you know. If the triggering effect's targets speak either the original language or the one you translated into, they are affected.</p>"
        },
        "featType": {
            "value": "archetype"
        },
        "level": {
            "value": "4"
        },
        "prerequisites": {
            "value": "Linguist Dedication"
        },
        "rarity": {
            "value": "common"
        },
        "rules": [],
        "source": {
            "value": ""
        },
        "traits": {
            "rarity": {
                "value": "common"
            },
            "value": [
                "archetype",
                "auditory",
                "linguistic"
            ]
        },
        "usage": {
            "value": ""
        }
    },
    "flags": {},
    "img": "systems/pf2e/icons/features/feats/feats.jpg",
    "name": "Spot Translate",
    "permission": {
        "default": 0
    },
    "type": "feat"
}
