{
    "_id": "zoY0fQYTF1NzezTg",
    "data": {
        "ability": {
            "value": ""
        },
        "area": {
            "value": ""
        },
        "areasize": {
            "value": ""
        },
        "components": {
            "value": "Verbal"
        },
        "cost": {
            "value": ""
        },
        "damage": {
            "applyMod": false,
            "value": ""
        },
        "damageType": {
            "value": ""
        },
        "description": {
            "chat": "",
            "unidentified": "",
            "value": "<p>Cast&nbsp;<span style=\"font-family: Pathfinder2eActions; font-size: 25.2px; display: inline;\">R </span>verbal;</p>\n<p><strong>Trigger</strong> You make a successful unarmed Strike against a flying creature.</p>\n<p><strong>Targets</strong> the creature you hit</p>\n<p><strong>Saving Throw</strong> Fortitude</p>\n<hr />\n<p>You deny a flying creature the support of the air.</p>\n<p><strong>Critical Success</strong> The creature is unaffected.</p>\n<p><strong>Success</strong> The target descends 60 feet. If it hits a surface, it takes bludgeoning damage as if it had fallen.</p>\n<p><strong>Failure</strong> The target descends 60 feet. If it hits a surface, it takes bludgeoning damage as if it had fallen.</p>\n<p><strong>Critical Failure</strong> As failure, and the creature takes double damage from hitting a surface.</p>\n<hr />\n<p><strong>Heightened (+1)</strong> Increase the distance the creature must descend by 20 feet.</p>"
        },
        "duration": {
            "value": ""
        },
        "level": {
            "value": 5
        },
        "location": {
            "value": "Aq01kMb7yAj1VxPX"
        },
        "materials": {
            "value": ""
        },
        "prepared": {
            "value": ""
        },
        "primarycheck": {
            "value": ""
        },
        "range": {
            "value": ""
        },
        "rarity": {
            "value": "common"
        },
        "rules": [],
        "save": {
            "basic": "",
            "value": "fortitude"
        },
        "scaling": {
            "formula": "",
            "mode": "none"
        },
        "school": {
            "value": "evo"
        },
        "secondarycasters": {
            "value": ""
        },
        "secondarycheck": {
            "value": ""
        },
        "source": {
            "value": ""
        },
        "spellCategorie": {
            "value": "focus"
        },
        "spellCategory": {
            "value": ""
        },
        "spellType": {
            "value": "save"
        },
        "sustained": {
            "value": false
        },
        "target": {
            "value": "the creature you hit"
        },
        "time": {
            "value": "Reaction"
        },
        "traditions": {
            "value": []
        },
        "traits": {
            "custom": "",
            "rarity": {
                "value": "uncommon"
            },
            "selected": {
                "evocation": "Evocation"
            },
            "value": [
                "evocation"
            ]
        },
        "usage": {
            "value": "held-in-one-hand"
        }
    },
    "effects": [],
    "flags": {},
    "img": "systems/pf2e/icons/spells/steal-the-sky.jpg",
    "name": "Steal the Sky",
    "permission": {
        "default": 0
    },
    "type": "spell"
}
