{
    "_id": "jtgfTYpcv4FFpWsL",
    "content": "<p><span class=\"fontstyle0\">You died or came so close that you walked the boundary between life and death. </span></p>\n<p><span class=\"fontstyle0\">Add the <a class=\"entity-link\" draggable=\"true\" data-pack=\"pf2e.feats-srd\" data-id=\"I0BhPWqYf1bbzEYg\"><i class=\"fas fa-suitcase\"></i> Diehard</a> feat to your background options. If you select it instead of a skill feat, you aren't trained in a background skill.</span> <br style=\"font-style: normal; font-variant: normal; font-weight: normal; letter-spacing: normal; line-height: normal; orphans: 2; text-align: -webkit-auto; text-indent: 0px; text-transform: none; white-space: normal; widows: 2; word-spacing: 0px; -webkit-text-size-adjust: auto; -webkit-text-stroke-width: 0px;\"><br></p>",
    "flags": {},
    "name": "Died",
    "permission": {
        "default": 0
    }
}
