{
    "_id": "DwnnmTNOvpLbp7jJ",
    "data": {
        "actionCategory": {
            "value": ""
        },
        "actionType": {
            "value": "free"
        },
        "actions": {
            "value": ""
        },
        "description": {
            "chat": "",
            "unidentified": "",
            "value": "<p><span id=\"ctl00_MainContent_DetailedOutput\"><strong>Access</strong> Keleshite nationality<br><strong>Requirements</strong> You're in a settlement or community, and you haven't used Courteous Comeback in this settlement or community within the past month.<br><strong>Trigger</strong> You critically fail a Diplomacy check.<br></span></p>\n<hr>\n<p>You grew up in the proud Padishah Empire, where even insults have a certain poetic wit. Reroll the triggering Diplomacy check, using the second result.</p>"
        },
        "featType": {
            "value": "ancestry"
        },
        "level": {
            "value": "1"
        },
        "prerequisites": {
            "value": ""
        },
        "rarity": {
            "value": "common"
        },
        "source": {
            "value": ""
        },
        "traits": {
            "custom": "",
            "rarity": {
                "value": "common"
            },
            "value": [
                "uncommon",
                "human",
                "fortune"
            ]
        },
        "usage": {
            "value": "held-in-one-hand"
        }
    },
    "flags": {},
    "img": "systems/pf2e/icons/features/feats/feats.jpg",
    "name": "Courteous Comeback",
    "permission": {
        "default": 0
    },
    "type": "feat"
}
