{
    "_id": "oDhTOO1WjEZk1qfD",
    "content": "<p><span class=\"fontstyle0\">You grew up against the backdrop of a major military conflict that affected much of your childhood world. </span></p>\n<p><span class=\"fontstyle0\">Add the <a class=\"entity-link\" draggable=\"true\" data-pack=\"pf2e.feats-srd\" data-id=\"wYerMk6F1RZb0Fwt\"><i class=\"fas fa-suitcase\"></i> Battle Medicine</a> skill feat to your background options.</span> <br style=\"font-style: normal; font-variant: normal; font-weight: normal; letter-spacing: normal; line-height: normal; orphans: 2; text-align: -webkit-auto; text-indent: 0px; text-transform: none; white-space: normal; widows: 2; word-spacing: 0px; -webkit-text-size-adjust: auto; -webkit-text-stroke-width: 0px;\"><br></p>",
    "flags": {},
    "name": "Witnessed War",
    "permission": {
        "default": 0
    }
}
