{
    "_id": "jG9YwAAvNbCShumf",
    "data": {
        "actionCategory": {
            "value": ""
        },
        "actionType": {
            "value": "passive"
        },
        "actions": {
            "value": ""
        },
        "description": {
            "chat": "",
            "unidentified": "",
            "value": "<p>You can react whenever a foe leaves a gap in their defenses. At the start of each enemy's turn, you gain an extra reaction you can use only during that turn to perform an <a class=\"entity-link\" data-pack=\"pf2e.classfeatures\" data-id=\"Jtn7IugykXDlIoZq\" draggable=\"true\"><i class=\"fas fa-suitcase\"></i> Opportune Riposte</a>, or an <a class=\"entity-link\" data-pack=\"pf2e.classfeatures\" data-id=\"hmShTfPOcTaKgbf4\" draggable=\"true\"><i class=\"fas fa-suitcase\"></i> Attack of Opportunity</a> if you have that reaction.</p>"
        },
        "featType": {
            "value": "class"
        },
        "level": {
            "value": "20"
        },
        "prerequisites": {
            "value": ""
        },
        "rarity": {
            "value": "common"
        },
        "source": {
            "value": ""
        },
        "traits": {
            "rarity": {
                "value": "common"
            },
            "value": [
                "swashbuckler"
            ]
        },
        "usage": {
            "value": ""
        }
    },
    "flags": {},
    "img": "systems/pf2e/icons/features/feats/feats.jpg",
    "name": "Inexhaustible Countermoves",
    "permission": {
        "default": 0
    },
    "type": "feat"
}
