{
    "_id": "NvEYf0jIETEu2LtP",
    "data": {
        "actionCategory": {
            "value": ""
        },
        "actionType": {
            "value": "action"
        },
        "actions": {
            "value": "1"
        },
        "description": {
            "chat": "",
            "unidentified": "",
            "value": "<p>You time the components of your spell with exacting precision, setting up a resonance that duplicates the spell's effects.</p>\n<p>If your next action is to <a class=\"entity-link\" data-pack=\"pf2e.actionspf2e\" data-id=\"aBQ8ajvEBByv45yz\" draggable=\"true\"><i class=\"fas fa-suitcase\"></i> Cast a Spell</a> of 4th level or lower that has no duration, the spell's energy reverberates and echoes. You can Cast the Spell a second time before the end of your next turn without expending a spell slot.</p>"
        },
        "featType": {
            "value": "class"
        },
        "level": {
            "value": "18"
        },
        "prerequisites": {
            "value": ""
        },
        "rarity": {
            "value": "common"
        },
        "source": {
            "value": ""
        },
        "traits": {
            "rarity": {
                "value": "common"
            },
            "value": [
                "concentrate",
                "metamagic",
                "sorcerer"
            ]
        },
        "usage": {
            "value": ""
        }
    },
    "flags": {},
    "img": "systems/pf2e/icons/features/feats/feats.jpg",
    "name": "Echoing Spell",
    "permission": {
        "default": 0
    },
    "type": "feat"
}
