{
    "_id": "Um0aaJotqMKGmAlR",
    "data": {
        "ability": {
            "value": ""
        },
        "area": {
            "value": ""
        },
        "areasize": {
            "value": "5-foot emanation"
        },
        "components": {
            "value": "verbal"
        },
        "cost": {
            "value": ""
        },
        "damage": {
            "applyMod": false,
            "value": ""
        },
        "damageType": {
            "value": ""
        },
        "description": {
            "chat": "",
            "unidentified": "",
            "value": "<p>Your performance enraptures those who hear it, compelling them to follow you about in admiration. Each creature within the emanation must attempt a Will save when you @Compendium[pf2e.actionspf2e.aBQ8ajvEBByv45yz]{Cast the Spell} or the first time they enter the area, after which they become temporarily immune for 1 day. Once per turn, you can spend a single action, which has the concentrate trait, to increase the emanation’s radius by 5 feet. You can @Compendium[pf2e.actionspf2e.AjLSHZSWQ90exdLo]{Dismiss} the spell.</p>\n<hr>\n<p><span id=\"docs-internal-guid-6ab32545-7fff-5e46-0bd7-060c89422c35\"><strong>Critical Success</strong> The creature is unaffected. </span></p>\n<p><span id=\"docs-internal-guid-6ab32545-7fff-5e46-0bd7-060c89422c35\"><strong>Success</strong> The creature is @Compendium[pf2e.conditionspf2e.AdPVz7rbaVSRxHFg]{Fascinated} with you. </span></p>\n<p><span id=\"docs-internal-guid-6ab32545-7fff-5e46-0bd7-060c89422c35\"><strong>Failure</strong> The creature uses all its actions to move toward you and compliment your performance. This effect ends if a hostile action is used against the affected creature. </span></p>\n<p><span id=\"docs-internal-guid-6ab32545-7fff-5e46-0bd7-060c89422c35\"><strong>Critical Failure</strong> The target gains the minion trait and is @Compendium[pf2e.conditionspf2e.9qGBRpbX9NEwtAAr]{Controlled} by you. This effect ends if a hostile action is used against the affected creature, or if you direct the creature to use any action that causes it harm.</span></p>"
        },
        "duration": {
            "value": "1 minute"
        },
        "level": {
            "value": 10
        },
        "location": {
            "value": ""
        },
        "materials": {
            "value": ""
        },
        "prepared": {
            "value": ""
        },
        "primarycheck": {
            "value": ""
        },
        "range": {
            "value": ""
        },
        "rarity": {
            "value": "common"
        },
        "rules": [],
        "save": {
            "basic": "",
            "value": "will"
        },
        "scaling": {
            "formula": "",
            "mode": "none"
        },
        "school": {
            "value": "enc"
        },
        "secondarycasters": {
            "value": ""
        },
        "secondarycheck": {
            "value": ""
        },
        "source": {
            "value": ""
        },
        "spellCategorie": {
            "value": "focus"
        },
        "spellCategory": {
            "value": ""
        },
        "spellType": {
            "value": "utility"
        },
        "sustained": {
            "value": false
        },
        "target": {
            "value": ""
        },
        "time": {
            "value": "2"
        },
        "traditions": {
            "value": []
        },
        "traits": {
            "custom": "",
            "rarity": {
                "value": "uncommon"
            },
            "value": [
                "bard",
                "composition",
                "enchantment",
                "incapacitation",
                "mental",
                "sonic"
            ]
        },
        "usage": {
            "value": "held-in-one-hand"
        }
    },
    "effects": [],
    "flags": {},
    "img": "systems/pf2e/icons/spells/pied-piping.jpg",
    "name": "Pied Piping",
    "permission": {
        "default": 0
    },
    "type": "spell"
}
