{
    "_id": "MgLUbsvAkIA4fsZW",
    "data": {
        "actionCategory": {
            "value": ""
        },
        "actionType": {
            "value": "passive"
        },
        "actions": {
            "value": ""
        },
        "description": {
            "chat": "",
            "unidentified": "",
            "value": "<p><span id=\"ctl00_MainContent_DetailedOutput\"><strong>Prerequisites</strong> Hellknight Signifer Dedication, ability to cast focus spells<br></span></p>\n<hr>\n<p>You can channel your mask's power to pierce through lies and see the truth in any situation. Increase the number of Focus Points in your focus pool by 1. While wearing your mask, you can cast the @Compendium[pf2e.spells-srd.ZjbVgIIqMstmdkqP]{Glimpse the Truth}&nbsp;cleric domain spell as a divine focus spell.&nbsp;</p>"
        },
        "featType": {
            "value": "class"
        },
        "level": {
            "value": "10"
        },
        "prerequisites": {
            "value": "Hellknight Signifer Dedication, ability to cast focus spells"
        },
        "rarity": {
            "value": "common"
        },
        "source": {
            "value": ""
        },
        "traits": {
            "custom": "",
            "rarity": {
                "value": "common"
            },
            "value": [
                "archetype"
            ]
        },
        "usage": {
            "value": "held-in-one-hand"
        }
    },
    "flags": {},
    "img": "systems/pf2e/icons/features/feats/feats.jpg",
    "name": "Gaze of Veracity",
    "permission": {
        "default": 0
    },
    "type": "feat"
}
