{
    "_id": "wfOGyLnuVMFo7Rwy",
    "data": {
        "actionCategory": {
            "value": ""
        },
        "actionType": {
            "value": "passive"
        },
        "actions": {
            "value": ""
        },
        "description": {
            "chat": "",
            "unidentified": "",
            "value": "<p>You have a powerful connection to the Boneyard and its courts, granting you the ability to travel to and from the Boneyard. You gain @Compendium[pf2e.spells-srd.5bTt2CvYHPvaR7QQ]{Plane Shift}&nbsp;as a divine innate spell. You can cast it twice per week.</p>\n<p>This can be used only to travel to the Boneyard or from the Boneyard to the Material Plane. Due to your unique connection to the Boneyard, your body serves as the focus, and you don't require a tuning fork.</p>"
        },
        "featType": {
            "value": "ancestry"
        },
        "level": {
            "value": "17"
        },
        "prerequisites": {
            "value": ""
        },
        "rarity": {
            "value": "common"
        },
        "source": {
            "value": ""
        },
        "traits": {
            "rarity": {
                "value": "common"
            },
            "value": [
                "duskwalker"
            ]
        },
        "usage": {
            "value": ""
        }
    },
    "flags": {},
    "img": "systems/pf2e/icons/features/feats/feats.jpg",
    "name": "Boneyard's Call",
    "permission": {
        "default": 0
    },
    "type": "feat"
}
