{
    "_id": "bEh5qUgX5eFaQwzU",
    "data": {
        "actionCategory": {
            "value": ""
        },
        "actionType": {
            "value": "passive"
        },
        "actions": {
            "value": ""
        },
        "description": {
            "chat": "",
            "unidentified": "",
            "value": "<p>You favor weapons that you can use with quick, darting slashes like a cat's claws. You are trained with the @Compendium[pf2e.equipment-srd.LGgvev6AV0So8tP9]{Hatchet}, @Compendium[pf2e.equipment-srd.zSAoyzcf3nSeZCiF]{Kama}, @Compendium[pf2e.equipment-srd.TDrO7Xdyn7juFy3c]{Kukri}, @Compendium[pf2e.equipment-srd.grmaV4GdoGD7sKbn]{Scimitar}, and @Compendium[pf2e.equipment-srd.ynnBwzkzsR6B73iO]{Sickle}. In addition, you gain access to kama, kukris, and all uncommon catfolk weapons. For you, martial catfolk weapons are simple weapons and advanced catfolk weapons are martial weapons.</p>"
        },
        "featType": {
            "value": "ancestry"
        },
        "level": {
            "value": "1"
        },
        "prerequisites": {
            "value": ""
        },
        "rarity": {
            "value": "common"
        },
        "source": {
            "value": ""
        },
        "traits": {
            "rarity": {
                "value": "common"
            },
            "value": [
                "catfolk"
            ]
        },
        "usage": {
            "value": ""
        }
    },
    "flags": {},
    "img": "systems/pf2e/icons/features/feats/feats.jpg",
    "name": "Catfolk Weapon Familiarity",
    "permission": {
        "default": 0
    },
    "type": "feat"
}
