{
    "_id": "c4ao7b2T92fiM8jR",
    "data": {
        "actionCategory": {
            "value": ""
        },
        "actionType": {
            "value": "passive"
        },
        "actions": {
            "value": ""
        },
        "description": {
            "chat": "",
            "unidentified": "",
            "value": "<div><strong>Archetype&nbsp;</strong>@Compendium[pf2e.archetypes.4xzvjFVytFA0LIYj]{Living Monolith}</div>\n<div><span id=\"ctl00_MainContent_DetailedOutput\"><strong>Prerequisites</strong> Ancient Osiriani and Sphinx languages, trained in Crafting<br><strong>Access</strong> You are from the Golden Road region.<br></span></div>\n<hr>\n<p>You've begun to inscribe a magical stone called a <em>ka stone</em> that you will some day tie to your soul. You gain knowledge of Ancient Osirion and a connection to your nascent <em>ka stone</em>. If you fail a recovery check while dying, your dying condition does not increase; if you critically fail, your dying condition increases by only 1. You become trained in Ancient Osirion Lore, or expert if you were already trained.</p>\n<p><strong>Special</strong> You cannot select another dedication feat until you have gained two other feats from the living monolith archetype.&nbsp;</p>"
        },
        "featType": {
            "value": "archetype"
        },
        "level": {
            "value": "2"
        },
        "prerequisites": {
            "value": "Ancient Osiriani and Sphinx languages, trained in Crafting"
        },
        "rarity": {
            "value": "common"
        },
        "source": {
            "value": ""
        },
        "traits": {
            "custom": "",
            "rarity": {
                "value": "uncommon"
            },
            "value": [
                "uncommon",
                "archetype",
                "dedication"
            ]
        },
        "usage": {
            "value": "held-in-one-hand"
        }
    },
    "flags": {},
    "img": "systems/pf2e/icons/features/feats/feats.jpg",
    "name": "Living Monolith Dedication",
    "permission": {
        "default": 0
    },
    "type": "feat"
}
