{
    "_id": "lbiFj4At5BxotaNY",
    "data": {
        "actionCategory": {
            "value": ""
        },
        "actionType": {
            "value": "passive"
        },
        "actions": {
            "value": ""
        },
        "description": {
            "chat": "",
            "unidentified": "",
            "value": "<p>Your inborn arcane power manifests as your exemplar's most time-honored spells.</p>\n<p>Choose one 1st-level spell and one 2nd-level spell from those listed for a dragon spellcaster of your draconic exemplar's type, as presented on pages 104–126 of the Bestiary (such as @Compendium[pf2e.spells-srd.4WAib3GichxLjp5p]{Alarm}, @Compendium[pf2e.spells-srd.3JG1t3T4mWn6vTke]{Blur}, @Compendium[pf2e.spells-srd.XXqE1eY3w3z6xJCB]{Invisibility}, and @Compendium[pf2e.spells-srd.Gb7SeieEvd0pL2Eh]{True Strike}&nbsp;for a black dragon exemplar).</p>\n<p>You can cast each of these spells once per day as arcane innate spells. You gain the trained proficiency rank in arcane spell attack rolls and spell DCs, and your key spellcasting ability is Charisma.</p>"
        },
        "featType": {
            "value": "ancestry"
        },
        "level": {
            "value": "9"
        },
        "prerequisites": {
            "value": ""
        },
        "rarity": {
            "value": "common"
        },
        "source": {
            "value": ""
        },
        "traits": {
            "rarity": {
                "value": "common"
            },
            "value": [
                "kobold"
            ]
        },
        "usage": {
            "value": ""
        }
    },
    "flags": {},
    "img": "systems/pf2e/icons/features/feats/feats.jpg",
    "name": "Dracomancer",
    "permission": {
        "default": 0
    },
    "type": "feat"
}
