{
    "_id": "wewWxypLaXcHjJ5P",
    "data": {
        "brokenThreshold": {
            "value": 0
        },
        "bulkCapacity": {
            "value": ""
        },
        "collapsed": {
            "value": false
        },
        "containerId": {
            "value": ""
        },
        "description": {
            "chat": "",
            "unidentified": "",
            "value": "<p>This small rod has a tiny, sharp cutting wheel made of steel on one end and a thick bulb on the other. You can use the glass cutter’s wheel to score ordinary glass and use the bulb to break the piece along your scoring. It typically takes 1 minute of work to cut a hole large enough to fit your hand. If you are attempting to break the glass quietly, you must attempt a Thievery check against the Perception DC of nearby creatures to go unnoticed.</p>"
        },
        "equipped": {
            "value": false
        },
        "equippedBulk": {
            "value": ""
        },
        "hardness": {
            "value": 0
        },
        "hp": {
            "value": 0
        },
        "identified": {
            "value": false
        },
        "invested": {
            "value": false
        },
        "level": {
            "value": "0"
        },
        "maxHp": {
            "value": 0
        },
        "negateBulk": {
            "value": "0"
        },
        "preciousMaterial": {
            "value": ""
        },
        "preciousMaterialGrade": {
            "value": ""
        },
        "price": {
            "value": "5 gp"
        },
        "quantity": {
            "value": "1"
        },
        "rarity": {
            "value": "common"
        },
        "rules": [],
        "source": {
            "value": ""
        },
        "stackGroup": {
            "value": ""
        },
        "traits": {
            "rarity": {
                "value": "uncommon"
            },
            "usage": {
                "value": "held-in-two-hands"
            },
            "value": []
        },
        "usage": {
            "value": "held-in-one-hand"
        },
        "weight": {
            "value": "L"
        }
    },
    "effects": [],
    "flags": {
        "core": {
            "sourceId": "Item.F0cW7SjOPZr8ZQ0g"
        }
    },
    "img": "systems/pf2e/icons/equipment/adventuring-gear/glass-cutter.jpg",
    "name": "Glass Cutter",
    "permission": {
        "default": 0
    },
    "type": "equipment"
}
