{
    "_id": "CrUPaPlsxy2bswaT",
    "data": {
        "actionCategory": {
            "value": ""
        },
        "actionType": {
            "value": "action"
        },
        "actions": {
            "value": "1"
        },
        "description": {
            "chat": "",
            "unidentified": "",
            "value": "<p><strong>Requirements</strong> The companion's last action was a successful Performance check to <a class=\"entity-link\" draggable=\"true\" data-pack=\"pf2e.actionspf2e\" data-id=\"EEDElIyin4z60PXx\"> Perform</a>. The companion maintains its performance to captivate a single target within 30 feet that witnessed its successful performance. The target must attempt a Will save.</p>\n<hr>\n<p><strong>Success </strong>The target is unaffected and temporarily immune for 1 hour.</p>\n<p><strong>Failure </strong>The target is <a class=\"entity-link\" draggable=\"true\" data-pack=\"pf2e.conditionitems\" data-id=\"AdPVz7rbaVSRxHFg\"> Fascinated</a> by the companion for its next action and then is temporarily immune for 1 hour.</p>\n<p><strong>Critical Failure </strong>The target is fascinated by the companion for 1 round. While it remains fascinated, it can't use reactions.</p>"
        },
        "rarity": {
            "value": "common"
        },
        "requirements": {
            "value": ""
        },
        "rules": [],
        "skill_requirement": {
            "skill": {
                "rank": "",
                "skill": ""
            }
        },
        "skill_requirements": {
            "rank": "",
            "skill": ""
        },
        "source": {
            "value": ""
        },
        "traits": {
            "custom": "",
            "value": [
                "concentrate",
                "emotion"
            ]
        },
        "trigger": {
            "value": ""
        },
        "usage": {
            "value": "held-in-one-hand"
        },
        "weapon": {
            "value": ""
        }
    },
    "effects": [],
    "flags": {},
    "img": "systems/pf2e/icons/actions/OneAction.png",
    "name": "Mesmerizing Performance",
    "permission": {
        "default": 0
    },
    "type": "action"
}
