{
    "_id": "xTpp8dHZsNMDm75B",
    "data": {
        "ability": {
            "label": "Spellcasting Ability",
            "type": "String",
            "value": ""
        },
        "area": {
            "areaType": "",
            "label": "Area",
            "type": "String",
            "value": null
        },
        "areasize": {
            "value": "5-foot burst"
        },
        "components": {
            "label": "Spell Components",
            "type": "String",
            "value": "somatic, verbal"
        },
        "cost": {
            "label": "Cost",
            "type": "String",
            "value": ""
        },
        "damage": {
            "applyMod": false,
            "label": "Spell Damage",
            "type": "String",
            "value": ""
        },
        "damageType": {
            "label": "Damage Type",
            "type": "String",
            "value": ""
        },
        "description": {
            "chat": "",
            "label": "Description",
            "type": "String",
            "unidentified": "",
            "value": "<p>A deluge of colorful illusory paint, tools, or other symbols of art and artisanship drift down in the area. Roll 1d4 to determine the color of the illusion. Each creature in the area must attempt a Will save. A creature is unaffected on a success. On a failure or critical failure, the creature takes the results listed on the table relevant to the color.</p>\n<h3 style=\"box-sizing: border-box; user-select: text; color: #191813;\"><strong style=\"box-sizing: border-box; user-select: text;\">Splash of Art</strong></h3>\n<table style=\"box-sizing: border-box; user-select: text; width: 372px; color: #191813; font-size: 13px; height: 95px;\" border=\"1\">\n<tbody style=\"box-sizing: border-box; user-select: text;\">\n<tr style=\"box-sizing: border-box; user-select: text; height: 25px;\">\n<td style=\"box-sizing: border-box; user-select: text; color: white; height: 25px; width: 32px; text-align: center; background-color: #522e2c;\"><strong style=\"box-sizing: border-box; user-select: text;\">1d4</strong></td>\n<td style=\"box-sizing: border-box; user-select: text; color: white; width: 70px; text-align: center; background-color: #522e2c; height: 25px;\"><strong style=\"box-sizing: border-box; user-select: text;\">Color</strong></td>\n<td style=\"box-sizing: border-box; user-select: text; color: white; width: 152px; text-align: center; background-color: #522e2c; height: 25px;\"><strong style=\"box-sizing: border-box; user-select: text;\">Failure</strong></td>\n<td style=\"box-sizing: border-box; user-select: text; color: white; height: 25px; width: 117px; text-align: center; background-color: #522e2c;\"><strong style=\"box-sizing: border-box; user-select: text;\">Critical Failure</strong></td>\n</tr>\n<tr style=\"box-sizing: border-box; user-select: text; height: 17px;\">\n<td style=\"box-sizing: border-box; user-select: text; height: 17px; width: 32px; text-align: center; background-color: #f6f1e1;\">1</td>\n<td style=\"box-sizing: border-box; user-select: text; width: 70px; text-align: center; background-color: #f6f1e1; height: 17px;\">White</td>\n<td style=\"box-sizing: border-box; user-select: text; width: 152px; text-align: center; background-color: #f6f1e1; height: 17px;\">@Compendium[pf2e.conditionspf2e.TkIyaNPgTZFBCCuh]{Dazzled} 1 round</td>\n<td style=\"box-sizing: border-box; user-select: text; height: 17px; width: 117px; text-align: center; background-color: #f6f1e1;\">Dazzled 1 minute</td>\n</tr>\n<tr style=\"box-sizing: border-box; user-select: text; height: 17px;\">\n<td style=\"box-sizing: border-box; user-select: text; height: 17px; width: 32px; text-align: center; background-color: #eee5c8;\">2</td>\n<td style=\"box-sizing: border-box; user-select: text; width: 70px; text-align: center; background-color: #eee5c8; height: 17px;\">Red</td>\n<td style=\"box-sizing: border-box; user-select: text; width: 152px; text-align: center; background-color: #eee5c8; height: 17px;\">@Compendium[pf2e.conditionspf2e.MIRkyAjyBeXivMa7]{Enfeebled} 1 for 1 round</td>\n<td style=\"box-sizing: border-box; user-select: text; height: 17px; width: 117px; text-align: center; background-color: #eee5c8;\">Enfeebled 2 for 1 round</td>\n</tr>\n<tr style=\"box-sizing: border-box; user-select: text; height: 17px;\">\n<td style=\"box-sizing: border-box; user-select: text; height: 17px; width: 32px; text-align: center; background-color: #f6f1e1;\">3</td>\n<td style=\"box-sizing: border-box; user-select: text; width: 70px; text-align: center; background-color: #f6f1e1; height: 17px;\">Yellow</td>\n<td style=\"box-sizing: border-box; user-select: text; width: 152px; text-align: center; background-color: #f6f1e1; height: 17px;\">@Compendium[pf2e.conditionspf2e.TBSHQspnbcqxsmjL]{Frightened} 1</td>\n<td style=\"box-sizing: border-box; user-select: text; height: 17px; width: 117px; text-align: center; background-color: #f6f1e1;\">Frightened 2</td>\n</tr>\n<tr style=\"box-sizing: border-box; user-select: text; height: 19px;\">\n<td style=\"box-sizing: border-box; user-select: text; height: 19px; width: 32px; text-align: center; background-color: #eee5c8;\">4</td>\n<td style=\"box-sizing: border-box; user-select: text; width: 70px; text-align: center; background-color: #eee5c8; height: 19px;\">Blue</td>\n<td style=\"box-sizing: border-box; user-select: text; width: 152px; text-align: center; background-color: #eee5c8; height: 19px;\">@Compendium[pf2e.conditionspf2e.i3OJZU2nk64Df3xm]{Clumsy} 1 for 1 round</td>\n<td style=\"box-sizing: border-box; user-select: text; height: 19px; width: 117px; text-align: center; background-color: #eee5c8;\">Clumsy 2 for 1 round</td>\n</tr>\n</tbody>\n</table>\n<p style=\"box-sizing: border-box; user-select: text; color: #191813; font-size: 13px;\">&nbsp;</p>"
        },
        "duration": {
            "label": "Duration",
            "type": "String",
            "value": "varies"
        },
        "level": {
            "label": "Spell Level",
            "type": "Number",
            "value": 1
        },
        "location": {
            "label": "Spellcasting Entry Location",
            "type": "String",
            "value": ""
        },
        "materials": {
            "label": "Materials",
            "type": "String",
            "value": ""
        },
        "prepared": {
            "label": "Prepared Spell",
            "type": "String",
            "value": ""
        },
        "primarycheck": {
            "value": ""
        },
        "range": {
            "label": "Range",
            "type": "String",
            "value": "30 feet"
        },
        "rarity": {
            "value": "common"
        },
        "rules": [],
        "save": {
            "basic": "",
            "label": "Saving Throw",
            "type": "String",
            "value": "will"
        },
        "scaling": {
            "formula": "",
            "mode": "none"
        },
        "school": {
            "label": "Spell School",
            "type": "String",
            "value": "ill"
        },
        "secondarycasters": {
            "value": ""
        },
        "secondarycheck": {
            "value": ""
        },
        "source": {
            "label": "Source",
            "type": "String",
            "value": "https://2e.aonprd.com/Spells.aspx?ID=453"
        },
        "spellCategorie": {
            "value": "focus"
        },
        "spellCategory": {
            "value": ""
        },
        "spellType": {
            "label": "Spell Type",
            "type": "String",
            "value": "save"
        },
        "sustained": {
            "label": "Can be Sustained",
            "type": "Boolean",
            "value": false
        },
        "target": {
            "label": "Target",
            "type": "String",
            "value": ""
        },
        "time": {
            "label": "Casting Time",
            "type": "String",
            "value": "2"
        },
        "traditions": {
            "label": "Spell Traditions",
            "type": "String",
            "value": [
                "focus"
            ]
        },
        "traits": {
            "label": "Spell Traits",
            "rarity": {
                "value": "uncommon"
            },
            "type": "String",
            "value": [
                "cleric",
                "illusion",
                "visual"
            ]
        },
        "usage": {
            "value": "held-in-one-hand"
        }
    },
    "effects": [],
    "flags": {},
    "img": "systems/pf2e/icons/spells/splash-of-art.jpg",
    "name": "Splash of Art",
    "permission": {
        "default": 0
    },
    "type": "spell"
}
