{
    "_id": "5WT7gdzHNb5BG1J0",
    "data": {
        "description": {
            "chat": "",
            "unidentified": "",
            "value": "<div><strong>Weapons</strong> sickle, sling with 20 bullets, staff</div>\n<div><strong>Gear</strong> adventurer’s pack, explorer's clothing, material component pouch</div>\n<div><strong>Options</strong> <a class=\"entity-link\" data-pack=\"pf2e.equipment-srd\" data-id=\"Yf7maiRDmmHAyF82\" draggable=\"true\"><i class=\"fas fa-suitcase\"></i> Cookware</a> (1 gp), <a class=\"entity-link\" data-pack=\"pf2e.equipment-srd\" data-id=\"s1vB3HdXjMigYAnY\" draggable=\"true\"><i class=\"fas fa-suitcase\"></i> Healer's Tools</a> (5 gp)</div>"
        },
        "equippedBulk": {
            "value": ""
        },
        "items": {
            "1n83c": {
                "id": "5Ew82vBF9YfaiY9f",
                "img": "systems/pf2e/icons/equipment/treasure/currency/silver-pieces.jpg",
                "isContainer": false,
                "items": {},
                "name": "Silver Pieces",
                "pack": "pf2e.equipment-srd",
                "quantity": 6
            },
            "45yl3": {
                "id": "B6B7tBWJSqOBz5zz",
                "img": "systems/pf2e/icons/equipment/treasure/currency/gold-pieces.jpg",
                "isContainer": false,
                "items": {},
                "name": "Gold Pieces",
                "pack": "pf2e.equipment-srd",
                "quantity": 12
            },
            "5172o": {
                "id": "MKSeXwUm56c15MZa",
                "img": "systems/pf2e/icons/equipment/weapons/sling-bullets.jpg",
                "isContainer": false,
                "items": {},
                "name": "Sling Bullets",
                "pack": "pf2e.equipment-srd",
                "quantity": 20
            },
            "5weem": {
                "id": "UCH4myuFnokGv0vF",
                "img": "systems/pf2e/icons/equipment/sling.png",
                "isContainer": false,
                "items": {},
                "name": "Sling",
                "pack": "pf2e.equipment-srd",
                "quantity": 1
            },
            "lkd8s": {
                "id": "dDIPA1WE9ESF67EB",
                "img": "systems/pf2e/icons/equipment/adventuring-gear/clothes-explorers.jpg",
                "isContainer": false,
                "items": {},
                "name": "Clothing (Explorer's)",
                "pack": "pf2e.equipment-srd",
                "quantity": 1
            },
            "nwx1e": {
                "id": "ynnBwzkzsR6B73iO",
                "img": "systems/pf2e/icons/equipment/sickle.png",
                "isContainer": false,
                "items": {},
                "name": "Sickle",
                "pack": "pf2e.equipment-srd",
                "quantity": 1
            },
            "rh7ni": {
                "id": "lzJ8AVhRcbFul5fh",
                "img": "systems/pf2e/icons/equipment/treasure/currency/copper-pieces.jpg",
                "isContainer": false,
                "items": {},
                "name": "Copper Pieces",
                "pack": "pf2e.equipment-srd",
                "quantity": 8
            },
            "x82fi": {
                "id": "FVjTuBCIefAgloUU",
                "img": "systems/pf2e/icons/equipment/staff.png",
                "isContainer": false,
                "items": {},
                "name": "Staff",
                "pack": "pf2e.equipment-srd",
                "quantity": 1
            },
            "zrmra": {
                "id": "VHxXMvBeBTq2FSdf",
                "img": "systems/pf2e/icons/equipment/adventuring-gear/material-component-pouch.jpg",
                "isContainer": false,
                "items": {},
                "name": "Material Component Pouch",
                "pack": "pf2e.equipment-srd",
                "quantity": 1
            },
            "zx9h5": {
                "id": "2req0jGaxz8hScdB",
                "img": "systems/pf2e/icons/equipment/adventuring-gear/adventurers-pack.jpg",
                "isContainer": true,
                "items": {},
                "name": "Adventurer's Pack",
                "pack": "pf2e.equipment-srd",
                "quantity": 1
            }
        },
        "price": {
            "value": "2 gp, 3 sp, 2 cp"
        },
        "rarity": {
            "value": "common"
        },
        "source": {
            "value": ""
        },
        "traits": {
            "custom": "",
            "rarity": {
                "value": "common"
            },
            "value": [
                "witch"
            ]
        },
        "usage": {
            "value": "held-in-one-hand"
        },
        "weight": {
            "value": "-"
        }
    },
    "effects": [],
    "flags": {},
    "img": "systems/pf2e/icons/equipment/adventuring-gear/classkit-witch.jpg",
    "name": "Class Kit (Witch)",
    "permission": {
        "default": 0
    },
    "type": "kit"
}
