{
    "_id": "xzpMQ2ZRn9zC23XG",
    "data": {
        "actionCategory": {
            "value": ""
        },
        "actionType": {
            "value": "action"
        },
        "actions": {
            "value": "1"
        },
        "description": {
            "chat": "",
            "unidentified": "",
            "value": "<p><strong>Requirements</strong> You are adjacent to at least one enemy.</p>\n<hr>\n<p>You instinctively know how to flee danger. You Stride up to your Speed, with a +5-foot status bonus to your Speed, and you gain a +2 circumstance bonus to AC against reactions triggered by this movement. You must end this movement in a space that's not adjacent to any enemy.</p>"
        },
        "featType": {
            "value": "ancestry"
        },
        "level": {
            "value": "1"
        },
        "prerequisites": {
            "value": ""
        },
        "rarity": {
            "value": "common"
        },
        "rules": [],
        "source": {
            "value": ""
        },
        "traits": {
            "rarity": {
                "value": "common"
            },
            "value": [
                "kobold"
            ]
        },
        "usage": {
            "value": ""
        }
    },
    "flags": {},
    "img": "systems/pf2e/icons/features/feats/feats.jpg",
    "name": "Scamper",
    "permission": {
        "default": 0
    },
    "type": "feat"
}
