{
    "_id": "HisaZTk67YAxLGBq",
    "data": {
        "ability": {
            "value": ""
        },
        "area": {
            "areaType": "",
            "value": null
        },
        "areasize": {
            "value": ""
        },
        "components": {
            "value": "material, somatic, verbal"
        },
        "cost": {
            "value": ""
        },
        "damage": {
            "applyMod": false,
            "value": "4d6"
        },
        "damageType": {
            "value": "mental"
        },
        "description": {
            "chat": "",
            "unidentified": "",
            "value": "<p>You create illusory hazards, such as spinning blades or a puddle of acid, in four 10-foot-by-10-foot spaces within range. The hazards are merely a mental projection, and a creature receives a Will save each time it touches a hazard or is occupying one&rsquo;s space at the start of its turn. Depending on the result, the creature takes 4d6 mental damage and might have difficulty moving through the area. A creature can take this damage only once per turn, even if it moves through several hazards. Choose bludgeoning, slashing, piercing, acid, cold, electricity, fire, or sonic damage when you cast <em>ephemeral hazards</em>; resistances and weaknesses to those damage types apply if the target thinks they do, as judged by the GM. You can freely choose the appearance and damage type of each hazard as long as its appearance reflects the type of damage it deals (for instance, a hazard that deals piercing damage might take the form of sharpened spikes).</p>\n<hr />\n<p><span id=\"ctl00_MainContent_DetailedOutput\"><strong>Critical Success</strong> The creature is unaffected by the hazards and no longer needs to attempt Will saves against them.</span></p>\n<p><span id=\"ctl00_MainContent_DetailedOutput\"><strong>Success</strong> The creature realizes the hazards aren&rsquo;t real but still takes half damage from them; on future Will saves against the hazards, the creature continues to use this result unless it rolls a critical success.</span></p>\n<p><span id=\"ctl00_MainContent_DetailedOutput\"><strong>Failure</strong> The target takes full damage and treats the square as difficult terrain.</span></p>\n<p><span id=\"ctl00_MainContent_DetailedOutput\"><strong>Critical Failure</strong> The target takes double damage and cannot pass through a square containing a hazard.</span></p>\n<hr />\n<p><strong>Heightened (+1)</strong> The damage increases by 1d6.&nbsp;</p>"
        },
        "duration": {
            "value": "1 minute"
        },
        "level": {
            "value": 4
        },
        "location": {
            "value": ""
        },
        "materials": {
            "value": ""
        },
        "prepared": {
            "value": ""
        },
        "primarycheck": {
            "value": ""
        },
        "range": {
            "value": "60 feet"
        },
        "rarity": {
            "value": "common"
        },
        "rules": [],
        "save": {
            "basic": "",
            "value": "will"
        },
        "scaling": {
            "formula": "1d6",
            "mode": "level1"
        },
        "school": {
            "value": "ill"
        },
        "secondarycasters": {
            "value": ""
        },
        "secondarycheck": {
            "value": ""
        },
        "source": {
            "value": ""
        },
        "spellCategorie": {
            "value": "focus"
        },
        "spellCategory": {
            "value": ""
        },
        "spellType": {
            "value": "save"
        },
        "sustained": {
            "value": false
        },
        "target": {
            "value": ""
        },
        "time": {
            "value": "3"
        },
        "traditions": {
            "custom": "",
            "value": [
                "focus"
            ]
        },
        "traits": {
            "custom": "",
            "rarity": {
                "value": "common"
            },
            "value": [
                "visual",
                "mental",
                "illusion"
            ]
        },
        "usage": {
            "value": "held-in-one-hand"
        }
    },
    "effects": [],
    "flags": {},
    "img": "systems/pf2e/icons/spells/ephemeral-hazards.jpg",
    "name": "Ephemeral Hazards",
    "permission": {
        "default": 0
    },
    "type": "spell"
}
