{
    "_id": "kzfRjSrq4JNZlc32",
    "data": {
        "activation": {
            "condition": "",
            "cost": 0,
            "type": ""
        },
        "autoDestroy": {
            "_deprecated": true,
            "value": true
        },
        "autoUse": {
            "_deprecated": true,
            "value": true
        },
        "brokenThreshold": {
            "value": 0
        },
        "bulkCapacity": {
            "value": ""
        },
        "charges": {
            "_deprecated": true,
            "max": "1",
            "value": "1"
        },
        "collapsed": {
            "value": false
        },
        "consumableType": {
            "value": "talasman"
        },
        "consume": {
            "_deprecated": true,
            "value": null
        },
        "containerId": {
            "value": ""
        },
        "description": {
            "chat": "",
            "unidentified": "",
            "value": "<p><strong>Activate&nbsp;</strong><span style=\"font-family: 'Pathfinder2eActions'; font-size: 1.8em; display: inline;\">2</span> Envision;</p>\n<p><strong>Requirements</strong> You are an expert in Stealth</p>\n<hr />\n<p>This teardrop-shaped gemstone has triangular facets and looks suitable for fancy attire, although close inspection shows that it's hollow. When it's activated, you can instantly impart up to 1 minute of speech (roughly 150 words) telepathically to any creatures you choose within 100 feet. You can impart this instantaneous telepathic message to creatures that you perceive and creatures @Compendium[pf2e.conditionitems.iU0fEDdBp3rXpTMC]{Hidden} to you, but you can't do so to @Compendium[pf2e.conditionitems.VRSef5y1LmL2Hkjf]{Undetected} creatures. Once used, the whisper briolette becomes unusable and subtly vanishes within the next few minutes, rather than crumbling to dust.</p>"
        },
        "duration": {
            "units": "",
            "value": null
        },
        "equipped": {
            "value": false
        },
        "equippedBulk": {
            "value": ""
        },
        "hardness": {
            "value": 0
        },
        "hp": {
            "value": 0
        },
        "identified": {
            "value": false
        },
        "invested": {
            "value": false
        },
        "level": {
            "value": "7"
        },
        "maxHp": {
            "value": 0
        },
        "negateBulk": {
            "value": "0"
        },
        "preciousMaterial": {
            "value": ""
        },
        "preciousMaterialGrade": {
            "value": ""
        },
        "price": {
            "value": "55 gp"
        },
        "quantity": {
            "value": "1"
        },
        "range": {
            "long": null,
            "units": "",
            "value": null
        },
        "rarity": {
            "value": "common"
        },
        "rules": [],
        "source": {
            "value": ""
        },
        "stackGroup": {
            "value": ""
        },
        "target": {
            "type": "",
            "units": "",
            "value": null
        },
        "traits": {
            "custom": "",
            "rarity": {
                "value": "uncommon"
            },
            "usage": {
                "value": "affixed-to-armor"
            },
            "value": [
                "consumable",
                "divination",
                "magical",
                "mental",
                "talisman"
            ]
        },
        "usage": {
            "value": "held-in-one-hand"
        },
        "uses": {
            "autoDestroy": true,
            "autoUse": true,
            "max": 0,
            "per": null,
            "value": 0
        },
        "weight": {
            "value": "-"
        }
    },
    "effects": [],
    "flags": {
        "core": {
            "sourceId": "Item.1fBozGVCCoTDVO6f"
        }
    },
    "img": "systems/pf2e/icons/equipment/consumables/talismans/whisper-briolette.jpg",
    "name": "Whisper Briolette",
    "permission": {
        "default": 0
    },
    "type": "consumable"
}
