{
    "_id": "B6eoSmowSFNlhj9h",
    "data": {
        "actionCategory": {
            "value": ""
        },
        "actionType": {
            "value": "passive"
        },
        "actions": {
            "value": ""
        },
        "description": {
            "chat": "",
            "unidentified": "",
            "value": "<p><span id=\"ctl00_MainContent_DetailedOutput\"><strong>Prerequisites</strong> Hobgoblin Weapon Familiarity<br></span></p>\n<hr>\n<p>You know how to efficiently utilize the weapons soldiers use in close quarters. Whenever you score a critical hit using a weapon of the polearm, spear, or sword group, you apply the weapon's critical specialization effect.</p>"
        },
        "featType": {
            "value": "ancestry"
        },
        "level": {
            "value": "5"
        },
        "prerequisites": {
            "value": "Hobgoblin Weapon Familiarity"
        },
        "rarity": {
            "value": "common"
        },
        "source": {
            "value": ""
        },
        "traits": {
            "custom": "",
            "rarity": {
                "value": "common"
            },
            "value": [
                "hobgoblin"
            ]
        },
        "usage": {
            "value": "held-in-one-hand"
        }
    },
    "flags": {},
    "img": "systems/pf2e/icons/features/feats/feats.jpg",
    "name": "Hobgoblin Weapon Discipline",
    "permission": {
        "default": 0
    },
    "type": "feat"
}
