{
    "_id": "G9058881e1ci9X1C",
    "content": "<p><span class=\"fontstyle0\">You had to frighten off pirates or slavers looking to capture you and this character. </span></p>\n<p><span class=\"fontstyle0\">Add the <a class=\"entity-link\" draggable=\"true\" data-pack=\"pf2e.feats-srd\" data-id=\"gUqvezs2zzoTXFAI\"><i class=\"fas fa-suitcase\"></i> Group Coercion</a> skill feat to your background options.</span><br style=\"font-style: normal; font-variant: normal; font-weight: normal; letter-spacing: normal; line-height: normal; orphans: 2; text-align: -webkit-auto; text-indent: 0px; text-transform: none; white-space: normal; widows: 2; word-spacing: 0px; -webkit-text-size-adjust: auto; -webkit-text-stroke-width: 0px;\"><br></p>",
    "flags": {},
    "name": "Desperate Intimidation",
    "permission": {
        "default": 0
    }
}
