{
    "_id": "oUcB71V1jVaM8SFx",
    "data": {
        "actionCategory": {
            "value": ""
        },
        "actionType": {
            "value": "passive"
        },
        "actions": {
            "value": ""
        },
        "description": {
            "chat": "",
            "unidentified": "",
            "value": "<p><strong>Prerequisites </strong><a class=\"entity-link\" data-pack=\"pf2e.feats-srd\" data-id=\"Asb0UsQqeATsxqFJ\" draggable=\"true\"><i class=\"fas fa-suitcase\"></i> Courageous Assault</a></p>\n<hr>\n<p>In the triumph of battle, you can share the glory with another ally.</p>\n<p>When the ally you chose for Courageous Assault critically succeeds at the <a class=\"entity-link\" data-pack=\"pf2e.actionspf2e\" data-id=\"VjxZFuUXrCU94MWR\" draggable=\"true\"><i class=\"fas fa-suitcase\"></i> Strike</a> granted by that action, another ally affected by your <a class=\"entity-link\" data-pack=\"pf2e.spells-srd\" data-id=\"IAjvwqgiDr3qGYxY\" draggable=\"true\"><i class=\"fas fa-suitcase\"></i> Inspire Courage</a> composition spell can immediately use a reaction to make a melee Strike.</p>\n<p>Since the second ally wasn't the ally you chose for Courageous Assault, this effect doesn't continue to a third ally, even if the second ally also critically succeeds at their Strike.</p>"
        },
        "featType": {
            "value": "class"
        },
        "level": {
            "value": "12"
        },
        "prerequisites": {
            "value": "Courageous Assault"
        },
        "rarity": {
            "value": "common"
        },
        "rules": [],
        "source": {
            "value": ""
        },
        "traits": {
            "rarity": {
                "value": "common"
            },
            "value": [
                "bard"
            ]
        },
        "usage": {
            "value": ""
        }
    },
    "flags": {},
    "img": "systems/pf2e/icons/features/feats/feats.jpg",
    "name": "Shared Assault",
    "permission": {
        "default": 0
    },
    "type": "feat"
}
