{
    "_id": "mDPLoPYwuPo3o0Wj",
    "description": "Table of 3rd-Level Consumables",
    "displayRoll": true,
    "flags": {
        "core": {
            "sourceId": "RollTable.jUXnZUpKcg5sjNDb"
        }
    },
    "formula": "1d150",
    "img": "icons/svg/d20-grey.svg",
    "name": "3rd-Level Consumables",
    "permission": {
        "default": 0
    },
    "replacement": true,
    "results": [
        {
            "_id": "zZSrd19DhonJx5Cw",
            "collection": "pf2e.equipment-srd",
            "drawn": false,
            "flags": {},
            "img": "systems/pf2e/icons/equipment/consumables/ammunition/beacon-shot.jpg",
            "range": [
                1,
                6
            ],
            "resultId": "taAjenWKjBJpQyrE",
            "text": "Beacon Shot",
            "type": 2,
            "weight": 6
        },
        {
            "_id": "CtCW6OWjZ9LCyV6u",
            "collection": "pf2e.equipment-srd",
            "drawn": false,
            "flags": {},
            "img": "systems/pf2e/icons/equipment/consumables/ammunition/sleep-arrow.jpg",
            "range": [
                7,
                12
            ],
            "resultId": "RcQ4ZIzRK2xLf4G5",
            "text": "Sleep Arrow",
            "type": 2,
            "weight": 6
        },
        {
            "_id": "serJqIWHgbmbhDzy",
            "collection": "pf2e.equipment-srd",
            "drawn": false,
            "flags": {},
            "img": "systems/pf2e/icons/equipment/consumables/ammunition/spellstrike-ammunition.jpg",
            "range": [
                13,
                18
            ],
            "resultId": "NSo0bFX7DGGjqKKl",
            "text": "Spellstrike Ammunition (Type I)",
            "type": 2,
            "weight": 6
        },
        {
            "_id": "iwuBnzg81kfvN9qh",
            "collection": "pf2e.equipment-srd",
            "drawn": false,
            "flags": {},
            "img": "systems/pf2e/icons/equipment/consumables/ammunition/vine-arrow.jpg",
            "range": [
                19,
                24
            ],
            "resultId": "eEnzHpPEbdGgRETM",
            "text": "Vine Arrow",
            "type": 2,
            "weight": 6
        },
        {
            "_id": "wrKtGlVFkGEmsR3E",
            "collection": "pf2e.equipment-srd",
            "drawn": false,
            "flags": {},
            "img": "systems/pf2e/icons/equipment/alchemical-items/alchemical-bombs/acid-flask.jpg",
            "range": [
                25,
                30
            ],
            "resultId": "SgtqZxt26BdjUmEB",
            "text": "Acid Flask (Moderate)",
            "type": 2,
            "weight": 6
        },
        {
            "_id": "6fofSWDLAli7D9Vf",
            "collection": "pf2e.equipment-srd",
            "drawn": false,
            "flags": {},
            "img": "systems/pf2e/icons/equipment/alchemical-items/alchemical-bombs/alchemists-fire.jpg",
            "range": [
                31,
                36
            ],
            "resultId": "gWr4q4HiyGhETA8H",
            "text": "Alchemist's Fire (Moderate)",
            "type": 2,
            "weight": 6
        },
        {
            "_id": "K6tpDqDyQvis48Iu",
            "collection": "pf2e.equipment-srd",
            "drawn": false,
            "flags": {},
            "img": "systems/pf2e/icons/equipment/alchemical-items/alchemical-bombs/bottled-lightning.jpg",
            "range": [
                37,
                42
            ],
            "resultId": "97QyNEOAyYLdGaYc",
            "text": "Bottled Lightning (Moderate)",
            "type": 2,
            "weight": 6
        },
        {
            "_id": "J92d4MpwclPadwOc",
            "collection": "pf2e.equipment-srd",
            "drawn": false,
            "flags": {},
            "img": "systems/pf2e/icons/equipment/alchemical-items/alchemical-bombs/frost-vial.jpg",
            "range": [
                43,
                48
            ],
            "resultId": "nVvH1ZcM7OwIVIs8",
            "text": "Frost Vial (Moderate)",
            "type": 2,
            "weight": 6
        },
        {
            "_id": "3HZHqYqejkaKCSlQ",
            "collection": "pf2e.equipment-srd",
            "drawn": false,
            "flags": {},
            "img": "systems/pf2e/icons/equipment/alchemical-items/alchemical-bombs/tanglefoot-bag.jpg",
            "range": [
                49,
                54
            ],
            "resultId": "evBPzM1VsuYcoenn",
            "text": "Tanglefoot Bag (Moderate)",
            "type": 2,
            "weight": 6
        },
        {
            "_id": "tcFhkk6uFUkkQWMk",
            "collection": "pf2e.equipment-srd",
            "drawn": false,
            "flags": {},
            "img": "systems/pf2e/icons/equipment/alchemical-items/alchemical-bombs/thunderstone.jpg",
            "range": [
                55,
                60
            ],
            "resultId": "JOaELkzLWTywhn5Z",
            "text": "Thunderstone (Moderate)",
            "type": 2,
            "weight": 6
        },
        {
            "_id": "V7QV2iZcpQW0W4Bl",
            "collection": "pf2e.equipment-srd",
            "drawn": false,
            "flags": {},
            "img": "systems/pf2e/icons/equipment/consumables/other-consumables/feather-token.jpg",
            "range": [
                61,
                66
            ],
            "resultId": "fFq8nsGvSUgzVeND",
            "text": "Feather Token (Bird)",
            "type": 2,
            "weight": 6
        },
        {
            "_id": "VEeUe1e8wg9Ap9a7",
            "collection": "pf2e.equipment-srd",
            "drawn": false,
            "flags": {},
            "img": "systems/pf2e/icons/equipment/consumables/other-consumables/feather-token.jpg",
            "range": [
                67,
                72
            ],
            "resultId": "Dn2KQgIeWNijaUzL",
            "text": "Feather Token (Chest)",
            "type": 2,
            "weight": 6
        },
        {
            "_id": "UpLZlf4UpQIHnPZF",
            "collection": "pf2e.equipment-srd",
            "drawn": false,
            "flags": {},
            "img": "systems/pf2e/icons/equipment/alchemical-items/alchemical-elixirs/bestial-mutagen.jpg",
            "range": [
                73,
                78
            ],
            "resultId": "VISk5uLPVIvNWovB",
            "text": "Bestial Mutagen (Moderate)",
            "type": 2,
            "weight": 6
        },
        {
            "_id": "vj4JoRI7CsrYl8e0",
            "collection": "pf2e.equipment-srd",
            "drawn": false,
            "flags": {},
            "img": "systems/pf2e/icons/equipment/alchemical-items/alchemical-elixirs/cognitive-mutagen.jpg",
            "range": [
                79,
                84
            ],
            "resultId": "qpzL9UnTi4cDhy6J",
            "text": "Cognitive Mutagen (Moderate)",
            "type": 2,
            "weight": 6
        },
        {
            "_id": "AzSagjT1yaUEXvLF",
            "collection": "pf2e.equipment-srd",
            "drawn": false,
            "flags": {},
            "img": "systems/pf2e/icons/equipment/alchemical-items/alchemical-elixirs/juggernaut-mutagen.jpg",
            "range": [
                85,
                90
            ],
            "resultId": "mj9i9GeQTADByNPZ",
            "text": "Juggernaut Mutagen (Moderate)",
            "type": 2,
            "weight": 6
        },
        {
            "_id": "aRWR0oDpz3lG7Ye6",
            "collection": "pf2e.equipment-srd",
            "drawn": false,
            "flags": {},
            "img": "systems/pf2e/icons/equipment/alchemical-items/alchemical-elixirs/quicksilver-mutagen.jpg",
            "range": [
                91,
                96
            ],
            "resultId": "n52BSbZsnx4Vmt2p",
            "text": "Quicksilver Mutagen (Moderate)",
            "type": 2,
            "weight": 6
        },
        {
            "_id": "ZIzH7JvfkVjO9W6M",
            "collection": "pf2e.equipment-srd",
            "drawn": false,
            "flags": {},
            "img": "systems/pf2e/icons/equipment/alchemical-items/alchemical-elixirs/serene-mutagen.jpg",
            "range": [
                97,
                102
            ],
            "resultId": "XEYveTvLH1lJ4jeI",
            "text": "Serene Mutagen (Moderate)",
            "type": 2,
            "weight": 6
        },
        {
            "_id": "txw59NSuj5GuarW9",
            "collection": "pf2e.equipment-srd",
            "drawn": false,
            "flags": {},
            "img": "systems/pf2e/icons/equipment/alchemical-items/alchemical-elixirs/silvertongue-mutagen.jpg",
            "range": [
                103,
                108
            ],
            "resultId": "lIExlUFBKvBue8hb",
            "text": "Silvertongue Mutagen (Moderate)",
            "type": 2,
            "weight": 6
        },
        {
            "_id": "8SZCYCDAopjULZb8",
            "collection": "pf2e.equipment-srd",
            "drawn": false,
            "flags": {},
            "img": "systems/pf2e/icons/equipment/consumables/oils/oil-of-mending.jpg",
            "range": [
                109,
                114
            ],
            "resultId": "QN8UIz0nMcnLUWHu",
            "text": "Oil of Mending",
            "type": 2,
            "weight": 6
        },
        {
            "_id": "cmwKZov12lzmZ4r3",
            "collection": "pf2e.equipment-srd",
            "drawn": false,
            "flags": {},
            "img": "systems/pf2e/icons/equipment/alchemical-items/alchemical-poisons/cytillesh-oil.jpg",
            "range": [
                115,
                120
            ],
            "resultId": "aZm1x9tpvBAT8YCd",
            "text": "Cytillesh Oil",
            "type": 2,
            "weight": 6
        },
        {
            "_id": "xsjcKG0Z6oa3E05T",
            "collection": "pf2e.equipment-srd",
            "drawn": false,
            "flags": {},
            "img": "systems/pf2e/icons/equipment/alchemical-items/alchemical-poisons/graveroot.jpg",
            "range": [
                121,
                126
            ],
            "resultId": "qQqAY59NgGNoy2xr",
            "text": "Graveroot",
            "type": 2,
            "weight": 6
        },
        {
            "_id": "13S0UvlDiZlKJ8S9",
            "collection": "pf2e.equipment-srd",
            "drawn": false,
            "flags": {},
            "img": "systems/pf2e/icons/equipment/consumables/potions/healing-potion.jpg",
            "range": [
                127,
                132
            ],
            "resultId": "e0vSAQfxhHauiAoD",
            "text": "Healing Potion (Lesser)",
            "type": 2,
            "weight": 6
        },
        {
            "_id": "Anedv6AMhEkiHGj0",
            "collection": "pf2e.equipment-srd",
            "drawn": false,
            "flags": {},
            "img": "systems/pf2e/icons/equipment/consumables/potions/potion-of-water-breathing.jpg",
            "range": [
                133,
                138
            ],
            "resultId": "WQhnfj1LbrEzvh8z",
            "text": "Potion of Water Breathing",
            "type": 2,
            "weight": 6
        },
        {
            "_id": "Fipi7flIfw6EvMea",
            "collection": "pf2e.equipment-srd",
            "drawn": false,
            "flags": {},
            "img": "systems/pf2e/icons/equipment/consumables/other-consumables/spell-scroll.jpg",
            "range": [
                139,
                144
            ],
            "resultId": "Y7UD64foDbDMV9sx",
            "text": "Scroll of 2nd-level Spell",
            "type": 2,
            "weight": 6
        },
        {
            "_id": "mJWgsDXgL2Dv3BOw",
            "collection": "pf2e.equipment-srd",
            "drawn": false,
            "flags": {},
            "img": "systems/pf2e/icons/equipment/consumables/talismans/feather-step-stone.jpg",
            "range": [
                145,
                150
            ],
            "resultId": "0CNSvLpeSM4aIfPJ",
            "text": "Feather Step Stone",
            "type": 2,
            "weight": 6
        }
    ]
}
