{
    "_id": "a2wXdQHiIoj3lHoe",
    "data": {
        "actionCategory": {
            "value": ""
        },
        "actionType": {
            "value": "action"
        },
        "actions": {
            "value": "1"
        },
        "description": {
            "chat": "",
            "unidentified": "",
            "value": "<p><strong>Prerequisites </strong>Spellmaster Dedication</p>\n<p><strong>Frequency </strong>once per round</p>\n<hr>\n<p>Choose one spell with a sustained duration that one of your allies has in effect. You must be within 30 feet of the chosen ally. The ally can Sustain the Spell once as a free action, triggered at the start of their next turn.</p>"
        },
        "featType": {
            "value": "archetype"
        },
        "level": {
            "value": "12"
        },
        "prerequisites": {
            "value": "Spellmaster Dedication"
        },
        "rarity": {
            "value": "common"
        },
        "rules": [],
        "source": {
            "value": ""
        },
        "traits": {
            "custom": "",
            "rarity": {
                "value": "common"
            },
            "value": [
                "archetype"
            ]
        },
        "usage": {
            "value": "held-in-one-hand"
        }
    },
    "effects": [],
    "flags": {
        "core": {
            "sourceId": "Item.eImJocrux76Abe91"
        }
    },
    "img": "systems/pf2e/icons/features/feats/feats.jpg",
    "name": "Communal Sustain",
    "permission": {
        "default": 0
    },
    "type": "feat"
}
