{
    "_id": "I1ffBVISxLr2gC4u",
    "data": {
        "active": true,
        "alsoApplies": {
            "linked": [],
            "unlinked": []
        },
        "base": "Unfriendly",
        "description": {
            "chat": "",
            "unidentified": "",
            "value": "<p>This condition reflects a creature’s disposition toward a particular character, and it affects only creatures that are not player characters. A creature that is unfriendly to a character dislikes and specifically distrusts that character. The unfriendly creature won’t accept <a class=\"entity-link\" draggable=\"true\" data-pack=\"pf2e.actionspf2e\" data-id=\"DCb62iCBrJXy0Ik6\"> Requests</a> from the character.</p>"
        },
        "duration": {
            "perpetual": true,
            "text": "",
            "value": 0
        },
        "group": "attitudes",
        "hud": {
            "img": {
                "useStatusName": true,
                "value": "system/pf2e/icons/conditions-2/unfriendly.png"
            },
            "selectable": true,
            "statusName": "unfriendly"
        },
        "modifiers": [],
        "overrides": [
            "Friendly",
            "Hostile",
            "Indifferent",
            "Helpful"
        ],
        "rarity": {
            "value": "common"
        },
        "references": {
            "children": [],
            "immunityFrom": [],
            "overriddenBy": [],
            "overrides": []
        },
        "removable": true,
        "rules": [],
        "source": {
            "value": ""
        },
        "sources": {
            "hud": false
        },
        "traits": {
            "value": []
        },
        "usage": {
            "value": "held-in-one-hand"
        },
        "value": {
            "immutable": false,
            "isValued": false,
            "modifiers": [],
            "value": 1
        }
    },
    "effects": [],
    "flags": {
        "pf2e": {
            "condition": true
        }
    },
    "img": "systems/pf2e/icons/conditions/unfriendly.png",
    "name": "Unfriendly",
    "permission": {
        "default": 0
    },
    "type": "condition"
}
