{
    "_id": "NOkobOGi0nqsboHI",
    "description": "Table of 20th-Level Permanent Items",
    "displayRoll": true,
    "flags": {
        "core": {
            "sourceId": "RollTable.VrO6OsusZQJydXKR"
        }
    },
    "formula": "1d44",
    "img": "icons/svg/d20-grey.svg",
    "name": "20th-Level Permanent Items",
    "permission": {
        "default": 0
    },
    "replacement": true,
    "results": [
        {
            "_id": "SxgcvC6PMDQIPXv2",
            "drawn": false,
            "flags": {},
            "img": "icons/svg/d20-black.svg",
            "range": [
                1,
                6
            ],
            "resultId": "",
            "text": "+3 major resilient Armor",
            "type": 0,
            "weight": 6
        },
        {
            "_id": "pDcXhXLox9zUK1ve",
            "collection": "pf2e.equipment-srd",
            "drawn": false,
            "flags": {},
            "img": "systems/pf2e/icons/equipment/armor/precious-metal-armor/elven-chain.jpg",
            "range": [
                7,
                9
            ],
            "resultId": "PuqdH7DmNsN79HyE",
            "text": "Elven Chain (High-Grade)",
            "type": 2,
            "weight": 3
        },
        {
            "_id": "z4BMPsRKIjkv5nFV",
            "drawn": false,
            "flags": {},
            "img": "icons/svg/d20-black.svg",
            "range": [
                10,
                10
            ],
            "resultId": "",
            "text": "Orichalcum Armor (High-Grade)",
            "type": 0,
            "weight": 1
        },
        {
            "_id": "iYf3xiuu1PJYrEfV",
            "collection": "pf2e.equipment-srd",
            "drawn": false,
            "flags": {},
            "img": "systems/pf2e/icons/equipment/runes/fundamental-armor-runes/armor-potency.jpg",
            "range": [
                11,
                16
            ],
            "resultId": "WKcvvaZ0LxwYreb7",
            "text": "Resilient (Major)",
            "type": 2,
            "weight": 6
        },
        {
            "_id": "Ta6KiuexBRSqdASJ",
            "collection": "pf2e.equipment-srd",
            "drawn": false,
            "flags": {},
            "img": "systems/pf2e/icons/equipment/staves/staff-of-the-magi.jpg",
            "range": [
                17,
                17
            ],
            "resultId": "nI9shR1EG3P09I8r",
            "text": "Staff of the Magi",
            "type": 2,
            "weight": 1
        },
        {
            "_id": "6UgkskpmQmziHdAh",
            "collection": "pf2e.equipment-srd",
            "drawn": false,
            "flags": {},
            "img": "systems/pf2e/icons/equipment/wands/specialty-wands/wand-of-slaying.jpg",
            "range": [
                18,
                23
            ],
            "resultId": "mMZWdoHvP2yYJzrR",
            "text": "Wand of Slaying (9th-Level Spell)",
            "type": 2,
            "weight": 6
        },
        {
            "_id": "3rf5LFAdIZ1EYl7q",
            "collection": "pf2e.equipment-srd",
            "drawn": false,
            "flags": {},
            "img": "systems/pf2e/icons/equipment/wands/specialty-wands/wand-of-smoldering-fireballs.jpg",
            "range": [
                24,
                29
            ],
            "resultId": "tBwMPimZ6A93XpHf",
            "text": "Wand of Smoldering Fireballs (9th-Level Spell)",
            "type": 2,
            "weight": 6
        },
        {
            "_id": "QCgX2cEDaVItV1xO",
            "collection": "pf2e.equipment-srd",
            "drawn": false,
            "flags": {},
            "img": "systems/pf2e/icons/equipment/wands/specialty-wands/wand-of-widening.jpg",
            "range": [
                30,
                35
            ],
            "resultId": "t5978mZ6CqfUDCP6",
            "text": "Wand of Widening (9th-Level Spell)",
            "type": 2,
            "weight": 6
        },
        {
            "_id": "tjWwsoo48SNItXrR",
            "collection": "pf2e.equipment-srd",
            "drawn": false,
            "flags": {},
            "img": "systems/pf2e/icons/equipment/weapons/specific-magic-weapons/sky-hammer.jpg",
            "range": [
                36,
                36
            ],
            "resultId": "ANvbi1zKF1So8bON",
            "text": "Sky Hammer",
            "type": 2,
            "weight": 1
        },
        {
            "_id": "4ELJmIx2epqXwUdn",
            "collection": "pf2e.equipment-srd",
            "drawn": false,
            "flags": {},
            "img": "systems/pf2e/icons/equipment/worn-items/other-worn-items/bracers-of-armor.jpg",
            "range": [
                37,
                42
            ],
            "resultId": "rqJzQawe3CbXiWnG",
            "text": "Bracers of Armor III",
            "type": 2,
            "weight": 6
        },
        {
            "_id": "0JhebUbi2fejagKA",
            "collection": "pf2e.equipment-srd",
            "drawn": false,
            "flags": {},
            "img": "systems/pf2e/icons/equipment/worn-items/other-worn-items/ring-of-spell-turning.jpg",
            "range": [
                43,
                43
            ],
            "resultId": "Ivqd84dkWA8DW8YJ",
            "text": "Ring of Spell Turning",
            "type": 2,
            "weight": 1
        },
        {
            "_id": "G9VmMvjTaacfwl2w",
            "collection": "pf2e.equipment-srd",
            "drawn": false,
            "flags": {},
            "img": "systems/pf2e/icons/equipment/worn-items/other-worn-items/whisper-of-the-first-lie.jpg",
            "range": [
                44,
                44
            ],
            "resultId": "sKyJDfHdKacfbNOG",
            "text": "Whisper of the First Lie",
            "type": 2,
            "weight": 1
        }
    ]
}
