{
    "_id": "SPyvwsiSghySIEw2",
    "data": {
        "actionCategory": {
            "value": ""
        },
        "actionType": {
            "value": "passive"
        },
        "actions": {
            "value": ""
        },
        "description": {
            "chat": "",
            "unidentified": "",
            "value": "<p>As a member of dragonkind, you project unflappable confidence (that collapses catastrophically against the deadliest foes).</p>\n<p>When you roll a success on a saving throw against a fear effect, you get a critical success instead. When you roll a failure against a fear effect, you get a critical failure instead.</p>\n<p>In addition, when you attempt to @Compendium[pf2e.actionspf2e.2u915NdUyQan6uKF]{Demoralize} a foe of your level or lower, you gain a +1 circumstance bonus to the Intimidation check.</p>"
        },
        "featType": {
            "value": "ancestry"
        },
        "level": {
            "value": "1"
        },
        "prerequisites": {
            "value": ""
        },
        "rarity": {
            "value": "common"
        },
        "source": {
            "value": ""
        },
        "traits": {
            "rarity": {
                "value": "common"
            },
            "value": [
                "kobold"
            ]
        },
        "usage": {
            "value": ""
        }
    },
    "flags": {},
    "img": "systems/pf2e/icons/features/feats/feats.jpg",
    "name": "Dragon's Presence",
    "permission": {
        "default": 0
    },
    "type": "feat"
}
