{
    "_id": "WxL8NMW9JQ5igu0C",
    "data": {
        "actionCategory": {
            "value": ""
        },
        "actionType": {
            "value": "free"
        },
        "actions": {
            "value": ""
        },
        "description": {
            "chat": "",
            "unidentified": "",
            "value": "<p><span id=\"ctl00_MainContent_DetailedOutput\"><strong>Prerequisites</strong> Hellknight Armiger Dedication<br><strong>Trigger</strong> Your turn begins and you can observe a devil.<br></span></p>\n<hr>\n<p>Your Hellknight training drilled details of Hell's denizens deep into your mind. Make an attempt to Recall Knowledge about a devil you're observing. If you roll a critical failure on this check, you get a failure instead.&nbsp;</p>"
        },
        "featType": {
            "value": "skill"
        },
        "level": {
            "value": "4"
        },
        "prerequisites": {
            "value": "Hellknight Armiger Dedication"
        },
        "rarity": {
            "value": "common"
        },
        "source": {
            "value": ""
        },
        "traits": {
            "custom": "",
            "rarity": {
                "value": "common"
            },
            "value": [
                "skill",
                "archetype"
            ]
        },
        "usage": {
            "value": "held-in-one-hand"
        }
    },
    "flags": {},
    "img": "systems/pf2e/icons/features/feats/feats.jpg",
    "name": "Diabolic Certitude",
    "permission": {
        "default": 0
    },
    "type": "feat"
}
