{
    "_id": "vu0R9VfRZ6RWTczZ",
    "data": {
        "actionCategory": {
            "value": ""
        },
        "actionType": {
            "value": "passive"
        },
        "actions": {
            "value": null
        },
        "description": {
            "chat": "",
            "unidentified": "",
            "value": "<p><strong>Prerequisites </strong>Swordmaster Dedication</p>\n<hr>\n<p>After extensive practice with the Swords, you're comfortable enough with your shield to move at a normal pace with it raised. You may use the Defend exploration activity while traveling at your full travel speed instead of half your travel speed.</p>"
        },
        "featType": {
            "value": "archetype"
        },
        "level": {
            "value": "10"
        },
        "prerequisites": {
            "value": "Swordmaster Dedication"
        },
        "rarity": {
            "value": "common"
        },
        "rules": [],
        "source": {
            "value": ""
        },
        "traits": {
            "custom": "",
            "rarity": {
                "value": "common"
            },
            "value": [
                "archetype"
            ]
        },
        "usage": {
            "value": "held-in-one-hand"
        }
    },
    "effects": [],
    "flags": {
        "core": {
            "sourceId": "Item.cdf7zR6fLd8hJdsc"
        }
    },
    "img": "systems/pf2e/icons/features/feats/feats.jpg",
    "name": "Practiced Defender",
    "permission": {
        "default": 0
    },
    "type": "feat"
}
