{
    "_id": "87h0jepQuzIbN7jN",
    "data": {
        "actionCategory": {
            "value": ""
        },
        "actionType": {
            "value": "passive"
        },
        "actions": {
            "value": null
        },
        "containerId": {
            "value": ""
        },
        "description": {
            "chat": "",
            "unidentified": "",
            "value": "<p>Your body was made from fungi that grows in the shade of caves and trees, and you are at home in dark caverns and warrens. You gain <a class=\"entity-link\" draggable=\"true\" data-pack=\"pf2e.ancestryfeatures\" data-id=\"HHVQDp61ehcpdiU8\"> Darkvision</a>.&nbsp;</p>"
        },
        "featType": {
            "value": "ancestryfeature"
        },
        "level": {
            "value": "1"
        },
        "prerequisites": {
            "value": null
        },
        "rarity": {
            "value": "common"
        },
        "rules": [],
        "source": {
            "value": ""
        },
        "traits": {
            "custom": "",
            "rarity": {
                "value": "common"
            },
            "selected": {
                "leshy": "Leshy"
            },
            "value": [
                "leshy"
            ]
        },
        "usage": {
            "value": "held-in-one-hand"
        }
    },
    "effects": [],
    "flags": {},
    "img": "systems/pf2e/icons/features/ancestry/fungus-leshy.jpg",
    "name": "Fungus Leshy",
    "permission": {
        "default": 0
    },
    "type": "feat"
}
