{
    "_id": "NkeLctXo9FLGnDhi",
    "data": {
        "ability": {
            "value": ""
        },
        "area": {
            "areaType": "",
            "value": null
        },
        "areasize": {
            "value": ""
        },
        "components": {
            "value": "somatic, verbal"
        },
        "cost": {
            "value": ""
        },
        "damage": {
            "applyMod": false,
            "value": ""
        },
        "damageType": {
            "value": ""
        },
        "description": {
            "chat": "",
            "unidentified": "",
            "value": "<p><span id=\"ctl00_MainContent_DetailedOutput\">Your deity sends wracking plagues. The target must attempt a Fortitude save. When you Cast the Spell, decide whether the disease inflicts the @Compendium[pf2e.conditionspf2e.i3OJZU2nk64Df3xm]{Clumsy}, @Compendium[pf2e.conditionspf2e.MIRkyAjyBeXivMa7]{Enfeebled}, or @Compendium[pf2e.conditionspf2e.e1XGnhKNSQIm5IXg]{Stupefied} condition.<br /><br /><strong>Divine Plague</strong> (disease) <strong>Level</strong> 1; </span></p>\n<p><span id=\"ctl00_MainContent_DetailedOutput\"><strong>Stage 1</strong> Clumsy 1, Enfeebled 1, or Stupefied 1 (1 round); </span></p>\n<p><span id=\"ctl00_MainContent_DetailedOutput\"><strong>Stage 2</strong> @Compendium[pf2e.conditionspf2e.xYTAsEpcJE1Ccni3]{Slowed} 1 and Clumsy 1, Enfeebled 1, or Stupefied 1 (1 round);</span></p>\n<p><span id=\"ctl00_MainContent_DetailedOutput\"> <strong>Stage 3</strong> Clumsy 1, Enfeebled 1, or Stupefied 1 and the target can&rsquo;t recover from the condition until they are cured (1 day)<br /></span></p>\n<hr />\n<p><span id=\"ctl00_MainContent_DetailedOutput\"><strong>Success</strong> The target is unaffected.</span></p>\n<p><span id=\"ctl00_MainContent_DetailedOutput\"><strong>Failure</strong> The target is afflicted with divine plague at stage 1.</span></p>\n<p><span id=\"ctl00_MainContent_DetailedOutput\"><strong>Critical Failure</strong> The target is afflicted with divine plague at stage 2.</span></p>\n<hr />\n<p><strong>Heightened (5th)</strong> The divine plague disease gains the virulent trait. The condition value for the Clumsy, Enfeebled, or Stupefied condition is 2 instead of 1.&nbsp;</p>"
        },
        "duration": {
            "value": ""
        },
        "level": {
            "value": 1
        },
        "location": {
            "value": ""
        },
        "materials": {
            "value": ""
        },
        "prepared": {
            "value": ""
        },
        "primarycheck": {
            "value": ""
        },
        "range": {
            "value": "15 feet"
        },
        "rarity": {
            "value": "common"
        },
        "rules": [],
        "save": {
            "basic": "",
            "value": "fortitude"
        },
        "scaling": {
            "formula": "",
            "mode": "none"
        },
        "school": {
            "value": "nec"
        },
        "secondarycasters": {
            "value": ""
        },
        "secondarycheck": {
            "value": ""
        },
        "source": {
            "value": ""
        },
        "spellCategorie": {
            "value": "focus"
        },
        "spellCategory": {
            "value": ""
        },
        "spellType": {
            "value": "save"
        },
        "sustained": {
            "value": false
        },
        "target": {
            "value": ""
        },
        "time": {
            "value": "2"
        },
        "traditions": {
            "value": []
        },
        "traits": {
            "custom": "",
            "rarity": {
                "value": "uncommon"
            },
            "value": [
                "cleric",
                "disease",
                "necromancy"
            ]
        },
        "usage": {
            "value": "held-in-one-hand"
        }
    },
    "effects": [],
    "flags": {},
    "img": "systems/pf2e/icons/spells/divine-plagues.jpg",
    "name": "Divine Plagues",
    "permission": {
        "default": 0
    },
    "type": "spell"
}
