<svg xmlns="http://www.w3.org/2000/svg" xmlns:xlink="http://www.w3.org/1999/xlink" width="50.994" height="46.463" viewBox="0 0 50.994 46.463">
  <defs>
    <linearGradient id="linear-gradient" x1="0.069" y1="0.996" x2="0.842" y2="0.144" gradientUnits="objectBoundingBox">
      <stop offset="0" stop-color="#7900ff" stop-opacity="0.259"/>
      <stop offset="1"/>
    </linearGradient>
  </defs>
  <path id="Tracé_2340" data-name="Tracé 2340" d="M.492,10.55,3.626,45.134a.837.837,0,0,0,.977.747l45.163-7.244a.832.832,0,0,0,.46-1.409C46.978,33.836,38.3,23.055,42.378,7.445A.841.841,0,0,0,41.343,6.41C37.146,7.618,24.9,10.061,18.316.833A.818.818,0,0,0,17.224.6L.924,9.716A.883.883,0,0,0,.492,10.55Z" transform="translate(0.012 0.066)" stroke="#000" stroke-miterlimit="10" stroke-width="1" fill="url(#linear-gradient)"/>
</svg>
