<svg id="Groupe_46" data-name="Groupe 46" xmlns="http://www.w3.org/2000/svg" xmlns:xlink="http://www.w3.org/1999/xlink" width="58.535" height="73" viewBox="0 0 58.535 73">
  <defs>
    <linearGradient id="linear-gradient" x1="1.625" y1="0.75" x2="0.375" y2="0.25" gradientUnits="objectBoundingBox">
      <stop offset="0" stop-color="#462523"/>
      <stop offset="0.085" stop-color="#cb9b51"/>
      <stop offset="0.336" stop-color="#f6e27a"/>
      <stop offset="0.495" stop-color="#f6f2c0"/>
      <stop offset="0.679" stop-color="#f6e27a"/>
      <stop offset="0.915" stop-color="#cb9b51"/>
      <stop offset="1" stop-color="#462523"/>
    </linearGradient>
    <linearGradient id="linear-gradient-2" x1="0.806" y1="0.783" x2="0.104" y2="0.221" xlink:href="#linear-gradient"/>
  </defs>
  <path id="Tracé_2333" data-name="Tracé 2333" d="M173.735,108l-.135.168.135.168Z" transform="translate(-115.2 -71.668)" fill="url(#linear-gradient)"/>
  <path id="Tracé_2334" data-name="Tracé 2334" d="M.673,21.53,0,51.47,31.286,73,58.4,36.5,31.286,0Zm52.58,15.1-.1-.135-22.2,29.906L5.315,48.779l.538-24.524L30.916,6.627l22.2,29.906.1-.135v.235Z" fill="url(#linear-gradient-2)"/>
  <path id="Tracé_2335" data-name="Tracé 2335" d="M16.573,37.33,15.9,61.551,41.467,79.38l22.2-29.94L41.467,19.5Z" transform="translate(-10.551 -12.94)" fill="rgba(255,255,255,0.12)"/>
  <path id="Tracé_2336" data-name="Tracé 2336" d="M17.9,37.33S25.974,59.2,65,49.44L42.794,19.5Z" transform="translate(-11.878 -12.94)" fill="rgba(255,255,255,0.19)"/>
</svg>
