{
  "$schema": "https://docs.renovatebot.com/renovate-schema.json",
  "extends": ["config:recommended"],
  "dependencyDashboardTitle": "⬆️ Dependency Dashboard",
  "commitMessageAction": "⬆️ Update",
  "pin": {
    "commitMessageAction": "⬆️ Pin"
  }
}
