{
  "$schema": "https://json.schemastore.org/tsconfig",
  "display": "Base",
  "compilerOptions": {
    "lib": ["es2023"],
    "target": "es2022",
    "strict": true,
    "esModuleInterop": true,
    "skipLibCheck": true,
    "resolveJsonModule": true,
    "moduleResolution": "Bundler",
    "module": "ESNext"
  },
  "exclude": ["node_modules"]
}
