# Blender v2.79 (sub 7) OBJ File: ''
# www.blender.org
o Sphere
v 0.000000 0.980785 -0.195090
v 0.000000 0.923880 -0.382683
v 0.000000 0.831470 -0.555570
v 0.000000 0.707107 -0.707107
v 0.000000 0.555570 -0.831470
v 0.000000 0.382683 -0.923880
v 0.000000 0.195090 -0.980785
v 0.000000 0.000000 -1.000000
v 0.000000 -0.195090 -0.980785
v 0.000000 -0.831470 -0.555570
v 0.038060 0.980785 -0.191342
v 0.074658 0.923880 -0.375330
v 0.108386 0.831470 -0.544895
v 0.137950 0.707107 -0.693520
v 0.162212 0.555570 -0.815493
v 0.180240 0.382683 -0.906127
v 0.191342 0.195090 -0.961940
v 0.195090 0.000000 -0.980785
v 0.191342 -0.195090 -0.961940
v 0.180240 -0.382683 -0.906127
v 0.162212 -0.555570 -0.815493
v 0.137950 -0.707107 -0.693520
v 0.108386 -0.831470 -0.544895
v 0.074658 -0.923880 -0.375330
v 0.038060 -0.980785 -0.191341
v 0.074658 0.980785 -0.180240
v 0.146447 0.923880 -0.353553
v 0.212608 0.831470 -0.513280
v 0.270598 0.707107 -0.653281
v 0.318190 0.555570 -0.768178
v 0.353553 0.382683 -0.853553
v 0.375330 0.195090 -0.906127
v 0.382684 0.000000 -0.923879
v 0.375330 -0.195090 -0.906127
v 0.353554 -0.382683 -0.853553
v 0.318190 -0.555570 -0.768178
v 0.270598 -0.707107 -0.653281
v 0.212608 -0.831470 -0.513280
v 0.146447 -0.923880 -0.353553
v 0.074658 -0.980785 -0.180240
v 0.108387 0.980785 -0.162212
v 0.212608 0.923880 -0.318190
v 0.308658 0.831470 -0.461940
v 0.392848 0.707107 -0.587938
v 0.461940 0.555570 -0.691342
v 0.513280 0.382683 -0.768178
v 0.544895 0.195090 -0.815493
v 0.555570 0.000000 -0.831469
v 0.544895 -0.195090 -0.815493
v 0.513280 -0.382683 -0.768178
v 0.461940 -0.555570 -0.691342
v 0.392848 -0.707107 -0.587938
v 0.308658 -0.831470 -0.461940
v 0.212608 -0.923880 -0.318189
v 0.108386 -0.980785 -0.162211
v 0.137950 0.980785 -0.137950
v 0.270598 0.923880 -0.270598
v 0.392848 0.831470 -0.392847
v 0.500000 0.707107 -0.500000
v 0.587938 0.555570 -0.587938
v 0.653282 0.382683 -0.653281
v 0.693520 0.195090 -0.693520
v 0.707107 0.000000 -0.707107
v 0.693520 -0.195090 -0.693520
v 0.653282 -0.382683 -0.653281
v 0.587938 -0.555570 -0.587938
v 0.500000 -0.707107 -0.500000
v 0.392848 -0.831470 -0.392847
v 0.270598 -0.923880 -0.270598
v 0.137950 -0.980785 -0.137949
v 0.162212 0.980785 -0.108386
v 0.318190 0.923880 -0.212607
v 0.461940 0.831470 -0.308658
v 0.587938 0.707107 -0.392847
v 0.691342 0.555570 -0.461940
v 0.768178 0.382683 -0.513280
v 0.815493 0.195090 -0.544895
v 0.831470 0.000000 -0.555570
v 0.815493 -0.195090 -0.544895
v 0.768178 -0.382683 -0.513280
v 0.691342 -0.555570 -0.461940
v 0.587938 -0.707107 -0.392847
v 0.461940 -0.831470 -0.308658
v 0.318190 -0.923880 -0.212607
v 0.162212 -0.980785 -0.108386
v 0.180240 0.980785 -0.074658
v 0.353554 0.923880 -0.146446
v 0.513280 0.831470 -0.212607
v 0.653282 0.707107 -0.270598
v 0.768178 0.555570 -0.318189
v 0.853554 0.382683 -0.353553
v 0.906128 0.195090 -0.375330
v 0.923880 0.000000 -0.382683
v 0.906128 -0.195090 -0.375330
v 0.853554 -0.382683 -0.353553
v 0.768178 -0.555570 -0.318189
v 0.653282 -0.707107 -0.270598
v 0.513280 -0.831470 -0.212607
v 0.353554 -0.923880 -0.146446
v 0.180240 -0.980785 -0.074658
v 0.191342 0.980785 -0.038060
v 0.375331 0.923880 -0.074658
v 0.544895 0.831470 -0.108386
v 0.693520 0.707107 -0.137949
v 0.815493 0.555570 -0.162211
v 0.906128 0.382683 -0.180240
v 0.961940 0.195090 -0.191341
v 0.980785 0.000000 -0.195090
v 0.961940 -0.195090 -0.191341
v 0.906128 -0.382683 -0.180240
v 0.815493 -0.555570 -0.162211
v 0.693520 -0.707107 -0.137949
v 0.544895 -0.831470 -0.108386
v 0.375330 -0.923880 -0.074658
v 0.191342 -0.980785 -0.038060
v 0.195091 0.980785 0.000000
v 0.382684 0.923880 0.000000
v 0.555570 0.831470 0.000000
v 0.707107 0.707107 0.000000
v 0.831470 0.555570 0.000000
v 0.923880 0.382683 0.000000
v 0.980785 0.195090 0.000000
v 1.000000 0.000000 0.000000
v 0.980785 -0.195090 0.000000
v 0.923880 -0.382683 0.000000
v 0.831470 -0.555570 0.000000
v 0.707107 -0.707107 0.000000
v 0.555570 -0.831470 0.000000
v 0.382684 -0.923880 0.000000
v 0.195090 -0.980785 0.000000
v 0.191342 0.980785 0.038061
v 0.375331 0.923880 0.074658
v 0.544895 0.831470 0.108387
v 0.693520 0.707107 0.137950
v 0.815493 0.555570 0.162212
v 0.906128 0.382683 0.180240
v 0.961940 0.195090 0.191342
v 0.980785 0.000000 0.195091
v 0.961940 -0.195090 0.191342
v 0.906128 -0.382683 0.180240
v 0.815493 -0.555570 0.162212
v 0.693520 -0.707107 0.137950
v 0.544895 -0.831470 0.108387
v 0.375330 -0.923880 0.074658
v 0.191342 -0.980785 0.038061
v 0.180240 0.980785 0.074658
v 0.353554 0.923880 0.146447
v 0.513280 0.831470 0.212608
v 0.653282 0.707107 0.270598
v 0.768178 0.555570 0.318190
v 0.853554 0.382683 0.353554
v 0.906127 0.195090 0.375331
v 0.923880 0.000000 0.382684
v 0.906127 -0.195090 0.375331
v 0.853554 -0.382683 0.353554
v 0.768178 -0.555570 0.318190
v 0.653282 -0.707107 0.270598
v 0.513280 -0.831470 0.212608
v 0.353553 -0.923880 0.146447
v 0.180240 -0.980785 0.074658
v 0.162212 0.980785 0.108387
v 0.318190 0.923880 0.212608
v 0.461940 0.831470 0.308659
v 0.587938 0.707107 0.392848
v 0.691342 0.555570 0.461940
v 0.768178 0.382683 0.513280
v 0.815493 0.195090 0.544895
v 0.831470 0.000000 0.555571
v 0.815493 -0.195090 0.544895
v 0.768178 -0.382683 0.513280
v 0.691342 -0.555570 0.461940
v 0.587938 -0.707107 0.392848
v 0.461940 -0.831470 0.308659
v 0.318190 -0.923880 0.212608
v 0.162212 -0.980785 0.108387
v 0.137950 0.980785 0.137950
v 0.270598 0.923880 0.270599
v 0.392848 0.831470 0.392848
v 0.500000 0.707107 0.500000
v 0.587938 0.555570 0.587938
v 0.653282 0.382683 0.653282
v 0.693520 0.195090 0.693520
v 0.707107 0.000000 0.707107
v 0.693520 -0.195090 0.693520
v 0.653282 -0.382683 0.653282
v 0.587938 -0.555570 0.587938
v 0.500000 -0.707107 0.500000
v 0.392848 -0.831470 0.392848
v 0.270598 -0.923880 0.270598
v 0.137950 -0.980785 0.137950
v 0.108386 0.980785 0.162212
v 0.212608 0.923880 0.318190
v 0.308658 0.831470 0.461940
v 0.392848 0.707107 0.587938
v 0.461940 0.555570 0.691342
v 0.513280 0.382683 0.768178
v 0.544895 0.195090 0.815493
v 0.555570 0.000000 0.831470
v 0.544895 -0.195090 0.815493
v 0.513280 -0.382683 0.768178
v 0.461940 -0.555570 0.691342
v 0.392848 -0.707107 0.587938
v 0.308658 -0.831470 0.461940
v 0.212608 -0.923880 0.318190
v 0.108386 -0.980785 0.162212
v 0.000000 -1.000000 0.000000
v 0.074658 0.980785 0.180240
v 0.146447 0.923880 0.353554
v 0.212608 0.831470 0.513280
v 0.270598 0.707107 0.653282
v 0.318190 0.555570 0.768178
v 0.353553 0.382683 0.853554
v 0.375330 0.195090 0.906128
v 0.382683 0.000000 0.923880
v 0.375330 -0.195090 0.906128
v 0.353553 -0.382683 0.853554
v 0.318190 -0.555570 0.768178
v 0.270598 -0.707107 0.653282
v 0.212608 -0.831470 0.513280
v 0.146447 -0.923880 0.353554
v 0.074658 -0.980785 0.180240
v 0.038060 0.980785 0.191342
v 0.074658 0.923880 0.375331
v 0.108386 0.831470 0.544896
v 0.137950 0.707107 0.693520
v 0.162212 0.555570 0.815493
v 0.180240 0.382683 0.906128
v 0.191342 0.195090 0.961940
v 0.195090 0.000000 0.980786
v 0.191342 -0.195090 0.961940
v 0.180240 -0.382683 0.906128
v 0.162212 -0.555570 0.815493
v 0.137950 -0.707107 0.693520
v 0.108386 -0.831470 0.544895
v 0.074658 -0.923880 0.375331
v 0.038060 -0.980785 0.191342
v -0.000000 0.980785 0.195091
v 0.000000 0.923880 0.382684
v 0.000000 0.831470 0.555571
v -0.000000 0.707107 0.707107
v -0.000000 0.555570 0.831470
v 0.000000 0.382683 0.923880
v -0.000000 0.195090 0.980785
v -0.000000 0.000000 1.000000
v -0.000000 -0.195090 0.980785
v 0.000000 -0.382683 0.923880
v -0.000000 -0.555570 0.831470
v -0.000000 -0.707107 0.707107
v -0.000000 -0.831470 0.555570
v 0.000000 -0.923880 0.382684
v 0.000000 -0.980785 0.195091
v -0.038060 0.980785 0.191342
v -0.074658 0.923880 0.375331
v -0.108386 0.831470 0.544896
v -0.137950 0.707107 0.693520
v -0.162212 0.555570 0.815493
v -0.180240 0.382683 0.906128
v -0.191342 0.195090 0.961940
v -0.195090 0.000000 0.980786
v -0.191342 -0.195090 0.961940
v -0.180240 -0.382683 0.906128
v -0.162212 -0.555570 0.815493
v -0.137950 -0.707107 0.693520
v -0.108386 -0.831470 0.544895
v -0.074658 -0.923880 0.375331
v -0.038060 -0.980785 0.191342
v -0.074658 0.980785 0.180240
v -0.146447 0.923880 0.353554
v -0.212608 0.831470 0.513280
v -0.270598 0.707107 0.653282
v -0.318190 0.555570 0.768178
v -0.353553 0.382683 0.853554
v -0.375330 0.195090 0.906127
v -0.382684 0.000000 0.923880
v -0.375330 -0.195090 0.906127
v -0.353553 -0.382683 0.853554
v -0.318190 -0.555570 0.768178
v -0.270598 -0.707107 0.653282
v -0.212608 -0.831470 0.513280
v -0.146447 -0.923880 0.353554
v -0.074658 -0.980785 0.180240
v -0.108386 0.980785 0.162212
v -0.212608 0.923880 0.318190
v -0.308658 0.831470 0.461940
v -0.392847 0.707107 0.587938
v -0.461940 0.555570 0.691342
v -0.513280 0.382683 0.768178
v -0.544895 0.195090 0.815493
v -0.555570 0.000000 0.831470
v -0.544895 -0.195090 0.815493
v -0.513280 -0.382683 0.768178
v -0.461940 -0.555570 0.691342
v -0.392847 -0.707107 0.587938
v -0.308658 -0.831470 0.461940
v -0.212607 -0.923880 0.318190
v -0.108386 -0.980785 0.162212
v -0.000000 1.000000 0.000001
v -0.137950 0.980785 0.137950
v -0.270598 0.923880 0.270598
v -0.392848 0.831470 0.392848
v -0.500000 0.707107 0.500000
v -0.587938 0.555570 0.587938
v -0.653281 0.382683 0.653282
v -0.693520 0.195090 0.693520
v -0.707107 0.000000 0.707107
v -0.693520 -0.195090 0.693520
v -0.653281 -0.382683 0.653282
v -0.587938 -0.555570 0.587938
v -0.500000 -0.707107 0.500000
v -0.392847 -0.831470 0.392848
v -0.270598 -0.923880 0.270598
v -0.137950 -0.980785 0.137950
v -0.162212 0.980785 0.108387
v -0.318190 0.923880 0.212608
v -0.461940 0.831470 0.308659
v -0.587938 0.707107 0.392848
v -0.691342 0.555570 0.461940
v -0.768178 0.382683 0.513280
v -0.815493 0.195090 0.544895
v -0.831470 0.000000 0.555570
v -0.815493 -0.195090 0.544895
v -0.768178 -0.382683 0.513280
v -0.691342 -0.555570 0.461940
v -0.587938 -0.707107 0.392848
v -0.461940 -0.831470 0.308658
v -0.318190 -0.923880 0.212608
v -0.162212 -0.980785 0.108387
v -0.180240 0.980785 0.074658
v -0.353553 0.923880 0.146447
v -0.513280 0.831470 0.212608
v -0.653281 0.707107 0.270598
v -0.768177 0.555570 0.318190
v -0.853553 0.382683 0.353554
v -0.906127 0.195090 0.375330
v -0.923880 0.000000 0.382684
v -0.906127 -0.195090 0.375330
v -0.853553 -0.382683 0.353554
v -0.768177 -0.555570 0.318190
v -0.653281 -0.707107 0.270598
v -0.513280 -0.831470 0.212608
v -0.353553 -0.923880 0.146447
v -0.180240 -0.980785 0.074658
v -0.191342 0.980785 0.038061
v -0.375330 0.923880 0.074658
v -0.544895 0.831470 0.108387
v -0.693520 0.707107 0.137950
v -0.815493 0.555570 0.162212
v -0.906127 0.382683 0.180240
v -0.961939 0.195090 0.191342
v -0.980785 0.000000 0.195090
v -0.961939 -0.195090 0.191342
v -0.906127 -0.382683 0.180240
v -0.815493 -0.555570 0.162212
v -0.693520 -0.707107 0.137950
v -0.544895 -0.831470 0.108387
v -0.375330 -0.923880 0.074658
v -0.191342 -0.980785 0.038061
v -0.195090 0.980785 0.000000
v -0.382683 0.923880 0.000000
v -0.555570 0.831470 0.000000
v -0.707107 0.707107 0.000000
v -0.831469 0.555570 0.000000
v -0.923879 0.382683 0.000000
v -0.980785 0.195090 0.000000
v -1.000000 0.000000 0.000000
v -0.980785 -0.195090 0.000000
v -0.923879 -0.382683 0.000000
v -0.831469 -0.555570 0.000000
v -0.707107 -0.707107 0.000000
v -0.555570 -0.831470 0.000000
v -0.382683 -0.923880 0.000000
v -0.195090 -0.980785 0.000000
v -0.191342 0.980785 -0.038060
v -0.375330 0.923880 -0.074658
v -0.544895 0.831470 -0.108386
v -0.693520 0.707107 -0.137949
v -0.815493 0.555570 -0.162211
v -0.906127 0.382683 -0.180240
v -0.961939 0.195090 -0.191342
v -0.980785 0.000000 -0.195090
v -0.961939 -0.195090 -0.191342
v -0.906127 -0.382683 -0.180240
v -0.815493 -0.555570 -0.162211
v -0.693520 -0.707107 -0.137949
v -0.544895 -0.831470 -0.108386
v -0.375330 -0.923880 -0.074658
v -0.191342 -0.980785 -0.038060
v -0.180240 0.980785 -0.074658
v -0.353553 0.923880 -0.146446
v -0.513280 0.831470 -0.212607
v -0.653281 0.707107 -0.270598
v -0.768177 0.555570 -0.318189
v -0.853553 0.382683 -0.353553
v -0.906127 0.195090 -0.375330
v -0.923879 0.000000 -0.382683
v -0.906127 -0.195090 -0.375330
v -0.853553 -0.382683 -0.353553
v -0.768177 -0.555570 -0.318189
v -0.653281 -0.707107 -0.270598
v -0.513280 -0.831470 -0.212607
v -0.353553 -0.923880 -0.146446
v -0.180240 -0.980785 -0.074657
v -0.162212 0.980785 -0.108386
v -0.318190 0.923880 -0.212607
v -0.461940 0.831470 -0.308658
v -0.587938 0.707107 -0.392847
v -0.691341 0.555570 -0.461939
v -0.768178 0.382683 -0.513280
v -0.815493 0.195090 -0.544895
v -0.831469 0.000000 -0.555570
v -0.815493 -0.195090 -0.544895
v -0.768178 -0.382683 -0.513280
v -0.691341 -0.555570 -0.461939
v -0.587938 -0.707107 -0.392847
v -0.461940 -0.831470 -0.308658
v -0.318189 -0.923880 -0.212607
v -0.162212 -0.980785 -0.108386
v -0.137950 0.980785 -0.137949
v -0.270598 0.923880 -0.270598
v -0.392847 0.831470 -0.392847
v -0.500000 0.707107 -0.500000
v -0.587937 0.555570 -0.587937
v -0.653281 0.382683 -0.653281
v -0.693519 0.195090 -0.693519
v -0.707106 0.000000 -0.707106
v -0.693519 -0.195090 -0.693519
v -0.653281 -0.382683 -0.653281
v -0.587937 -0.555570 -0.587937
v -0.500000 -0.707107 -0.500000
v -0.392847 -0.831470 -0.392847
v -0.270598 -0.923880 -0.270598
v -0.137950 -0.980785 -0.137949
v -0.108386 0.980785 -0.162211
v -0.212607 0.923880 -0.318189
v -0.308658 0.831470 -0.461939
v -0.392847 0.707107 -0.587937
v -0.461939 0.555570 -0.691341
v -0.513280 0.382683 -0.768177
v -0.544895 0.195090 -0.815492
v -0.555570 0.000000 -0.831469
v -0.544895 -0.195090 -0.815492
v -0.513280 -0.382683 -0.768177
v -0.461939 -0.555570 -0.691341
v -0.392847 -0.707107 -0.587937
v -0.308658 -0.831470 -0.461939
v -0.212607 -0.923880 -0.318189
v -0.108386 -0.980785 -0.162211
v -0.074658 0.980785 -0.180240
v -0.146447 0.923880 -0.353553
v -0.212607 0.831470 -0.513280
v -0.270598 0.707107 -0.653281
v -0.318189 0.555570 -0.768177
v -0.353553 0.382683 -0.853553
v -0.375330 0.195090 -0.906127
v -0.382683 0.000000 -0.923879
v -0.375330 -0.195090 -0.906127
v -0.353553 -0.382683 -0.853553
v -0.318189 -0.555570 -0.768177
v -0.270598 -0.707107 -0.653281
v -0.212607 -0.831470 -0.513279
v -0.146446 -0.923880 -0.353553
v -0.074658 -0.980785 -0.180240
v -0.038060 0.980785 -0.191342
v -0.074658 0.923880 -0.375330
v -0.108386 0.831470 -0.544895
v -0.137950 0.707107 -0.693520
v -0.162211 0.555570 -0.815492
v -0.180240 0.382683 -0.906127
v -0.191341 0.195090 -0.961939
v -0.195090 0.000000 -0.980785
v -0.191341 -0.195090 -0.961939
v -0.180240 -0.382683 -0.906127
v -0.162211 -0.555570 -0.815492
v -0.137950 -0.707107 -0.693520
v -0.108386 -0.831470 -0.544895
v -0.074658 -0.923880 -0.375330
v -0.038060 -0.980785 -0.191341
v 0.000000 -0.382683 -0.923879
v 0.000000 -0.555570 -0.831469
v 0.000000 -0.707107 -0.707106
v 0.000000 -0.923880 -0.382683
v 0.000000 -0.980785 -0.195090
vt 0.770744 0.188553
vt 0.775814 0.250724
vt 0.744954 0.254702
vt 0.740132 0.192508
vt 0.790340 0.624785
vt 0.792948 0.687116
vt 0.761684 0.691141
vt 0.759092 0.628805
vt 0.761465 0.126655
vt 0.731455 0.130560
vt 0.788126 0.562428
vt 0.756905 0.566444
vt 0.736140 0.065817
vt 0.708619 0.069525
vt 0.786081 0.500060
vt 0.754895 0.504071
vt 0.836110 0.934297
vt 1.036545 0.979420
vt 0.807095 0.938232
vt 0.536544 0.020580
vt 0.784036 0.437692
vt 0.752895 0.441698
vt 0.810719 0.873463
vt 0.779801 0.877489
vt 0.781823 0.375335
vt 0.750742 0.379335
vt 0.801427 0.811567
vt 0.770228 0.815598
vt 0.779215 0.313004
vt 0.748219 0.316994
vt 0.796352 0.749395
vt 0.765092 0.753424
vt 0.738415 0.819548
vt 0.733423 0.757346
vt 0.717461 0.320799
vt 0.714445 0.258479
vt 0.730146 0.695042
vt 0.710032 0.196243
vt 0.727671 0.632689
vt 0.702206 0.134211
vt 0.725596 0.570313
vt 0.682234 0.072915
vt 0.723698 0.507927
vt 0.776252 0.942261
vt 0.721819 0.445539
vt 0.747896 0.881480
vt 0.719806 0.383159
vt 0.694196 0.573886
vt 0.692484 0.511478
vt 0.743155 0.946236
vt 0.656729 0.075905
vt 0.690797 0.449069
vt 0.714927 0.885272
vt 0.688998 0.386665
vt 0.705968 0.823254
vt 0.686911 0.324277
vt 0.701339 0.761003
vt 0.684244 0.261920
vt 0.698332 0.698664
vt 0.680374 0.199628
vt 0.696076 0.636285
vt 0.673596 0.137493
vt 0.656538 0.327304
vt 0.654304 0.264906
vt 0.668855 0.764243
vt 0.666253 0.701862
vt 0.651085 0.202553
vt 0.664314 0.639450
vt 0.645505 0.140308
vt 0.662705 0.577023
vt 0.631898 0.078431
vt 0.661247 0.514590
vt 0.707367 0.949973
vt 0.659814 0.452155
vt 0.680868 0.888694
vt 0.658294 0.389724
vt 0.672899 0.826558
vt 0.607566 0.080444
vt 0.629984 0.517142
vt 0.628861 0.454682
vt 0.668541 0.953256
vt 0.645762 0.891577
vt 0.627672 0.392224
vt 0.639259 0.829310
vt 0.626305 0.329773
vt 0.636010 0.766926
vt 0.624573 0.267335
vt 0.633937 0.704500
vt 0.622090 0.204924
vt 0.632400 0.642055
vt 0.617820 0.142577
vt 0.631131 0.579601
vt 0.594998 0.269126
vt 0.593313 0.206667
vt 0.601426 0.706468
vt 0.600363 0.643994
vt 0.590433 0.144238
vt 0.599487 0.581515
vt 0.583588 0.081906
vt 0.598697 0.519035
vt 0.626607 0.955848
vt 0.597926 0.456554
vt 0.609746 0.893763
vt 0.597112 0.394074
vt 0.605140 0.831376
vt 0.596178 0.331597
vt 0.602867 0.768932
vt 0.582011 0.957514
vt 0.573050 0.895126
vt 0.567003 0.457701
vt 0.566592 0.395206
vt 0.570675 0.832655
vt 0.566121 0.332712
vt 0.569512 0.770170
vt 0.565527 0.270219
vt 0.568778 0.707679
vt 0.564681 0.207730
vt 0.568237 0.645185
vt 0.563240 0.145248
vt 0.567793 0.582691
vt 0.559836 0.082790
vt 0.567393 0.520196
vt 0.536058 0.708080
vt 0.536066 0.645580
vt 0.536120 0.208080
vt 0.536142 0.145580
vt 0.536073 0.583080
vt 0.536193 0.083080
vt 0.536079 0.520580
vt 0.535855 0.958080
vt 0.536085 0.458080
vt 0.535993 0.895580
vt 0.536091 0.395580
vt 0.536029 0.833080
vt 0.536098 0.333080
vt 0.536047 0.770580
vt 0.536107 0.270580
vt 0.505167 0.457678
vt 0.505590 0.395183
vt 0.498942 0.895098
vt 0.501386 0.832629
vt 0.506075 0.332689
vt 0.502583 0.770145
vt 0.506687 0.270197
vt 0.503339 0.707654
vt 0.507559 0.207708
vt 0.503896 0.645161
vt 0.509043 0.145227
vt 0.504354 0.582667
vt 0.512549 0.082772
vt 0.504765 0.520173
vt 0.036545 0.979420
vt 0.489723 0.957480
vt 0.478923 0.206625
vt 0.481845 0.144198
vt 0.471773 0.643947
vt 0.472661 0.581469
vt 0.488792 0.081871
vt 0.473462 0.518989
vt 0.445194 0.955783
vt 0.474243 0.456508
vt 0.462262 0.893710
vt 0.475069 0.394029
vt 0.466929 0.831326
vt 0.476017 0.331552
vt 0.469233 0.768883
vt 0.477214 0.269082
vt 0.470694 0.706420
vt 0.426269 0.891501
vt 0.432823 0.829237
vt 0.444507 0.392159
vt 0.445887 0.329709
vt 0.436098 0.766855
vt 0.447635 0.267272
vt 0.438189 0.704431
vt 0.450141 0.204862
vt 0.439738 0.641987
vt 0.454451 0.142518
vt 0.441019 0.579533
vt 0.464805 0.080392
vt 0.442176 0.517075
vt 0.403349 0.953167
vt 0.443308 0.454616
vt 0.407829 0.639363
vt 0.409447 0.576938
vt 0.426755 0.140232
vt 0.440461 0.078363
vt 0.410914 0.514505
vt 0.364616 0.949867
vt 0.412354 0.452071
vt 0.391194 0.888600
vt 0.413884 0.389641
vt 0.399198 0.826468
vt 0.415651 0.327222
vt 0.403263 0.764154
vt 0.417898 0.264825
vt 0.405879 0.701774
vt 0.421138 0.202474
vt 0.383177 0.386567
vt 0.385272 0.324180
vt 0.366147 0.823149
vt 0.370791 0.760900
vt 0.387951 0.261824
vt 0.373808 0.698562
vt 0.391839 0.199534
vt 0.376071 0.636184
vt 0.398651 0.137402
vt 0.377958 0.573786
vt 0.415612 0.075822
vt 0.379677 0.511378
vt 0.328914 0.946120
vt 0.381371 0.448970
vt 0.357166 0.885164
vt 0.370024 0.134107
vt 0.390085 0.072819
vt 0.346561 0.570202
vt 0.348463 0.507816
vt 0.295890 0.942142
vt 0.350347 0.445428
vt 0.324230 0.881363
vt 0.352365 0.383049
vt 0.333719 0.819433
vt 0.354717 0.320690
vt 0.338719 0.757232
vt 0.357742 0.258371
vt 0.342001 0.694929
vt 0.362169 0.196136
vt 0.344481 0.632577
vt 0.323952 0.316878
vt 0.327224 0.254586
vt 0.307062 0.753305
vt 0.310471 0.691022
vt 0.332054 0.192393
vt 0.313066 0.628687
vt 0.340753 0.130447
vt 0.315255 0.566326
vt 0.363670 0.069419
vt 0.317267 0.503954
vt 0.265107 0.938113
vt 0.319270 0.441581
vt 0.292355 0.877369
vt 0.321426 0.379218
vt 0.301925 0.815479
vt 0.236140 0.934183
vt 0.336110 0.065703
vt 0.286081 0.499940
vt 0.288126 0.437572
vt 0.261465 0.873345
vt 0.290340 0.375216
vt 0.270744 0.811447
vt 0.292948 0.312884
vt 0.275814 0.749276
vt 0.296352 0.250605
vt 0.279215 0.686996
vt 0.301427 0.188433
vt 0.281823 0.624665
vt 0.310719 0.126537
vt 0.284036 0.562308
vt 0.244953 0.745298
vt 0.248219 0.683006
vt 0.265092 0.246576
vt 0.270228 0.184402
vt 0.250742 0.620666
vt 0.279801 0.122511
vt 0.252895 0.558302
vt 0.307095 0.061768
vt 0.254895 0.495929
vt 0.208619 0.930475
vt 0.256905 0.433556
vt 0.231455 0.869440
vt 0.259092 0.371195
vt 0.240132 0.807492
vt 0.261684 0.308859
vt 0.223698 0.492074
vt 0.225596 0.429687
vt 0.182234 0.927085
vt 0.202206 0.865789
vt 0.227671 0.367311
vt 0.210032 0.803758
vt 0.230146 0.304958
vt 0.214445 0.741521
vt 0.233423 0.242654
vt 0.217461 0.679201
vt 0.238415 0.180452
vt 0.219806 0.616841
vt 0.247896 0.118520
vt 0.221819 0.554461
vt 0.276252 0.057739
vt 0.201339 0.238997
vt 0.205968 0.176746
vt 0.186911 0.675723
vt 0.188998 0.613335
vt 0.214927 0.114728
vt 0.190797 0.550931
vt 0.243155 0.053764
vt 0.192484 0.488522
vt 0.156729 0.924096
vt 0.194196 0.426114
vt 0.173596 0.862507
vt 0.196076 0.363715
vt 0.180374 0.800372
vt 0.198332 0.301336
vt 0.184244 0.738080
vt 0.131898 0.921569
vt 0.145505 0.859692
vt 0.162705 0.422977
vt 0.164314 0.360550
vt 0.151085 0.797447
vt 0.166253 0.298138
vt 0.154304 0.735094
vt 0.168855 0.235757
vt 0.156538 0.672696
vt 0.172899 0.173441
vt 0.158294 0.610276
vt 0.180868 0.111306
vt 0.159814 0.547845
vt 0.207367 0.050027
vt 0.161247 0.485410
vt 0.126305 0.670227
vt 0.127672 0.607776
vt 0.139259 0.170690
vt 0.145762 0.108423
vt 0.128861 0.545318
vt 0.168541 0.046744
vt 0.129984 0.482859
vt 0.107566 0.919556
vt 0.131131 0.420399
vt 0.117820 0.857423
vt 0.132400 0.357945
vt 0.122090 0.795076
vt 0.133937 0.295500
vt 0.124573 0.732665
vt 0.136010 0.233074
vt 0.099487 0.418485
vt 0.100363 0.356006
vt 0.090433 0.855762
vt 0.093313 0.793333
vt 0.101426 0.293532
vt 0.094998 0.730875
vt 0.102867 0.231068
vt 0.096178 0.668404
vt 0.105140 0.168624
vt 0.097112 0.605926
vt 0.109746 0.106237
vt 0.097926 0.543446
vt 0.126607 0.044153
vt 0.098697 0.480965
vt 0.083588 0.918094
vt 0.070675 0.167345
vt 0.073050 0.104874
vt 0.066592 0.604794
vt 0.067003 0.542299
vt 0.082011 0.042486
vt 0.067393 0.479804
vt 0.059836 0.917210
vt 0.067793 0.417309
vt 0.063240 0.854752
vt 0.068237 0.354815
vt 0.064681 0.792270
vt 0.068778 0.292321
vt 0.065527 0.729781
vt 0.069512 0.229830
vt 0.066121 0.667288
vt 0.036066 0.354420
vt 0.036058 0.291920
vt 0.036120 0.791920
vt 0.036107 0.729420
vt 0.036047 0.229420
vt 0.036098 0.666920
vt 0.036029 0.166920
vt 0.036091 0.604420
vt 0.035993 0.104420
vt 0.036085 0.541920
vt 0.035855 0.041920
vt 0.036079 0.479420
vt 0.036193 0.916920
vt 1.035855 0.041920
vt 0.036073 0.416920
vt 0.036142 0.854420
vt 1.035993 0.104420
vt 0.998941 0.104902
vt 0.989723 0.042520
vt 0.005167 0.542322
vt 0.004765 0.479828
vt 0.012549 0.917228
vt 0.004354 0.417333
vt 0.009043 0.854773
vt 0.003896 0.354839
vt 0.007559 0.792292
vt 0.003339 0.292346
vt 0.006687 0.729803
vt 0.002583 0.229855
vt 0.006075 0.667311
vt 0.001386 0.167371
vt 0.005590 0.604817
vt 1.036029 0.166920
vt 1.001386 0.167371
vt 1.006687 0.729803
vt 1.007559 0.792292
vt 0.978923 0.793375
vt 0.977214 0.730918
vt 1.002583 0.229855
vt 1.003339 0.292346
vt 0.970694 0.293580
vt 0.969233 0.231117
vt 1.006075 0.667311
vt 0.976017 0.668448
vt 0.966929 0.168674
vt 1.005590 0.604817
vt 0.975069 0.605971
vt 0.962262 0.106290
vt 1.005167 0.542322
vt 0.974243 0.543492
vt 0.945194 0.044217
vt 1.004765 0.479828
vt 0.973462 0.481011
vt 1.012549 0.917228
vt 0.988792 0.918129
vt 1.004354 0.417333
vt 0.972661 0.418531
vt 1.009043 0.854773
vt 0.981845 0.855803
vt 1.003896 0.354839
vt 0.971773 0.356053
vt 0.943308 0.545384
vt 0.942176 0.482925
vt 0.964805 0.919608
vt 0.903349 0.046833
vt 0.941019 0.420467
vt 0.954450 0.857482
vt 0.939738 0.358013
vt 0.950141 0.795138
vt 0.938189 0.295569
vt 0.947635 0.732728
vt 0.936098 0.233144
vt 0.945887 0.670291
vt 0.932823 0.170763
vt 0.944507 0.607841
vt 0.926269 0.108499
vt 0.905879 0.298226
vt 0.903263 0.235846
vt 0.917898 0.735175
vt 0.915651 0.672778
vt 0.899198 0.173532
vt 0.913884 0.610359
vt 0.891193 0.111400
vt 0.912354 0.547929
vt 0.864616 0.050133
vt 0.910914 0.485495
vt 0.940461 0.921637
vt 0.909447 0.423062
vt 0.926755 0.859768
vt 0.907829 0.360637
vt 0.921138 0.797526
vt 0.915613 0.924178
vt 0.828914 0.053880
vt 0.879677 0.488622
vt 0.877958 0.426214
vt 0.898651 0.862599
vt 0.876071 0.363816
vt 0.891839 0.800466
vt 0.873808 0.301438
vt 0.887951 0.738176
vt 0.870791 0.239100
vt 0.885272 0.675820
vt 0.866147 0.176851
vt 0.883177 0.613433
vt 0.857166 0.114836
vt 0.881371 0.551030
vt 0.857742 0.741629
vt 0.854717 0.679310
vt 0.838719 0.242767
vt 0.833719 0.180567
vt 0.852365 0.616951
vt 0.824230 0.118637
vt 0.850347 0.554572
vt 0.795890 0.057858
vt 0.848463 0.492184
vt 0.890085 0.927181
vt 0.846561 0.429798
vt 0.870023 0.865893
vt 0.844481 0.367423
vt 0.862169 0.803864
vt 0.842001 0.305071
vt 0.817267 0.496047
vt 0.815255 0.433674
vt 0.863670 0.930581
vt 0.840753 0.869553
vt 0.813066 0.371313
vt 0.832054 0.807607
vt 0.810471 0.308978
vt 0.827224 0.745414
vt 0.807062 0.246695
vt 0.823952 0.683122
vt 0.801925 0.184521
vt 0.821426 0.620783
vt 0.792355 0.122631
vt 0.819270 0.558419
vt 0.765107 0.061887
vn 0.0000 -0.8286 -0.5598
vn 0.0000 -0.7040 -0.7101
vn 0.1385 -0.7040 -0.6965
vn 0.1092 -0.8286 -0.5490
vn 0.0000 0.3805 -0.9247
vn 0.0000 0.5528 -0.8333
vn 0.1626 0.5528 -0.8173
vn 0.1804 0.3805 -0.9070
vn 0.0000 -0.9217 -0.3879
vn 0.0757 -0.9217 -0.3804
vn 0.0000 0.1939 -0.9810
vn 0.1914 0.1939 -0.9622
vn 0.0000 -0.9796 -0.2010
vn 0.0392 -0.9796 -0.1971
vn 0.0000 0.0000 -1.0000
vn 0.1951 0.0000 -0.9808
vn 0.0000 0.9796 -0.2010
vn 0.0000 1.0000 0.0000
vn 0.0392 0.9796 -0.1971
vn 0.0000 -1.0000 0.0000
vn 0.0000 -0.1939 -0.9810
vn 0.1914 -0.1939 -0.9622
vn 0.0000 0.9217 -0.3879
vn 0.0757 0.9217 -0.3804
vn 0.0000 -0.3805 -0.9247
vn 0.1804 -0.3805 -0.9070
vn 0.0000 0.8286 -0.5598
vn 0.1092 0.8286 -0.5490
vn 0.0000 -0.5528 -0.8333
vn 0.1626 -0.5528 -0.8173
vn 0.0000 0.7040 -0.7101
vn 0.1385 0.7040 -0.6965
vn 0.2142 0.8286 -0.5171
vn 0.2717 0.7040 -0.6561
vn 0.3189 -0.5528 -0.7699
vn 0.2717 -0.7040 -0.6561
vn 0.3189 0.5528 -0.7699
vn 0.2142 -0.8286 -0.5171
vn 0.3539 0.3805 -0.8544
vn 0.1484 -0.9217 -0.3583
vn 0.3754 0.1939 -0.9063
vn 0.0769 -0.9796 -0.1856
vn 0.3827 0.0000 -0.9239
vn 0.0769 0.9796 -0.1856
vn 0.3754 -0.1939 -0.9063
vn 0.1484 0.9217 -0.3583
vn 0.3539 -0.3805 -0.8544
vn 0.5450 0.1939 -0.8157
vn 0.5556 0.0000 -0.8314
vn 0.1116 0.9796 -0.1671
vn 0.1116 -0.9796 -0.1671
vn 0.5450 -0.1939 -0.8157
vn 0.2155 0.9217 -0.3225
vn 0.5137 -0.3805 -0.7689
vn 0.3110 0.8286 -0.4654
vn 0.4630 -0.5528 -0.6929
vn 0.3945 0.7040 -0.5904
vn 0.3945 -0.7040 -0.5904
vn 0.4630 0.5528 -0.6929
vn 0.3110 -0.8286 -0.4654
vn 0.5137 0.3805 -0.7689
vn 0.2155 -0.9217 -0.3225
vn 0.5893 -0.5528 -0.5893
vn 0.5021 -0.7040 -0.5021
vn 0.5021 0.7040 -0.5021
vn 0.5893 0.5528 -0.5893
vn 0.3958 -0.8286 -0.3958
vn 0.6539 0.3805 -0.6539
vn 0.2743 -0.9217 -0.2743
vn 0.6937 0.1939 -0.6937
vn 0.1421 -0.9796 -0.1421
vn 0.7071 0.0000 -0.7071
vn 0.1421 0.9796 -0.1421
vn 0.6937 -0.1939 -0.6937
vn 0.2743 0.9217 -0.2743
vn 0.6539 -0.3805 -0.6539
vn 0.3958 0.8286 -0.3958
vn 0.1671 -0.9796 -0.1116
vn 0.8314 0.0000 -0.5556
vn 0.8157 -0.1939 -0.5450
vn 0.1671 0.9796 -0.1116
vn 0.3225 0.9217 -0.2155
vn 0.7689 -0.3805 -0.5137
vn 0.4654 0.8286 -0.3110
vn 0.6929 -0.5528 -0.4630
vn 0.5904 0.7040 -0.3945
vn 0.5904 -0.7040 -0.3945
vn 0.6929 0.5528 -0.4630
vn 0.4654 -0.8286 -0.3110
vn 0.7689 0.3805 -0.5137
vn 0.3225 -0.9217 -0.2155
vn 0.8157 0.1939 -0.5450
vn 0.6561 -0.7040 -0.2717
vn 0.5171 -0.8286 -0.2142
vn 0.7699 0.5528 -0.3189
vn 0.8544 0.3805 -0.3539
vn 0.3583 -0.9217 -0.1484
vn 0.9063 0.1939 -0.3754
vn 0.1856 -0.9796 -0.0769
vn 0.9239 0.0000 -0.3827
vn 0.1856 0.9796 -0.0769
vn 0.9063 -0.1939 -0.3754
vn 0.3583 0.9217 -0.1484
vn 0.8544 -0.3805 -0.3539
vn 0.5171 0.8286 -0.2142
vn 0.7699 -0.5528 -0.3189
vn 0.6561 0.7040 -0.2717
vn 0.1971 0.9796 -0.0392
vn 0.3804 0.9217 -0.0757
vn 0.9622 -0.1939 -0.1914
vn 0.9070 -0.3805 -0.1804
vn 0.5490 0.8286 -0.1092
vn 0.8173 -0.5528 -0.1626
vn 0.6965 0.7040 -0.1385
vn 0.6965 -0.7040 -0.1385
vn 0.8173 0.5528 -0.1626
vn 0.5490 -0.8286 -0.1092
vn 0.9070 0.3805 -0.1804
vn 0.3804 -0.9217 -0.0757
vn 0.9622 0.1939 -0.1914
vn 0.1971 -0.9796 -0.0392
vn 0.9808 0.0000 -0.1951
vn 0.8333 0.5528 0.0000
vn 0.9247 0.3805 0.0000
vn 0.5598 -0.8286 0.0000
vn 0.3879 -0.9217 0.0000
vn 0.9810 0.1939 0.0000
vn 0.2010 -0.9796 0.0000
vn 1.0000 0.0000 0.0000
vn 0.2010 0.9796 0.0000
vn 0.9810 -0.1939 0.0000
vn 0.3879 0.9217 0.0000
vn 0.9247 -0.3805 0.0000
vn 0.5598 0.8286 0.0000
vn 0.8333 -0.5528 0.0000
vn 0.7101 0.7040 0.0000
vn 0.7101 -0.7040 0.0000
vn 0.9622 -0.1939 0.1914
vn 0.9070 -0.3805 0.1804
vn 0.3804 0.9217 0.0757
vn 0.5490 0.8286 0.1092
vn 0.8173 -0.5528 0.1626
vn 0.6965 0.7040 0.1385
vn 0.6965 -0.7040 0.1385
vn 0.8173 0.5528 0.1626
vn 0.5490 -0.8286 0.1092
vn 0.9070 0.3805 0.1804
vn 0.3804 -0.9217 0.0757
vn 0.9622 0.1939 0.1914
vn 0.1971 -0.9796 0.0392
vn 0.9808 0.0000 0.1951
vn 0.1971 0.9796 0.0392
vn 0.5171 -0.8286 0.2142
vn 0.3583 -0.9217 0.1484
vn 0.8544 0.3805 0.3539
vn 0.9063 0.1939 0.3754
vn 0.1856 -0.9796 0.0769
vn 0.9239 0.0000 0.3827
vn 0.1856 0.9796 0.0769
vn 0.9063 -0.1939 0.3754
vn 0.3583 0.9217 0.1484
vn 0.8544 -0.3805 0.3539
vn 0.5171 0.8286 0.2142
vn 0.7699 -0.5528 0.3189
vn 0.6561 0.7040 0.2717
vn 0.6561 -0.7040 0.2717
vn 0.7699 0.5528 0.3189
vn 0.3225 0.9217 0.2155
vn 0.4654 0.8286 0.3110
vn 0.7689 -0.3805 0.5137
vn 0.6929 -0.5528 0.4630
vn 0.5904 0.7040 0.3945
vn 0.5904 -0.7040 0.3945
vn 0.6929 0.5528 0.4630
vn 0.4654 -0.8286 0.3110
vn 0.7689 0.3805 0.5137
vn 0.3225 -0.9217 0.2155
vn 0.8157 0.1939 0.5450
vn 0.1671 -0.9796 0.1116
vn 0.8314 0.0000 0.5556
vn 0.1671 0.9796 0.1116
vn 0.8157 -0.1939 0.5450
vn 0.6539 0.3805 0.6539
vn 0.6937 0.1939 0.6937
vn 0.2743 -0.9217 0.2743
vn 0.1421 -0.9796 0.1421
vn 0.7071 0.0000 0.7071
vn 0.1421 0.9796 0.1421
vn 0.6937 -0.1939 0.6937
vn 0.2743 0.9217 0.2743
vn 0.6539 -0.3805 0.6539
vn 0.3958 0.8286 0.3958
vn 0.5893 -0.5528 0.5893
vn 0.5021 0.7040 0.5021
vn 0.5021 -0.7040 0.5021
vn 0.5893 0.5528 0.5893
vn 0.3958 -0.8286 0.3958
vn 0.5137 -0.3805 0.7689
vn 0.4630 -0.5528 0.6929
vn 0.3110 0.8286 0.4654
vn 0.3945 0.7040 0.5904
vn 0.3945 -0.7040 0.5904
vn 0.4630 0.5528 0.6929
vn 0.3110 -0.8286 0.4654
vn 0.5137 0.3805 0.7689
vn 0.2155 -0.9217 0.3225
vn 0.5450 0.1939 0.8157
vn 0.1116 -0.9796 0.1671
vn 0.5556 0.0000 0.8314
vn 0.1116 0.9796 0.1671
vn 0.5450 -0.1939 0.8157
vn 0.2155 0.9217 0.3225
vn 0.1484 -0.9217 0.3583
vn 0.0769 -0.9796 0.1856
vn 0.3754 0.1939 0.9063
vn 0.3827 0.0000 0.9239
vn 0.0769 0.9796 0.1856
vn 0.3754 -0.1939 0.9063
vn 0.1484 0.9217 0.3583
vn 0.3539 -0.3805 0.8544
vn 0.2142 0.8286 0.5171
vn 0.3189 -0.5528 0.7699
vn 0.2717 0.7040 0.6561
vn 0.2717 -0.7040 0.6561
vn 0.3189 0.5528 0.7699
vn 0.2142 -0.8286 0.5171
vn 0.3539 0.3805 0.8544
vn 0.1626 -0.5528 0.8173
vn 0.1385 -0.7040 0.6965
vn 0.1385 0.7040 0.6965
vn 0.1626 0.5528 0.8173
vn 0.1092 -0.8286 0.5490
vn 0.1804 0.3805 0.9070
vn 0.0757 -0.9217 0.3804
vn 0.1914 0.1939 0.9622
vn 0.0392 -0.9796 0.1971
vn 0.1951 0.0000 0.9808
vn 0.0392 0.9796 0.1971
vn 0.1914 -0.1939 0.9622
vn 0.0757 0.9217 0.3804
vn 0.1804 -0.3805 0.9070
vn 0.1092 0.8286 0.5490
vn 0.0000 0.9796 0.2010
vn 0.0000 -0.9796 0.2010
vn 0.0000 0.0000 1.0000
vn 0.0000 -0.1939 0.9810
vn 0.0000 0.9217 0.3879
vn 0.0000 -0.3805 0.9247
vn 0.0000 0.8286 0.5598
vn 0.0000 -0.5528 0.8333
vn 0.0000 0.7040 0.7101
vn 0.0000 -0.7040 0.7101
vn 0.0000 0.5528 0.8333
vn 0.0000 -0.8286 0.5598
vn 0.0000 0.3805 0.9247
vn 0.0000 -0.9217 0.3879
vn 0.0000 0.1939 0.9810
vn -0.1385 0.7040 0.6965
vn -0.1626 0.5528 0.8173
vn -0.1385 -0.7040 0.6965
vn -0.1092 -0.8286 0.5490
vn -0.1804 0.3805 0.9070
vn -0.0757 -0.9217 0.3804
vn -0.1914 0.1939 0.9622
vn -0.0392 -0.9796 0.1971
vn -0.1951 0.0000 0.9808
vn -0.0392 0.9796 0.1971
vn -0.1914 -0.1939 0.9622
vn -0.0757 0.9217 0.3804
vn -0.1804 -0.3805 0.9070
vn -0.1092 0.8286 0.5490
vn -0.1626 -0.5528 0.8173
vn -0.3827 0.0000 0.9239
vn -0.3754 -0.1939 0.9063
vn -0.0769 0.9796 0.1856
vn -0.1484 0.9217 0.3583
vn -0.3539 -0.3805 0.8544
vn -0.2142 0.8286 0.5171
vn -0.3189 -0.5528 0.7699
vn -0.2717 0.7040 0.6561
vn -0.2717 -0.7040 0.6561
vn -0.3189 0.5528 0.7699
vn -0.2142 -0.8286 0.5171
vn -0.3539 0.3805 0.8544
vn -0.1484 -0.9217 0.3583
vn -0.3754 0.1939 0.9063
vn -0.0769 -0.9796 0.1856
vn -0.3945 -0.7040 0.5904
vn -0.3110 -0.8286 0.4654
vn -0.4630 0.5528 0.6929
vn -0.5137 0.3805 0.7689
vn -0.2155 -0.9217 0.3225
vn -0.5450 0.1939 0.8157
vn -0.1116 -0.9796 0.1671
vn -0.5556 0.0000 0.8314
vn -0.1116 0.9796 0.1671
vn -0.5450 -0.1939 0.8157
vn -0.2155 0.9217 0.3225
vn -0.5137 -0.3805 0.7689
vn -0.3110 0.8286 0.4654
vn -0.4630 -0.5528 0.6929
vn -0.3945 0.7040 0.5904
vn -0.1421 0.9796 0.1421
vn -0.2743 0.9217 0.2743
vn -0.6937 -0.1939 0.6937
vn -0.6539 -0.3805 0.6539
vn -0.3958 0.8286 0.3958
vn -0.5893 -0.5528 0.5893
vn -0.5021 0.7040 0.5021
vn -0.5021 -0.7040 0.5021
vn -0.5893 0.5528 0.5893
vn -0.3958 -0.8286 0.3958
vn -0.6539 0.3805 0.6539
vn -0.2743 -0.9217 0.2743
vn -0.6937 0.1939 0.6937
vn -0.1421 -0.9796 0.1421
vn -0.7071 0.0000 0.7071
vn -0.6929 0.5528 0.4630
vn -0.7689 0.3805 0.5137
vn -0.4654 -0.8286 0.3110
vn -0.3225 -0.9217 0.2155
vn -0.8157 0.1939 0.5450
vn -0.1671 -0.9796 0.1116
vn -0.8314 0.0000 0.5556
vn -0.1671 0.9796 0.1116
vn -0.8157 -0.1939 0.5450
vn -0.3225 0.9217 0.2155
vn -0.7689 -0.3805 0.5137
vn -0.4654 0.8286 0.3110
vn -0.6929 -0.5528 0.4630
vn -0.5904 0.7040 0.3945
vn -0.5904 -0.7040 0.3945
vn -0.9063 -0.1939 0.3754
vn -0.8544 -0.3805 0.3539
vn -0.3583 0.9217 0.1484
vn -0.5171 0.8286 0.2142
vn -0.7699 -0.5528 0.3189
vn -0.6561 0.7040 0.2717
vn -0.6561 -0.7040 0.2717
vn -0.7699 0.5528 0.3189
vn -0.5171 -0.8286 0.2142
vn -0.8544 0.3805 0.3539
vn -0.3583 -0.9217 0.1484
vn -0.9063 0.1939 0.3754
vn -0.1856 -0.9796 0.0769
vn -0.9239 0.0000 0.3827
vn -0.1856 0.9796 0.0769
vn -0.5490 -0.8286 0.1092
vn -0.3804 -0.9217 0.0757
vn -0.9070 0.3805 0.1804
vn -0.9622 0.1939 0.1914
vn -0.1971 -0.9796 0.0392
vn -0.9808 0.0000 0.1951
vn -0.1971 0.9796 0.0392
vn -0.9622 -0.1939 0.1914
vn -0.3804 0.9217 0.0757
vn -0.9070 -0.3805 0.1804
vn -0.5490 0.8286 0.1092
vn -0.8173 -0.5528 0.1626
vn -0.6965 0.7040 0.1385
vn -0.6965 -0.7040 0.1385
vn -0.8173 0.5528 0.1626
vn -0.9247 -0.3805 0.0000
vn -0.8333 -0.5528 0.0000
vn -0.5598 0.8286 0.0000
vn -0.7101 0.7040 0.0000
vn -0.7101 -0.7040 0.0000
vn -0.8333 0.5528 0.0000
vn -0.5598 -0.8286 0.0000
vn -0.9247 0.3805 0.0000
vn -0.3879 -0.9217 0.0000
vn -0.9810 0.1939 0.0000
vn -0.2010 -0.9796 0.0000
vn -1.0000 0.0000 0.0000
vn -0.2010 0.9796 0.0000
vn -0.9810 -0.1939 0.0000
vn -0.3879 0.9217 0.0000
vn -0.3804 -0.9217 -0.0757
vn -0.1971 -0.9796 -0.0392
vn -0.9622 0.1939 -0.1914
vn -0.9808 0.0000 -0.1951
vn -0.1971 0.9796 -0.0392
vn -0.9622 -0.1939 -0.1914
vn -0.3804 0.9217 -0.0757
vn -0.9070 -0.3805 -0.1804
vn -0.5490 0.8286 -0.1092
vn -0.8173 -0.5528 -0.1626
vn -0.6965 0.7040 -0.1385
vn -0.6965 -0.7040 -0.1385
vn -0.8173 0.5528 -0.1626
vn -0.5490 -0.8286 -0.1092
vn -0.9070 0.3805 -0.1804
vn -0.5171 0.8286 -0.2142
vn -0.6561 0.7040 -0.2717
vn -0.7699 -0.5528 -0.3189
vn -0.6561 -0.7040 -0.2717
vn -0.7699 0.5528 -0.3189
vn -0.5171 -0.8286 -0.2142
vn -0.8544 0.3805 -0.3539
vn -0.3583 -0.9217 -0.1484
vn -0.9063 0.1939 -0.3754
vn -0.1856 -0.9796 -0.0769
vn -0.9239 0.0000 -0.3827
vn -0.1856 0.9796 -0.0769
vn -0.9063 -0.1939 -0.3754
vn -0.3583 0.9217 -0.1484
vn -0.8544 -0.3805 -0.3539
vn -0.8157 0.1939 -0.5450
vn -0.8314 0.0000 -0.5556
vn -0.1671 0.9796 -0.1116
vn -0.1671 -0.9796 -0.1116
vn -0.8157 -0.1939 -0.5450
vn -0.3225 0.9217 -0.2155
vn -0.7689 -0.3805 -0.5137
vn -0.4654 0.8286 -0.3110
vn -0.6929 -0.5528 -0.4630
vn -0.5904 0.7040 -0.3945
vn -0.5904 -0.7040 -0.3945
vn -0.6929 0.5528 -0.4630
vn -0.4654 -0.8286 -0.3110
vn -0.7689 0.3805 -0.5137
vn -0.3225 -0.9217 -0.2155
vn -0.5893 -0.5528 -0.5893
vn -0.5021 -0.7040 -0.5021
vn -0.5021 0.7040 -0.5021
vn -0.5893 0.5528 -0.5893
vn -0.3958 -0.8286 -0.3958
vn -0.6539 0.3805 -0.6539
vn -0.2743 -0.9217 -0.2743
vn -0.6937 0.1939 -0.6937
vn -0.1421 -0.9796 -0.1421
vn -0.7071 0.0000 -0.7071
vn -0.1421 0.9796 -0.1421
vn -0.6937 -0.1939 -0.6937
vn -0.2743 0.9217 -0.2743
vn -0.6539 -0.3805 -0.6539
vn -0.3958 0.8286 -0.3958
vn -0.1116 0.9796 -0.1671
vn -0.1116 -0.9796 -0.1671
vn -0.5556 0.0000 -0.8314
vn -0.5450 -0.1939 -0.8157
vn -0.2155 0.9217 -0.3225
vn -0.5137 -0.3805 -0.7689
vn -0.3110 0.8286 -0.4654
vn -0.4630 -0.5528 -0.6929
vn -0.3945 0.7040 -0.5904
vn -0.3945 -0.7040 -0.5904
vn -0.4630 0.5528 -0.6929
vn -0.3110 -0.8286 -0.4654
vn -0.5137 0.3805 -0.7689
vn -0.2155 -0.9217 -0.3225
vn -0.5450 0.1939 -0.8157
vn -0.2717 0.7040 -0.6561
vn -0.3189 0.5528 -0.7699
vn -0.2717 -0.7040 -0.6561
vn -0.2142 -0.8286 -0.5171
vn -0.3539 0.3805 -0.8544
vn -0.1484 -0.9217 -0.3583
vn -0.3754 0.1939 -0.9063
vn -0.0769 -0.9796 -0.1856
vn -0.3827 0.0000 -0.9239
vn -0.0769 0.9796 -0.1856
vn -0.3754 -0.1939 -0.9063
vn -0.1484 0.9217 -0.3583
vn -0.3539 -0.3805 -0.8544
vn -0.2142 0.8286 -0.5171
vn -0.3189 -0.5528 -0.7699
vn -0.1951 0.0000 -0.9808
vn -0.1914 -0.1939 -0.9622
vn -0.0392 0.9796 -0.1971
vn -0.0757 0.9217 -0.3804
vn -0.1804 -0.3805 -0.9070
vn -0.1092 0.8286 -0.5490
vn -0.1626 -0.5528 -0.8173
vn -0.1385 0.7040 -0.6965
vn -0.1385 -0.7040 -0.6965
vn -0.1626 0.5528 -0.8173
vn -0.1092 -0.8286 -0.5490
vn -0.1804 0.3805 -0.9070
vn -0.0757 -0.9217 -0.3804
vn -0.1914 0.1939 -0.9622
vn -0.0392 -0.9796 -0.1971
s 1
f 10/1/1 480/2/2 22/3/3 23/4/4
f 6/5/5 5/6/6 15/7/7 16/8/8
f 481/9/9 10/1/1 23/4/4 24/10/10
f 7/11/11 6/5/5 16/8/8 17/12/12
f 482/13/13 481/9/9 24/10/10 25/14/14
f 8/15/15 7/11/11 17/12/12 18/16/16
f 1/17/17 297/18/18 11/19/19
f 206/20/20 482/13/13 25/14/14
f 9/21/21 8/15/15 18/16/16 19/22/22
f 2/23/23 1/17/17 11/19/19 12/24/24
f 478/25/25 9/21/21 19/22/22 20/26/26
f 3/27/27 2/23/23 12/24/24 13/28/28
f 479/29/29 478/25/25 20/26/26 21/30/30
f 4/31/31 3/27/27 13/28/28 14/32/32
f 480/2/2 479/29/29 21/30/30 22/3/3
f 5/6/6 4/31/31 14/32/32 15/7/7
f 14/32/32 13/28/28 28/33/33 29/34/34
f 22/3/3 21/30/30 36/35/35 37/36/36
f 15/7/7 14/32/32 29/34/34 30/37/37
f 23/4/4 22/3/3 37/36/36 38/38/38
f 16/8/8 15/7/7 30/37/37 31/39/39
f 24/10/10 23/4/4 38/38/38 39/40/40
f 17/12/12 16/8/8 31/39/39 32/41/41
f 25/14/14 24/10/10 39/40/40 40/42/42
f 18/16/16 17/12/12 32/41/41 33/43/43
f 11/19/19 297/18/18 26/44/44
f 206/20/20 25/14/14 40/42/42
f 19/22/22 18/16/16 33/43/43 34/45/45
f 12/24/24 11/19/19 26/44/44 27/46/46
f 20/26/26 19/22/22 34/45/45 35/47/47
f 13/28/28 12/24/24 27/46/46 28/33/33
f 21/30/30 20/26/26 35/47/47 36/35/35
f 33/43/43 32/41/41 47/48/48 48/49/49
f 26/44/44 297/18/18 41/50/50
f 206/20/20 40/42/42 55/51/51
f 34/45/45 33/43/43 48/49/49 49/52/52
f 27/46/46 26/44/44 41/50/50 42/53/53
f 35/47/47 34/45/45 49/52/52 50/54/54
f 28/33/33 27/46/46 42/53/53 43/55/55
f 36/35/35 35/47/47 50/54/54 51/56/56
f 29/34/34 28/33/33 43/55/55 44/57/57
f 37/36/36 36/35/35 51/56/56 52/58/58
f 30/37/37 29/34/34 44/57/57 45/59/59
f 38/38/38 37/36/36 52/58/58 53/60/60
f 31/39/39 30/37/37 45/59/59 46/61/61
f 39/40/40 38/38/38 53/60/60 54/62/62
f 32/41/41 31/39/39 46/61/61 47/48/48
f 40/42/42 39/40/40 54/62/62 55/51/51
f 52/58/58 51/56/56 66/63/63 67/64/64
f 45/59/59 44/57/57 59/65/65 60/66/66
f 53/60/60 52/58/58 67/64/64 68/67/67
f 46/61/61 45/59/59 60/66/66 61/68/68
f 54/62/62 53/60/60 68/67/67 69/69/69
f 47/48/48 46/61/61 61/68/68 62/70/70
f 55/51/51 54/62/62 69/69/69 70/71/71
f 48/49/49 47/48/48 62/70/70 63/72/72
f 41/50/50 297/18/18 56/73/73
f 206/20/20 55/51/51 70/71/71
f 49/52/52 48/49/49 63/72/72 64/74/74
f 42/53/53 41/50/50 56/73/73 57/75/75
f 50/54/54 49/52/52 64/74/74 65/76/76
f 43/55/55 42/53/53 57/75/75 58/77/77
f 51/56/56 50/54/54 65/76/76 66/63/63
f 44/57/57 43/55/55 58/77/77 59/65/65
f 206/20/20 70/71/71 85/78/78
f 64/74/74 63/72/72 78/79/79 79/80/80
f 57/75/75 56/73/73 71/81/81 72/82/82
f 65/76/76 64/74/74 79/80/80 80/83/83
f 58/77/77 57/75/75 72/82/82 73/84/84
f 66/63/63 65/76/76 80/83/83 81/85/85
f 59/65/65 58/77/77 73/84/84 74/86/86
f 67/64/64 66/63/63 81/85/85 82/87/87
f 60/66/66 59/65/65 74/86/86 75/88/88
f 68/67/67 67/64/64 82/87/87 83/89/89
f 61/68/68 60/66/66 75/88/88 76/90/90
f 69/69/69 68/67/67 83/89/89 84/91/91
f 62/70/70 61/68/68 76/90/90 77/92/92
f 70/71/71 69/69/69 84/91/91 85/78/78
f 63/72/72 62/70/70 77/92/92 78/79/79
f 56/73/73 297/18/18 71/81/81
f 83/89/89 82/87/87 97/93/93 98/94/94
f 76/90/90 75/88/88 90/95/95 91/96/96
f 84/91/91 83/89/89 98/94/94 99/97/97
f 77/92/92 76/90/90 91/96/96 92/98/98
f 85/78/78 84/91/91 99/97/97 100/99/99
f 78/79/79 77/92/92 92/98/98 93/100/100
f 71/81/81 297/18/18 86/101/101
f 206/20/20 85/78/78 100/99/99
f 79/80/80 78/79/79 93/100/100 94/102/102
f 72/82/82 71/81/81 86/101/101 87/103/103
f 80/83/83 79/80/80 94/102/102 95/104/104
f 73/84/84 72/82/82 87/103/103 88/105/105
f 81/85/85 80/83/83 95/104/104 96/106/106
f 74/86/86 73/84/84 88/105/105 89/107/107
f 82/87/87 81/85/85 96/106/106 97/93/93
f 75/88/88 74/86/86 89/107/107 90/95/95
f 87/103/103 86/101/101 101/108/108 102/109/109
f 95/104/104 94/102/102 109/110/110 110/111/111
f 88/105/105 87/103/103 102/109/109 103/112/112
f 96/106/106 95/104/104 110/111/111 111/113/113
f 89/107/107 88/105/105 103/112/112 104/114/114
f 97/93/93 96/106/106 111/113/113 112/115/115
f 90/95/95 89/107/107 104/114/114 105/116/116
f 98/94/94 97/93/93 112/115/115 113/117/117
f 91/96/96 90/95/95 105/116/116 106/118/118
f 99/97/97 98/94/94 113/117/117 114/119/119
f 92/98/98 91/96/96 106/118/118 107/120/120
f 100/99/99 99/97/97 114/119/119 115/121/121
f 93/100/100 92/98/98 107/120/120 108/122/122
f 86/101/101 297/18/18 101/108/108
f 206/20/20 100/99/99 115/121/121
f 94/102/102 93/100/100 108/122/122 109/110/110
f 106/118/118 105/116/116 120/123/123 121/124/124
f 114/119/119 113/117/117 128/125/125 129/126/126
f 107/120/120 106/118/118 121/124/124 122/127/127
f 115/121/121 114/119/119 129/126/126 130/128/128
f 108/122/122 107/120/120 122/127/127 123/129/129
f 101/108/108 297/18/18 116/130/130
f 206/20/20 115/121/121 130/128/128
f 109/110/110 108/122/122 123/129/129 124/131/131
f 102/109/109 101/108/108 116/130/130 117/132/132
f 110/111/111 109/110/110 124/131/131 125/133/133
f 103/112/112 102/109/109 117/132/132 118/134/134
f 111/113/113 110/111/111 125/133/133 126/135/135
f 104/114/114 103/112/112 118/134/134 119/136/136
f 112/115/115 111/113/113 126/135/135 127/137/137
f 105/116/116 104/114/114 119/136/136 120/123/123
f 113/117/117 112/115/115 127/137/137 128/125/125
f 125/133/133 124/131/131 139/138/138 140/139/139
f 118/134/134 117/132/132 132/140/140 133/141/141
f 126/135/135 125/133/133 140/139/139 141/142/142
f 119/136/136 118/134/134 133/141/141 134/143/143
f 127/137/137 126/135/135 141/142/142 142/144/144
f 120/123/123 119/136/136 134/143/143 135/145/145
f 128/125/125 127/137/137 142/144/144 143/146/146
f 121/124/124 120/123/123 135/145/145 136/147/147
f 129/126/126 128/125/125 143/146/146 144/148/148
f 122/127/127 121/124/124 136/147/147 137/149/149
f 130/128/128 129/126/126 144/148/148 145/150/150
f 123/129/129 122/127/127 137/149/149 138/151/151
f 116/130/130 297/152/18 131/153/152
f 206/20/20 130/128/128 145/150/150
f 124/131/131 123/129/129 138/151/151 139/138/138
f 117/132/132 116/130/130 131/153/152 132/140/140
f 144/148/148 143/146/146 158/154/153 159/155/154
f 137/149/149 136/147/147 151/156/155 152/157/156
f 145/150/150 144/148/148 159/155/154 160/158/157
f 138/151/151 137/149/149 152/157/156 153/159/158
f 131/153/152 297/152/18 146/160/159
f 206/20/20 145/150/150 160/158/157
f 139/138/138 138/151/151 153/159/158 154/161/160
f 132/140/140 131/153/152 146/160/159 147/162/161
f 140/139/139 139/138/138 154/161/160 155/163/162
f 133/141/141 132/140/140 147/162/161 148/164/163
f 141/142/142 140/139/139 155/163/162 156/165/164
f 134/143/143 133/141/141 148/164/163 149/166/165
f 142/144/144 141/142/142 156/165/164 157/167/166
f 135/145/145 134/143/143 149/166/165 150/168/167
f 143/146/146 142/144/144 157/167/166 158/154/153
f 136/147/147 135/145/145 150/168/167 151/156/155
f 148/164/163 147/162/161 162/169/168 163/170/169
f 156/165/164 155/163/162 170/171/170 171/172/171
f 149/166/165 148/164/163 163/170/169 164/173/172
f 157/167/166 156/165/164 171/172/171 172/174/173
f 150/168/167 149/166/165 164/173/172 165/175/174
f 158/154/153 157/167/166 172/174/173 173/176/175
f 151/156/155 150/168/167 165/175/174 166/177/176
f 159/155/154 158/154/153 173/176/175 174/178/177
f 152/157/156 151/156/155 166/177/176 167/179/178
f 160/158/157 159/155/154 174/178/177 175/180/179
f 153/159/158 152/157/156 167/179/178 168/181/180
f 146/160/159 297/152/18 161/182/181
f 206/20/20 160/158/157 175/180/179
f 154/161/160 153/159/158 168/181/180 169/183/182
f 147/162/161 146/160/159 161/182/181 162/169/168
f 155/163/162 154/161/160 169/183/182 170/171/170
f 167/179/178 166/177/176 181/184/183 182/185/184
f 175/180/179 174/178/177 189/186/185 190/187/186
f 168/181/180 167/179/178 182/185/184 183/188/187
f 161/182/181 297/152/18 176/189/188
f 206/20/20 175/180/179 190/187/186
f 169/183/182 168/181/180 183/188/187 184/190/189
f 162/169/168 161/182/181 176/189/188 177/191/190
f 170/171/170 169/183/182 184/190/189 185/192/191
f 163/170/169 162/169/168 177/191/190 178/193/192
f 171/172/171 170/171/170 185/192/191 186/194/193
f 164/173/172 163/170/169 178/193/192 179/195/194
f 172/174/173 171/172/171 186/194/193 187/196/195
f 165/175/174 164/173/172 179/195/194 180/197/196
f 173/176/175 172/174/173 187/196/195 188/198/197
f 166/177/176 165/175/174 180/197/196 181/184/183
f 174/178/177 173/176/175 188/198/197 189/186/185
f 186/194/193 185/192/191 200/199/198 201/200/199
f 179/195/194 178/193/192 193/201/200 194/202/201
f 187/196/195 186/194/193 201/200/199 202/203/202
f 180/197/196 179/195/194 194/202/201 195/204/203
f 188/198/197 187/196/195 202/203/202 203/205/204
f 181/184/183 180/197/196 195/204/203 196/206/205
f 189/186/185 188/198/197 203/205/204 204/207/206
f 182/185/184 181/184/183 196/206/205 197/208/207
f 190/187/186 189/186/185 204/207/206 205/209/208
f 183/188/187 182/185/184 197/208/207 198/210/209
f 176/189/188 297/152/18 191/211/210
f 206/20/20 190/187/186 205/209/208
f 184/190/189 183/188/187 198/210/209 199/212/211
f 177/191/190 176/189/188 191/211/210 192/213/212
f 185/192/191 184/190/189 199/212/211 200/199/198
f 178/193/192 177/191/190 192/213/212 193/201/200
f 205/209/208 204/207/206 220/214/213 221/215/214
f 198/210/209 197/208/207 213/216/215 214/217/216
f 191/211/210 297/152/18 207/218/217
f 206/20/20 205/209/208 221/215/214
f 199/212/211 198/210/209 214/217/216 215/219/218
f 192/213/212 191/211/210 207/218/217 208/220/219
f 200/199/198 199/212/211 215/219/218 216/221/220
f 193/201/200 192/213/212 208/220/219 209/222/221
f 201/200/199 200/199/198 216/221/220 217/223/222
f 194/202/201 193/201/200 209/222/221 210/224/223
f 202/203/202 201/200/199 217/223/222 218/225/224
f 195/204/203 194/202/201 210/224/223 211/226/225
f 203/205/204 202/203/202 218/225/224 219/227/226
f 196/206/205 195/204/203 211/226/225 212/228/227
f 204/207/206 203/205/204 219/227/226 220/214/213
f 197/208/207 196/206/205 212/228/227 213/216/215
f 218/225/224 217/223/222 232/229/228 233/230/229
f 211/226/225 210/224/223 225/231/230 226/232/231
f 219/227/226 218/225/224 233/230/229 234/233/232
f 212/228/227 211/226/225 226/232/231 227/234/233
f 220/214/213 219/227/226 234/233/232 235/235/234
f 213/216/215 212/228/227 227/234/233 228/236/235
f 221/215/214 220/214/213 235/235/234 236/237/236
f 214/217/216 213/216/215 228/236/235 229/238/237
f 207/218/217 297/152/18 222/239/238
f 206/20/20 221/215/214 236/237/236
f 215/219/218 214/217/216 229/238/237 230/240/239
f 208/220/219 207/218/217 222/239/238 223/241/240
f 216/221/220 215/219/218 230/240/239 231/242/241
f 209/222/221 208/220/219 223/241/240 224/243/242
f 217/223/222 216/221/220 231/242/241 232/229/228
f 210/224/223 209/222/221 224/243/242 225/231/230
f 222/239/238 297/152/18 237/244/243
f 206/20/20 236/237/236 251/245/244
f 230/240/239 229/238/237 244/246/245 245/247/246
f 223/241/240 222/239/238 237/244/243 238/248/247
f 231/242/241 230/240/239 245/247/246 246/249/248
f 224/243/242 223/241/240 238/248/247 239/250/249
f 232/229/228 231/242/241 246/249/248 247/251/250
f 225/231/230 224/243/242 239/250/249 240/252/251
f 233/230/229 232/229/228 247/251/250 248/253/252
f 226/232/231 225/231/230 240/252/251 241/254/253
f 234/233/232 233/230/229 248/253/252 249/255/254
f 227/234/233 226/232/231 241/254/253 242/256/255
f 235/235/234 234/233/232 249/255/254 250/257/256
f 228/236/235 227/234/233 242/256/255 243/258/257
f 236/237/236 235/235/234 250/257/256 251/245/244
f 229/238/237 228/236/235 243/258/257 244/246/245
f 241/254/253 240/252/251 255/259/258 256/260/259
f 249/255/254 248/253/252 263/261/260 264/262/261
f 242/256/255 241/254/253 256/260/259 257/263/262
f 250/257/256 249/255/254 264/262/261 265/264/263
f 243/258/257 242/256/255 257/263/262 258/265/264
f 251/245/244 250/257/256 265/264/263 266/266/265
f 244/246/245 243/258/257 258/265/264 259/267/266
f 237/244/243 297/152/18 252/268/267
f 206/20/20 251/245/244 266/266/265
f 245/247/246 244/246/245 259/267/266 260/269/268
f 238/248/247 237/244/243 252/268/267 253/270/269
f 246/249/248 245/247/246 260/269/268 261/271/270
f 239/250/249 238/248/247 253/270/269 254/272/271
f 247/251/250 246/249/248 261/271/270 262/273/272
f 240/252/251 239/250/249 254/272/271 255/259/258
f 248/253/252 247/251/250 262/273/272 263/261/260
f 260/269/268 259/267/266 274/274/273 275/275/274
f 253/270/269 252/268/267 267/276/275 268/277/276
f 261/271/270 260/269/268 275/275/274 276/278/277
f 254/272/271 253/270/269 268/277/276 269/279/278
f 262/273/272 261/271/270 276/278/277 277/280/279
f 255/259/258 254/272/271 269/279/278 270/281/280
f 263/261/260 262/273/272 277/280/279 278/282/281
f 256/260/259 255/259/258 270/281/280 271/283/282
f 264/262/261 263/261/260 278/282/281 279/284/283
f 257/263/262 256/260/259 271/283/282 272/285/284
f 265/264/263 264/262/261 279/284/283 280/286/285
f 258/265/264 257/263/262 272/285/284 273/287/286
f 266/266/265 265/264/263 280/286/285 281/288/287
f 259/267/266 258/265/264 273/287/286 274/274/273
f 252/268/267 297/152/18 267/276/275
f 206/20/20 266/266/265 281/288/287
f 279/284/283 278/282/281 293/289/288 294/290/289
f 272/285/284 271/283/282 286/291/290 287/292/291
f 280/286/285 279/284/283 294/290/289 295/293/292
f 273/287/286 272/285/284 287/292/291 288/294/293
f 281/288/287 280/286/285 295/293/292 296/295/294
f 274/274/273 273/287/286 288/294/293 289/296/295
f 267/276/275 297/152/18 282/297/296
f 206/20/20 281/288/287 296/295/294
f 275/275/274 274/274/273 289/296/295 290/298/297
f 268/277/276 267/276/275 282/297/296 283/299/298
f 276/278/277 275/275/274 290/298/297 291/300/299
f 269/279/278 268/277/276 283/299/298 284/301/300
f 277/280/279 276/278/277 291/300/299 292/302/301
f 270/281/280 269/279/278 284/301/300 285/303/302
f 278/282/281 277/280/279 292/302/301 293/289/288
f 271/283/282 270/281/280 285/303/302 286/291/290
f 283/299/298 282/297/296 298/304/303 299/305/304
f 291/300/299 290/298/297 306/306/305 307/307/306
f 284/301/300 283/299/298 299/305/304 300/308/307
f 292/302/301 291/300/299 307/307/306 308/309/308
f 285/303/302 284/301/300 300/308/307 301/310/309
f 293/289/288 292/302/301 308/309/308 309/311/310
f 286/291/290 285/303/302 301/310/309 302/312/311
f 294/290/289 293/289/288 309/311/310 310/313/312
f 287/292/291 286/291/290 302/312/311 303/314/313
f 295/293/292 294/290/289 310/313/312 311/315/314
f 288/294/293 287/292/291 303/314/313 304/316/315
f 296/295/294 295/293/292 311/315/314 312/317/316
f 289/296/295 288/294/293 304/316/315 305/318/317
f 282/297/296 297/152/18 298/304/303
f 206/20/20 296/295/294 312/317/316
f 290/298/297 289/296/295 305/318/317 306/306/305
f 303/314/313 302/312/311 317/319/318 318/320/319
f 311/315/314 310/313/312 325/321/320 326/322/321
f 304/316/315 303/314/313 318/320/319 319/323/322
f 312/317/316 311/315/314 326/322/321 327/324/323
f 305/318/317 304/316/315 319/323/322 320/325/324
f 298/304/303 297/152/18 313/326/325
f 206/20/20 312/317/316 327/324/323
f 306/306/305 305/318/317 320/325/324 321/327/326
f 299/305/304 298/304/303 313/326/325 314/328/327
f 307/307/306 306/306/305 321/327/326 322/329/328
f 300/308/307 299/305/304 314/328/327 315/330/329
f 308/309/308 307/307/306 322/329/328 323/331/330
f 301/310/309 300/308/307 315/330/329 316/332/331
f 309/311/310 308/309/308 323/331/330 324/333/332
f 302/312/311 301/310/309 316/332/331 317/319/318
f 310/313/312 309/311/310 324/333/332 325/321/320
f 322/329/328 321/327/326 336/334/333 337/335/334
f 315/330/329 314/328/327 329/336/335 330/337/336
f 323/331/330 322/329/328 337/335/334 338/338/337
f 316/332/331 315/330/329 330/337/336 331/339/338
f 324/333/332 323/331/330 338/338/337 339/340/339
f 317/319/318 316/332/331 331/339/338 332/341/340
f 325/321/320 324/333/332 339/340/339 340/342/341
f 318/320/319 317/319/318 332/341/340 333/343/342
f 326/322/321 325/321/320 340/342/341 341/344/343
f 319/323/322 318/320/319 333/343/342 334/345/344
f 327/324/323 326/322/321 341/344/343 342/346/345
f 320/325/324 319/323/322 334/345/344 335/347/346
f 313/326/325 297/152/18 328/348/347
f 206/20/20 327/324/323 342/346/345
f 321/327/326 320/325/324 335/347/346 336/334/333
f 314/328/327 313/326/325 328/348/347 329/336/335
f 341/344/343 340/342/341 355/349/348 356/350/349
f 334/345/344 333/343/342 348/351/350 349/352/351
f 342/346/345 341/344/343 356/350/349 357/353/352
f 335/347/346 334/345/344 349/352/351 350/354/353
f 328/348/347 297/152/18 343/355/354
f 206/20/20 342/346/345 357/353/352
f 336/334/333 335/347/346 350/354/353 351/356/355
f 329/336/335 328/348/347 343/355/354 344/357/356
f 337/335/334 336/334/333 351/356/355 352/358/357
f 330/337/336 329/336/335 344/357/356 345/359/358
f 338/338/337 337/335/334 352/358/357 353/360/359
f 331/339/338 330/337/336 345/359/358 346/361/360
f 339/340/339 338/338/337 353/360/359 354/362/361
f 332/341/340 331/339/338 346/361/360 347/363/362
f 340/342/341 339/340/339 354/362/361 355/349/348
f 333/343/342 332/341/340 347/363/362 348/351/350
f 353/360/359 352/358/357 367/364/363 368/365/364
f 346/361/360 345/359/358 360/366/365 361/367/366
f 354/362/361 353/360/359 368/365/364 369/368/367
f 347/363/362 346/361/360 361/367/366 362/369/368
f 355/349/348 354/362/361 369/368/367 370/370/369
f 348/351/350 347/363/362 362/369/368 363/371/370
f 356/350/349 355/349/348 370/370/369 371/372/371
f 349/352/351 348/351/350 363/371/370 364/373/372
f 357/353/352 356/350/349 371/372/371 372/374/373
f 350/354/353 349/352/351 364/373/372 365/375/374
f 343/355/354 297/152/18 358/376/375
f 206/20/20 357/353/352 372/377/373
f 351/356/355 350/354/353 365/375/374 366/378/376
f 344/357/356 343/355/354 358/376/375 359/379/377
f 352/358/357 351/356/355 366/378/376 367/364/363
f 345/359/358 344/357/356 359/379/377 360/366/365
f 372/377/373 371/380/371 386/381/378 387/382/379
f 365/375/374 364/373/372 379/383/380 380/384/381
f 358/376/375 297/152/18 373/385/382
f 206/20/20 372/377/373 387/382/379
f 366/378/376 365/375/374 380/384/381 381/386/383
f 359/379/377 358/376/375 373/385/382 374/387/384
f 367/364/363 366/378/376 381/386/383 382/388/385
f 360/366/365 359/379/377 374/387/384 375/389/386
f 368/365/364 367/364/363 382/388/385 383/390/387
f 361/367/366 360/366/365 375/389/386 376/391/388
f 369/368/367 368/365/364 383/390/387 384/392/389
f 362/369/368 361/367/366 376/391/388 377/393/390
f 370/370/369 369/368/367 384/392/389 385/394/391
f 363/371/370 362/369/368 377/393/390 378/395/392
f 371/380/371 370/396/369 385/397/391 386/381/378
f 364/373/372 363/371/370 378/395/392 379/383/380
f 376/398/388 375/399/386 390/400/393 391/401/394
f 384/402/389 383/403/387 398/404/395 399/405/396
f 377/406/390 376/398/388 391/401/394 392/407/397
f 385/397/391 384/402/389 399/405/396 400/408/398
f 378/409/392 377/406/390 392/407/397 393/410/399
f 386/381/378 385/397/391 400/408/398 401/411/400
f 379/412/380 378/409/392 393/410/399 394/413/401
f 387/382/379 386/381/378 401/411/400 402/414/402
f 380/415/381 379/412/380 394/413/401 395/416/403
f 373/417/382 297/18/18 388/418/404
f 206/20/20 387/382/379 402/414/402
f 381/419/383 380/415/381 395/416/403 396/420/405
f 374/421/384 373/417/382 388/418/404 389/422/406
f 382/423/385 381/419/383 396/420/405 397/424/407
f 375/399/386 374/421/384 389/422/406 390/400/393
f 383/403/387 382/423/385 397/424/407 398/404/395
f 395/416/403 394/413/401 409/425/408 410/426/409
f 388/418/404 297/18/18 403/427/410
f 206/20/20 402/414/402 417/428/411
f 396/420/405 395/416/403 410/426/409 411/429/412
f 389/422/406 388/418/404 403/427/410 404/430/413
f 397/424/407 396/420/405 411/429/412 412/431/414
f 390/400/393 389/422/406 404/430/413 405/432/415
f 398/404/395 397/424/407 412/431/414 413/433/416
f 391/401/394 390/400/393 405/432/415 406/434/417
f 399/405/396 398/404/395 413/433/416 414/435/418
f 392/407/397 391/401/394 406/434/417 407/436/419
f 400/408/398 399/405/396 414/435/418 415/437/420
f 393/410/399 392/407/397 407/436/419 408/438/421
f 401/411/400 400/408/398 415/437/420 416/439/422
f 394/413/401 393/410/399 408/438/421 409/425/408
f 402/414/402 401/411/400 416/439/422 417/428/411
f 414/435/418 413/433/416 428/440/423 429/441/424
f 407/436/419 406/434/417 421/442/425 422/443/426
f 415/437/420 414/435/418 429/441/424 430/444/427
f 408/438/421 407/436/419 422/443/426 423/445/428
f 416/439/422 415/437/420 430/444/427 431/446/429
f 409/425/408 408/438/421 423/445/428 424/447/430
f 417/428/411 416/439/422 431/446/429 432/448/431
f 410/426/409 409/425/408 424/447/430 425/449/432
f 403/427/410 297/18/18 418/450/433
f 206/20/20 417/428/411 432/448/431
f 411/429/412 410/426/409 425/449/432 426/451/434
f 404/430/413 403/427/410 418/450/433 419/452/435
f 412/431/414 411/429/412 426/451/434 427/453/436
f 405/432/415 404/430/413 419/452/435 420/454/437
f 413/433/416 412/431/414 427/453/436 428/440/423
f 406/434/417 405/432/415 420/454/437 421/442/425
f 418/450/433 297/18/18 433/455/438
f 206/20/20 432/448/431 447/456/439
f 426/451/434 425/449/432 440/457/440 441/458/441
f 419/452/435 418/450/433 433/455/438 434/459/442
f 427/453/436 426/451/434 441/458/441 442/460/443
f 420/454/437 419/452/435 434/459/442 435/461/444
f 428/440/423 427/453/436 442/460/443 443/462/445
f 421/442/425 420/454/437 435/461/444 436/463/446
f 429/441/424 428/440/423 443/462/445 444/464/447
f 422/443/426 421/442/425 436/463/446 437/465/448
f 430/444/427 429/441/424 444/464/447 445/466/449
f 423/445/428 422/443/426 437/465/448 438/467/450
f 431/446/429 430/444/427 445/466/449 446/468/451
f 424/447/430 423/445/428 438/467/450 439/469/452
f 432/448/431 431/446/429 446/468/451 447/456/439
f 425/449/432 424/447/430 439/469/452 440/457/440
f 437/465/448 436/463/446 451/470/453 452/471/454
f 445/466/449 444/464/447 459/472/455 460/473/456
f 438/467/450 437/465/448 452/471/454 453/474/457
f 446/468/451 445/466/449 460/473/456 461/475/458
f 439/469/452 438/467/450 453/474/457 454/476/459
f 447/456/439 446/468/451 461/475/458 462/477/460
f 440/457/440 439/469/452 454/476/459 455/478/461
f 433/455/438 297/18/18 448/479/462
f 206/20/20 447/456/439 462/477/460
f 441/458/441 440/457/440 455/478/461 456/480/463
f 434/459/442 433/455/438 448/479/462 449/481/464
f 442/460/443 441/458/441 456/480/463 457/482/465
f 435/461/444 434/459/442 449/481/464 450/483/466
f 443/462/445 442/460/443 457/482/465 458/484/467
f 436/463/446 435/461/444 450/483/466 451/470/453
f 444/464/447 443/462/445 458/484/467 459/472/455
f 456/480/463 455/478/461 470/485/468 471/486/469
f 449/481/464 448/479/462 463/487/470 464/488/471
f 457/482/465 456/480/463 471/486/469 472/489/472
f 450/483/466 449/481/464 464/488/471 465/490/473
f 458/484/467 457/482/465 472/489/472 473/491/474
f 451/470/453 450/483/466 465/490/473 466/492/475
f 459/472/455 458/484/467 473/491/474 474/493/476
f 452/471/454 451/470/453 466/492/475 467/494/477
f 460/473/456 459/472/455 474/493/476 475/495/478
f 453/474/457 452/471/454 467/494/477 468/496/479
f 461/475/458 460/473/456 475/495/478 476/497/480
f 454/476/459 453/474/457 468/496/479 469/498/481
f 462/477/460 461/475/458 476/497/480 477/499/482
f 455/478/461 454/476/459 469/498/481 470/485/468
f 448/479/462 297/18/18 463/487/470
f 206/20/20 462/477/460 477/499/482
f 475/495/478 474/493/476 480/2/2 10/1/1
f 468/496/479 467/494/477 5/6/6 6/5/5
f 476/497/480 475/495/478 10/1/1 481/9/9
f 469/498/481 468/496/479 6/5/5 7/11/11
f 477/499/482 476/497/480 481/9/9 482/13/13
f 470/485/468 469/498/481 7/11/11 8/15/15
f 463/487/470 297/18/18 1/17/17
f 206/20/20 477/499/482 482/13/13
f 471/486/469 470/485/468 8/15/15 9/21/21
f 464/488/471 463/487/470 1/17/17 2/23/23
f 472/489/472 471/486/469 9/21/21 478/25/25
f 465/490/473 464/488/471 2/23/23 3/27/27
f 473/491/474 472/489/472 478/25/25 479/29/29
f 466/492/475 465/490/473 3/27/27 4/31/31
f 474/493/476 473/491/474 479/29/29 480/2/2
f 467/494/477 466/492/475 4/31/31 5/6/6
