{
  "$schema": "https://turborepo.org/schema.json",
  "pipeline": {
    "build": {
      "dependsOn": [
        "^build"
      ],
      "outputs": [
        "dist/**",
        ".next/**"
      ]
    },
    "lint": {
      "outputs": []
    },
    "dev": {
      "cache": false
    }
  },
  "globalEnv": [
    "ENVIRONMENT"
  ]
}