ID,UGS,Name,Parent,Type,Images,DESCRIPTION,DESCRIPTION COURTE,Published,Position,Regular Price,Sale Price,Attribute 1 name,Attribute 1 value(s),Attributee 1 visible,Attribute 1 global,Attribute 2 name,Attribute 2 value(s),Attribute 2 visible,Attribute 2 global,Tax status,Tax class,In stock?,STOCK,Backorders allowed?,Longueur (cm),Hauteur (cm),Largeur (cm),Poids (kg),Allow customer reviews?,CATEGORIES,Tags,Meta :_wpcom_is_markdown
,AAAA,MyName,,Simple,https://www.prod-alba.com/wp-content/uploads/YYYY/MM/AAAA-scaled.jpeg,MyLongDescription,MyShortDescription,1,0,42,,,,,,,,,,,,1,100,0,7,7,7,0.22,1,"Parfums d'intérieur,Parfums d'intérieur>Diffuseurs par Capillarités,Collections,Colections>Apothicaire","Fruité,Fleuri,Vert",1
,BBBB,MyName2,,Simple,https://www.prod-alba.com/wp-content/uploads/YYYY/MM/BBBB-scaled.jpeg,MyLongDescription,MyShortDescription,1,1,42,43,,,,,,,,,,,1,100,0,7,7,7,0.22,1,"Parfums d'intérieur,Parfums d'intérieur>Diffuseurs par Capillarités,Collections,Colections>Apothicaire","Fruité,Fleuri,Vert",1
,CCCC,MyName3,,Variable,https://www.prod-alba.com/wp-content/uploads/YYYY/MM/CCCC-scaled.jpeg,MyLongDescription,MyShortDescription,1,3,,,CA1N,CA1V,CA1VI,CA1G,CA2N,CA2V,CA2VI,CA2G,,,1,100,0,,,,,1,"Parfums d'intérieur,Parfums d'intérieur>Diffuseurs par Capillarités,Collections,Colections>Apothicaire","Fruité,Fleuri,Vert",1
,CCCD,MyName4,CCCC,Variation,https://www.prod-alba.com/wp-content/uploads/YYYY/MM/CCCD-scaled.jpeg,MyLongDescription,MyShortDescription,1,5,42,43,CA1N,CA1V,CA1VI,CA1G,CA2N,CA2V,CA2VI,CA2G,,,1,100,0,7,7,7,0.22,1,"Parfums d'intérieur,Parfums d'intérieur>Diffuseurs par Capillarités,Collections,Colections>Apothicaire","Fruité,Fleuri,Vert",1
