module secret-resolver

go 1.19

require (
	github.com/aws/aws-sdk-go-v2 v1.17.1 // indirect
	github.com/aws/aws-sdk-go-v2/config v1.18.2 // indirect
	github.com/aws/aws-sdk-go-v2/credentials v1.13.2 // indirect
	github.com/aws/aws-sdk-go-v2/feature/ec2/imds v1.12.19 // indirect
	github.com/aws/aws-sdk-go-v2/internal/configsources v1.1.25 // indirect
	github.com/aws/aws-sdk-go-v2/internal/endpoints/v2 v2.4.19 // indirect
	github.com/aws/aws-sdk-go-v2/internal/ini v1.3.26 // indirect
	github.com/aws/aws-sdk-go-v2/service/ec2 v1.72.0 // indirect
	github.com/aws/aws-sdk-go-v2/service/internal/accept-encoding v1.9.10 // indirect
	github.com/aws/aws-sdk-go-v2/service/internal/endpoint-discovery v1.7.19 // indirect
	github.com/aws/aws-sdk-go-v2/service/internal/presigned-url v1.9.19 // indirect
	github.com/aws/aws-sdk-go-v2/service/secretsmanager v1.16.7 // indirect
	github.com/aws/aws-sdk-go-v2/service/sso v1.11.25 // indirect
	github.com/aws/aws-sdk-go-v2/service/ssooidc v1.13.8 // indirect
	github.com/aws/aws-sdk-go-v2/service/sts v1.17.4 // indirect
	github.com/aws/smithy-go v1.13.4 // indirect
	github.com/inconshreveable/mousetrap v1.0.1 // indirect
	github.com/jmespath/go-jmespath v0.4.0 // indirect
	github.com/spf13/cobra v1.6.1 // indirect
	github.com/spf13/pflag v1.0.5 // indirect
)
