module cert-renewal

go 1.19

require (
	github.com/aws/aws-sdk-go-v2 v1.18.1 // indirect
	github.com/aws/aws-sdk-go-v2/config v1.18.27 // indirect
	github.com/aws/aws-sdk-go-v2/credentials v1.13.26 // indirect
	github.com/aws/aws-sdk-go-v2/feature/ec2/imds v1.13.4 // indirect
	github.com/aws/aws-sdk-go-v2/internal/configsources v1.1.34 // indirect
	github.com/aws/aws-sdk-go-v2/internal/endpoints/v2 v2.4.28 // indirect
	github.com/aws/aws-sdk-go-v2/internal/ini v1.3.35 // indirect
	github.com/aws/aws-sdk-go-v2/service/ec2 v1.100.1 // indirect
	github.com/aws/aws-sdk-go-v2/service/internal/presigned-url v1.9.28 // indirect
	github.com/aws/aws-sdk-go-v2/service/secretsmanager v1.19.10 // indirect
	github.com/aws/aws-sdk-go-v2/service/sso v1.12.12 // indirect
	github.com/aws/aws-sdk-go-v2/service/ssooidc v1.14.12 // indirect
	github.com/aws/aws-sdk-go-v2/service/sts v1.19.2 // indirect
	github.com/aws/smithy-go v1.13.5 // indirect
	github.com/jmespath/go-jmespath v0.4.0 // indirect
	golang.org/x/crypto v0.10.0 // indirect
	golang.org/x/sys v0.9.0 // indirect
	vimagination.zapto.org/dos2unix v1.0.0 // indirect
)
