name,instance,ip,user,region
mw-prod-adapter-5,i-03e4a154ea306dbc6,172.20.1.133,centos,us-east-1
mw-prod-adapter-1,i-00ed03247ab3b74d7,172.20.1.52,centos,us-east-1
mw-prod-adapter-9,i-003b8e67221164ba7,172.20.1.127,centos,us-east-1
mw-prod-adapter-3,i-028beba8d2b17848d,172.20.5.161,centos,us-east-1
mw-prod-adapter-7,i-0548bc7fe78c71d76,172.20.5.88,centos,us-east-1
salesdemo.dublabs.com,i-093bea06f32132e98,172.20.0.48,centos,us-east-1
mw-prod-adapter-6,i-050c10645bb629544,172.25.1.209,centos,us-west-2
mw-prod-adapter-2,i-03e236b324123c207,172.25.1.79,centos,us-west-2
mw-prod-adapter-4,i-094b81c5ca2b07432,172.25.5.83,centos,us-west-2
mw-prod-adapter-8,i-03c4e05afac47b33d,172.25.5.159,centos,us-west-2
