module alb-import

go 1.19

require (
	github.com/aws/aws-sdk-go-v2 v1.21.0 // indirect
	github.com/aws/aws-sdk-go-v2/config v1.18.39 // indirect
	github.com/aws/aws-sdk-go-v2/credentials v1.13.37 // indirect
	github.com/aws/aws-sdk-go-v2/feature/ec2/imds v1.13.11 // indirect
	github.com/aws/aws-sdk-go-v2/internal/configsources v1.1.41 // indirect
	github.com/aws/aws-sdk-go-v2/internal/endpoints/v2 v2.4.35 // indirect
	github.com/aws/aws-sdk-go-v2/internal/ini v1.3.42 // indirect
	github.com/aws/aws-sdk-go-v2/service/elasticloadbalancingv2 v1.21.4 // indirect
	github.com/aws/aws-sdk-go-v2/service/internal/presigned-url v1.9.35 // indirect
	github.com/aws/aws-sdk-go-v2/service/sso v1.13.6 // indirect
	github.com/aws/aws-sdk-go-v2/service/ssooidc v1.15.6 // indirect
	github.com/aws/aws-sdk-go-v2/service/sts v1.21.5 // indirect
	github.com/aws/smithy-go v1.14.2 // indirect
	github.com/jmespath/go-jmespath v0.4.0 // indirect
)
