<svg width="16" height="16" xmlns="http://www.w3.org/2000/svg" class="bi bi-cart" fill="currentColor">

 <g>
  <title>Layer 1</title>
  <path id="svg_1" d="m0,1.5a0.5,0.5 0 0 1 0.5,-0.5l1.5,0a0.5,0.5 0 0 1 0.485,0.379l0.405,1.621l11.61,0a0.5,0.5 0 0 1 0.491,0.592l-1.5,8a0.5,0.5 0 0 1 -0.491,0.408l-9,0a0.5,0.5 0 0 1 -0.491,-0.408l-1.499,-7.985l-0.4,-1.607l-1.11,0a0.5,0.5 0 0 1 -0.5,-0.5zm3.102,2.5l1.313,7l8.17,0l1.313,-7l-10.796,0zm1.898,8a2,2 0 1 0 0,4a2,2 0 0 0 0,-4zm7,0a2,2 0 1 0 0,4a2,2 0 0 0 0,-4zm-7,1a1,1 0 1 1 0,2a1,1 0 0 1 0,-2zm7,0a1,1 0 1 1 0,2a1,1 0 0 1 0,-2z"/>
  <path fill="#e51414" stroke="null" id="svg_4" d="m9.14842,3.22226l0.94659,-0.2499l-0.87481,-0.41297l0.98186,-0.07651l-0.76929,-0.56067l0.97941,0.09912l-0.63464,-0.6866l0.93953,0.27112l-0.47544,-0.786l0.86315,0.43251l-0.29753,-0.85469l0.75396,0.5777l-0.10858,-0.89183l0.61562,0.70056l0.08435,-0.89378l0.45397,0.79633l0.27453,-0.86167l0.27422,0.86167l0.45366,-0.79633l0.08435,0.89378l0.61592,-0.70056l-0.10889,0.89183l0.75426,-0.5777l-0.29815,0.85497l0.86315,-0.43251l-0.47513,0.78572l0.93922,-0.27112l-0.63494,0.68632l0.97941,-0.09912l-0.76899,0.56095l0.98155,0.07651l-0.87481,0.41297l0.94659,0.2499l-0.94659,0.2499l0.87481,0.41297l-0.98155,0.07651l0.76929,0.56067l-0.97941,-0.09912l0.63494,0.6866l-0.93922,-0.27112l0.47513,0.78572l-0.86315,-0.43251l0.29784,0.85497l-0.75426,-0.57743l0.10889,0.89155l-0.61592,-0.70056l-0.08435,0.8935l-0.45366,-0.79633l-0.27422,0.86167l-0.27453,-0.86167l-0.45397,0.79633l-0.08435,-0.8935l-0.61562,0.70056l0.10858,-0.89155l-0.75396,0.57743l0.29784,-0.85497l-0.86315,0.43251l0.47544,-0.78572l-0.93953,0.27112l0.63464,-0.6866l-0.97971,0.09912l0.76929,-0.56067l-0.98186,-0.07651l0.87512,-0.41297l-0.94689,-0.2499z"/>
 </g>
</svg>