E1
A1
D2
G2
C3
F3
Bb3
Eb4
Ab4
Db5
Gb5
Cb5
F6
A#6

D1
G1
C2
F2
Bb2
Eb3
Ab3
C#4
F#4
B4
E5
A5
D6
G6

F1
Bb1
Eb2
Ab2
C#3
F#3
B3
E4
A4
D5
G5
C6
F6
Bb6

D#1
G#1
C#2
F#2
B2
E3
A3
D4
G4
C5
F5
Bb5
Eb6
Ab6

F#1
B1
E2
A2
D3
G3
C4
F4
Bb4
Eb5
Ab5
Db6
Gb6
B6

E1
A1
D2
G2
C3
F3
Bb3
Eb4
Ab4
C#5
F#5
B5
E6
A6

G1
C2
F2
Bb2
Eb3
Ab3
C#4
F#4
B4
E5
A5
D6
G6
C7

F1
A#1
Eb2
Ab2
C#3
F#3
B3
E4
A4
D5
G5
C6
F6
Bb6

G#1
C#2
F#2
B2
E3
A3
D4
G4
C5
F5
Bb5
Eb6
Ab6
Db7

F#1
B1
E2
A2
D3
G3
C4
F4
Bb4
Eb5
Ab5
Db6
Gb6
B6
