verilog xil_defaultlib --include "../../../../DesignSuiteProject.srcs/sources_1/bd/Zynq_Design/ipshared/ec67/hdl" --include "../../../../DesignSuiteProject.srcs/sources_1/bd/Zynq_Design/ipshared/8c62/hdl" --include "../../../../DesignSuiteProject.srcs/sources_1/bd/Zynq_Design/ip/Zynq_Design_processing_system7_0_0" \
"../../../bd/Zynq_Design/ip/Zynq_Design_processing_system7_0_0/sim/Zynq_Design_processing_system7_0_0.v" \
"../../../../DesignSuiteProject.srcs/sources_1/bd/Zynq_Design/ipshared/13a6/hdl/verilog/hls_macc_dadddsub_64ns_64ns_64_16_full_dsp_1.v" \
"../../../../DesignSuiteProject.srcs/sources_1/bd/Zynq_Design/ipshared/13a6/hdl/verilog/hls_macc_dmul_64ns_64ns_64_18_max_dsp_1.v" \
"../../../../DesignSuiteProject.srcs/sources_1/bd/Zynq_Design/ipshared/13a6/hdl/verilog/hls_macc_HLS_MACC_PERIPH_BUS_s_axi.v" \
"../../../../DesignSuiteProject.srcs/sources_1/bd/Zynq_Design/ipshared/13a6/hdl/verilog/hls_macc_sitodp_32ns_64_8_1.v" \
"../../../../DesignSuiteProject.srcs/sources_1/bd/Zynq_Design/ipshared/13a6/hdl/verilog/hls_macc.v" \
"../../../bd/Zynq_Design/ip/Zynq_Design_auto_pc_0/sim/Zynq_Design_auto_pc_0.v" \
"../../../bd/Zynq_Design/sim/Zynq_Design.v" \

verilog xil_defaultlib "glbl.v"

nosort
