Design Route Status
                                               :      # nets :
   ------------------------------------------- : ----------- :
   # of logical nets.......................... :        7964 :
       # of nets not needing routing.......... :        3608 :
           # of internally routed nets........ :        3608 :
       # of routable nets..................... :        4356 :
           # of fully routed nets............. :        4356 :
       # of nets with routing errors.......... :           0 :
   ------------------------------------------- : ----------- :

