#-----------------------------------------------------------
# Webtalk v2019.1 (64-bit)
# SW Build 2552052 on Fri May 24 14:47:09 MDT 2019
# IP Build 2548770 on Fri May 24 18:01:18 MDT 2019
# Start of session at: Mon Nov 25 18:04:14 2019
# Process ID: 13547
# Current directory: /home/roberto/HPC/heterogeneous/FPGA/Project/original_code/hls_macc/vhls_prj/solution1/sim/verilog
# Command line: wbtcv -mode batch -source /home/roberto/HPC/heterogeneous/FPGA/Project/original_code/hls_macc/vhls_prj/solution1/sim/verilog/xsim.dir/hls_macc/webtalk/xsim_webtalk.tcl -notrace
# Log file: /home/roberto/HPC/heterogeneous/FPGA/Project/original_code/hls_macc/vhls_prj/solution1/sim/verilog/webtalk.log
# Journal file: /home/roberto/HPC/heterogeneous/FPGA/Project/original_code/hls_macc/vhls_prj/solution1/sim/verilog/webtalk.jou
#-----------------------------------------------------------
source /home/roberto/HPC/heterogeneous/FPGA/Project/original_code/hls_macc/vhls_prj/solution1/sim/verilog/xsim.dir/hls_macc/webtalk/xsim_webtalk.tcl -notrace
INFO: [Common 17-186] '/home/roberto/HPC/heterogeneous/FPGA/Project/original_code/hls_macc/vhls_prj/solution1/sim/verilog/xsim.dir/hls_macc/webtalk/usage_statistics_ext_xsim.xml' has been successfully sent to Xilinx on Mon Nov 25 18:04:18 2019. For additional details about this file, please refer to the WebTalk help file at /home/roberto/Vivado/Xilinx/Vivado/2019.1/doc/webtalk_introduction.html.
INFO: [Common 17-206] Exiting Webtalk at Mon Nov 25 18:04:18 2019...
