   __  ___   ___________ ___    __    _______   ____________
  / / / / | / /  _/ ___//   |  / /   / ____/ | / /_  __/ __ \
 / / / /  |/ // / \__ \/ /| | / /   / __/ /  |/ / / / / / / /
/ /_/ / /|  // / ___/ / ___ |/ /___/ /___/ /|  / / / / /_/ /
\____/_/ |_/___//____/_/  |_/_____/_____/_/ |_/ /_/  \____/
