<?xml version="1.0" encoding="UTF-8" standalone="no"?>
<!-- Generator: Adobe Illustrator 16.0.0, SVG Export Plug-In . SVG Version: 6.00 Build 0)  -->

<svg
   xmlns:dc="http://purl.org/dc/elements/1.1/"
   xmlns:cc="http://creativecommons.org/ns#"
   xmlns:rdf="http://www.w3.org/1999/02/22-rdf-syntax-ns#"
   xmlns:svg="http://www.w3.org/2000/svg"
   xmlns="http://www.w3.org/2000/svg"
   xmlns:sodipodi="http://sodipodi.sourceforge.net/DTD/sodipodi-0.dtd"
   xmlns:inkscape="http://www.inkscape.org/namespaces/inkscape"
   version="1.1"
   id="Layer_1"
   x="0px"
   y="0px"
   width="16mm"
   height="3.4999995mm"
   viewBox="0 0 60.472438 13.228344"
   enable-background="new 0 0 30.24 30.24"
   xml:space="preserve"
   sodipodi:docname="PIKO55290-PCB.svg"
   inkscape:version="0.92.5 (2060ec1f9f, 2020-04-08)"><metadata
   id="metadata31"><rdf:RDF><cc:Work
       rdf:about=""><dc:format>image/svg+xml</dc:format><dc:type
         rdf:resource="http://purl.org/dc/dcmitype/StillImage" /><dc:title></dc:title></cc:Work></rdf:RDF></metadata><defs
   id="defs29" /><sodipodi:namedview
   pagecolor="#000000"
   bordercolor="#666666"
   borderopacity="1"
   objecttolerance="10"
   gridtolerance="10"
   guidetolerance="10"
   inkscape:pageopacity="0"
   inkscape:pageshadow="2"
   inkscape:window-width="1920"
   inkscape:window-height="1055"
   id="namedview27"
   showgrid="true"
   inkscape:showpageshadow="false"
   units="mm"
   inkscape:zoom="7.8042329"
   inkscape:cx="18.315367"
   inkscape:cy="2.5484032"
   inkscape:window-x="0"
   inkscape:window-y="0"
   inkscape:window-maximized="1"
   inkscape:current-layer="copper1"
   fit-margin-top="0"
   fit-margin-left="0"
   fit-margin-right="0"
   fit-margin-bottom="0"><inkscape:grid
     type="xygrid"
     id="grid838"
     units="mm"
     spacingx="0.37795273"
     spacingy="0.37795273"
     originx="-5.4240223e-06"
     originy="1.5124199e-05" /></sodipodi:namedview>


<g
   id="keepout"
   transform="translate(-5.4240227e-6,-17.011672)">
</g>
<g
   id="soldermask"
   transform="translate(-5.4240227e-6,-17.011672)">
</g>
<g
   id="outline"
   transform="translate(-5.4240227e-6,-17.011672)">
</g>
<g
   id="silkscreen"
   transform="translate(-5.4240227e-6,-112.62994)"><rect
     style="fill:none;fill-opacity:1;stroke:#ffffff;stroke-width:1.00157452;stroke-miterlimit:4;stroke-dasharray:none;stroke-opacity:1"
     id="rect887"
     width="59.470867"
     height="12.22677"
     x="0.50079268"
     y="113.13073" /><g
     id="copper1"
     transform="translate(0,-0.2702285)"><circle
       style="fill:none;stroke:#ffbf00;stroke-width:1.15199995"
       r="1.584"
       cy="123.96849"
       cx="30.236219"
       id="V" /></g></g></svg>