<?xml version="1.0" encoding="UTF-8" standalone="no"?>
<!-- Created with Inkscape (http://www.inkscape.org/) -->

<svg
   xmlns:dc="http://purl.org/dc/elements/1.1/"
   xmlns:cc="http://creativecommons.org/ns#"
   xmlns:rdf="http://www.w3.org/1999/02/22-rdf-syntax-ns#"
   xmlns:svg="http://www.w3.org/2000/svg"
   xmlns="http://www.w3.org/2000/svg"
   xmlns:sodipodi="http://sodipodi.sourceforge.net/DTD/sodipodi-0.dtd"
   xmlns:inkscape="http://www.inkscape.org/namespaces/inkscape"
   width="39.5mm"
   height="33.299999mm"
   viewBox="0 0 39.5 33.299999"
   version="1.1"
   id="svg8"
   inkscape:version="0.92.5 (2060ec1f9f, 2020-04-08)"
   sodipodi:docname="DR25E01-breadboard.svg">
  <defs
     id="defs2" />
  <sodipodi:namedview
     id="base"
     pagecolor="#ffffff"
     bordercolor="#666666"
     borderopacity="1.0"
     inkscape:pageopacity="0.0"
     inkscape:pageshadow="2"
     inkscape:zoom="5.6"
     inkscape:cx="200.08937"
     inkscape:cy="62.204175"
     inkscape:document-units="mm"
     inkscape:current-layer="layer1"
     showgrid="true"
     fit-margin-top="0"
     fit-margin-left="0"
     fit-margin-right="0"
     fit-margin-bottom="0"
     showborder="false"
     inkscape:window-width="1920"
     inkscape:window-height="1055"
     inkscape:window-x="0"
     inkscape:window-y="0"
     inkscape:window-maximized="1">
    <inkscape:grid
       type="xygrid"
       id="grid4518"
       units="mm"
       spacingx="0.1"
       spacingy="0.1"
       originx="-34.250001"
       originy="-171.35001" />
  </sodipodi:namedview>
  <metadata
     id="metadata5">
    <rdf:RDF>
      <cc:Work
         rdf:about="">
        <dc:format>image/svg+xml</dc:format>
        <dc:type
           rdf:resource="http://purl.org/dc/dcmitype/StillImage" />
        <dc:title />
      </cc:Work>
    </rdf:RDF>
  </metadata>
  <g
     inkscape:label="Ebene 1"
     inkscape:groupmode="layer"
     id="layer1"
     transform="translate(-34.25,-92.349998)">
    <path
       style="fill:#21782d;fill-opacity:1;stroke:none;stroke-width:0.19207057"
       d="M 73.749915,92.349998 V 125.64977 H 34.25 V 92.349998 Z m -1.999878,1.500167 a 1.5,1.5 0 0 0 -1.500167,1.49965 1.5,1.5 0 0 0 1.500167,1.500167 1.5,1.5 0 0 0 1.49965,-1.500167 1.5,1.5 0 0 0 -1.49965,-1.49965 z m 0,27.299625 a 1.5,1.5 0 0 0 -1.500167,1.50017 1.5,1.5 0 0 0 1.500167,1.50016 1.5,1.5 0 0 0 1.49965,-1.50016 1.5,1.5 0 0 0 -1.49965,-1.50017 z m -35.500157,0 a 1.5,1.5 0 0 0 -1.500167,1.50017 1.5,1.5 0 0 0 1.500167,1.50016 1.5,1.5 0 0 0 1.500166,-1.50016 1.5,1.5 0 0 0 -1.500166,-1.50017 z"
       id="rect4520"
       inkscape:connector-curvature="0" />
    <g
       id="g4600"
       transform="matrix(-1,0,0,1,107.99992,0)">
      <g
         id="g4558">
        <rect
           style="fill:#1468b6;fill-opacity:1;stroke:none;stroke-width:0.31305921"
           id="rect4552"
           width="5"
           height="7"
           x="39.25"
           y="92.349998" />
        <circle
           style="fill:#cfcfcf;fill-opacity:1;stroke:none;stroke-width:0.26458332"
           id="path4554"
           cx="41.75"
           cy="95.849998"
           r="1.5" />
      </g>
      <g
         id="g4558-7"
         transform="translate(5,-1.2370605e-6)">
        <rect
           style="fill:#1468b6;fill-opacity:1;stroke:none;stroke-width:0.31305921"
           id="rect4552-5"
           width="5"
           height="7"
           x="39.25"
           y="92.349998" />
        <circle
           style="fill:#cfcfcf;fill-opacity:1;stroke:none;stroke-width:0.26458332"
           id="path4554-3"
           cx="41.75"
           cy="95.849998"
           r="1.5" />
      </g>
      <g
         id="g4558-5"
         transform="translate(10,-1.2370605e-6)">
        <rect
           style="fill:#1468b6;fill-opacity:1;stroke:none;stroke-width:0.31305921"
           id="rect4552-6"
           width="5"
           height="7"
           x="39.25"
           y="92.349998" />
        <circle
           style="fill:#cfcfcf;fill-opacity:1;stroke:none;stroke-width:0.26458332"
           id="path4554-2"
           cx="41.75"
           cy="95.849998"
           r="1.5" />
      </g>
    </g>
    <g
       transform="matrix(-1,0,0,1,107.99992,26.299999)"
       id="g4600-9">
      <g
         id="g4558-1">
        <rect
           style="fill:#1468b6;fill-opacity:1;stroke:none;stroke-width:0.31305921"
           id="rect4552-2"
           width="5"
           height="7"
           x="39.25"
           y="92.349998" />
        <circle
           style="fill:#cfcfcf;fill-opacity:1;stroke:none;stroke-width:0.26458332"
           id="path4554-7"
           cx="41.75"
           cy="95.849998"
           r="1.5" />
      </g>
      <g
         id="g4558-7-0"
         transform="translate(5,-1.2370605e-6)">
        <rect
           style="fill:#1468b6;fill-opacity:1;stroke:none;stroke-width:0.31305921"
           id="rect4552-5-9"
           width="5"
           height="7"
           x="39.25"
           y="92.349998" />
        <circle
           style="fill:#cfcfcf;fill-opacity:1;stroke:none;stroke-width:0.26458332"
           id="path4554-3-3"
           cx="41.75"
           cy="95.849998"
           r="1.5" />
      </g>
      <g
         id="g4558-5-6"
         transform="translate(10,-1.2370605e-6)">
        <rect
           style="fill:#1468b6;fill-opacity:1;stroke:none;stroke-width:0.31305921"
           id="rect4552-6-0"
           width="5"
           height="7"
           x="39.25"
           y="92.349998" />
        <circle
           style="fill:#cfcfcf;fill-opacity:1;stroke:none;stroke-width:0.26458332"
           id="path4554-2-6"
           cx="41.75"
           cy="95.849998"
           r="1.5" />
      </g>
    </g>
    <rect
       style="fill:#000000;fill-opacity:1;stroke:none;stroke-width:0.26458332"
       id="rect4644"
       width="22"
       height="16.5"
       x="51.75"
       y="100.75" />
    <g
       id="g4694"
       transform="translate(-2.2499805,4.149991)">
      <g
         id="g4652">
        <rect
           style="fill:#000000;fill-opacity:1;stroke:none;stroke-width:0.26458332"
           id="rect4646"
           width="2"
           height="2"
           x="37"
           y="103.00001" />
        <circle
           style="fill:#b0b0b0;fill-opacity:1;stroke:none;stroke-width:0.26458332"
           id="path4648"
           cx="38"
           cy="104.00001"
           r="0.40000001" />
      </g>
      <g
         id="g4652-2"
         transform="translate(-9.9999999e-7,1.9999986)">
        <rect
           style="fill:#000000;fill-opacity:1;stroke:none;stroke-width:0.26458332"
           id="rect4646-6"
           width="2"
           height="2"
           x="37"
           y="103.00001" />
        <circle
           style="fill:#b0b0b0;fill-opacity:1;stroke:none;stroke-width:0.26458332"
           id="path4648-1"
           cx="38"
           cy="104.00001"
           r="0.40000001" />
      </g>
      <g
         id="g4652-8"
         transform="translate(-9.9999999e-7,3.9999986)">
        <rect
           style="fill:#000000;fill-opacity:1;stroke:none;stroke-width:0.26458332"
           id="rect4646-7"
           width="2"
           height="2"
           x="37"
           y="103.00001" />
        <circle
           style="fill:#b0b0b0;fill-opacity:1;stroke:none;stroke-width:0.26458332"
           id="path4648-9"
           cx="38"
           cy="104.00001"
           r="0.40000001" />
      </g>
    </g>
    <g
       id="g4702"
       transform="translate(3.75,3.4999896)">
      <circle
         r="3"
         cy="101.25001"
         cx="44"
         id="path4698"
         style="fill:#000000;fill-opacity:1;stroke:none;stroke-width:0.26458332" />
      <circle
         r="2"
         cy="101.25001"
         cx="44"
         id="path4696"
         style="fill:#b0b0b0;fill-opacity:1;stroke:none;stroke-width:0.26458332" />
    </g>
    <g
       id="g4702-2"
       transform="translate(-3.25,3.4999896)">
      <circle
         r="3"
         cy="101.25001"
         cx="44"
         id="path4698-0"
         style="fill:#000000;fill-opacity:1;stroke:none;stroke-width:0.26458332" />
      <circle
         r="2"
         cy="101.25001"
         cx="44"
         id="path4696-2"
         style="fill:#b0b0b0;fill-opacity:1;stroke:none;stroke-width:0.26458332" />
    </g>
    <rect
       style="fill:#000017;fill-opacity:1;stroke:none;stroke-width:0.26458332"
       id="rect4725"
       width="5.5"
       height="5.5"
       x="44.150002"
       y="94.349998" />
    <rect
       style="fill:#000017;fill-opacity:1;stroke:none;stroke-width:0.13606448"
       id="rect4725-3"
       width="2"
       height="4"
       x="35.25"
       y="95.099998" />
    <text
       xml:space="preserve"
       style="font-style:normal;font-variant:normal;font-weight:normal;font-stretch:normal;font-size:10.58333302px;line-height:1.25;font-family:'Droid Sans Fallback';-inkscape-font-specification:'Droid Sans Fallback';letter-spacing:0px;word-spacing:0px;fill:#000000;fill-opacity:1;stroke:none;stroke-width:0.26458332"
       x="105.74751"
       y="-34.750019"
       id="text4744"
       transform="rotate(90)"><tspan
         sodipodi:role="line"
         id="tspan4742"
         x="105.74751"
         y="-34.750019"
         style="font-style:normal;font-variant:normal;font-weight:normal;font-stretch:normal;font-size:6.35px;font-family:'Droid Sans Mono';-inkscape-font-specification:'Droid Sans Mono';fill:#ffffff;fill-opacity:1;stroke-width:0.26458332">V</tspan></text>
    <text
       xml:space="preserve"
       style="font-style:normal;font-variant:normal;font-weight:normal;font-stretch:normal;font-size:10.58333302px;line-height:1.25;font-family:'Droid Sans Fallback';-inkscape-font-specification:'Droid Sans Fallback';letter-spacing:0px;word-spacing:0px;fill:#000000;fill-opacity:1;stroke:none;stroke-width:0.26458332"
       x="113.36243"
       y="-34.750019"
       id="text4744-3"
       transform="rotate(90)"><tspan
         sodipodi:role="line"
         id="tspan4742-6"
         x="113.36243"
         y="-34.750019"
         style="font-style:normal;font-variant:normal;font-weight:normal;font-stretch:normal;font-size:6.35px;font-family:'Droid Sans Mono';-inkscape-font-specification:'Droid Sans Mono';fill:#ffffff;fill-opacity:1;stroke-width:0.26458332">T</tspan></text>
    <text
       xml:space="preserve"
       style="font-style:normal;font-variant:normal;font-weight:normal;font-stretch:normal;font-size:10.58333302px;line-height:1.25;font-family:'Droid Sans Fallback';-inkscape-font-specification:'Droid Sans Fallback';letter-spacing:0px;word-spacing:0px;fill:#000000;fill-opacity:1;stroke:none;stroke-width:0.26458332"
       x="109.57533"
       y="-37.097672"
       id="text4744-7"
       transform="rotate(90)"><tspan
         sodipodi:role="line"
         id="tspan4742-5"
         x="109.57533"
         y="-37.097672"
         style="font-style:normal;font-variant:normal;font-weight:normal;font-stretch:normal;font-size:6.35px;font-family:'Droid Sans Mono';-inkscape-font-specification:'Droid Sans Mono';fill:#ffffff;fill-opacity:1;stroke-width:0.26458332">G</tspan></text>
    <text
       xml:space="preserve"
       style="font-style:normal;font-variant:normal;font-weight:normal;font-stretch:normal;font-size:10.58333302px;line-height:1.25;font-family:'Droid Sans Fallback';-inkscape-font-specification:'Droid Sans Fallback';letter-spacing:0px;word-spacing:0px;fill:#000000;fill-opacity:1;stroke:none;stroke-width:0.26458332"
       x="35.010746"
       y="116.49171"
       id="text4744-35"><tspan
         sodipodi:role="line"
         id="tspan4742-62"
         x="35.010746"
         y="116.49171"
         style="font-style:normal;font-variant:normal;font-weight:normal;font-stretch:normal;font-size:7.05555556px;font-family:'Droid Sans Mono';-inkscape-font-specification:'Droid Sans Mono';fill:#ffffff;fill-opacity:1;stroke-width:0.26458332">DR25E01</tspan></text>
    <text
       xml:space="preserve"
       style="font-style:normal;font-variant:normal;font-weight:normal;font-stretch:normal;font-size:10.58333302px;line-height:1.25;font-family:'Droid Sans Fallback';-inkscape-font-specification:'Droid Sans Fallback';letter-spacing:0px;word-spacing:0px;fill:#000000;fill-opacity:1;stroke:none;stroke-width:0.26458332"
       x="52.504501"
       y="116.51715"
       id="text4744-35-9"><tspan
         sodipodi:role="line"
         id="tspan4742-62-1"
         x="52.504501"
         y="116.51715"
         style="font-style:normal;font-variant:normal;font-weight:bold;font-stretch:normal;font-size:8.46666667px;font-family:'Droid Sans';-inkscape-font-specification:'Droid Sans Bold';fill:#ffffff;fill-opacity:1;stroke-width:0.26458332">SRE-05VDC-SL-2C</tspan></text>
    <text
       xml:space="preserve"
       style="font-style:normal;font-variant:normal;font-weight:normal;font-stretch:normal;font-size:10.58333302px;line-height:1.25;font-family:'Droid Sans Fallback';-inkscape-font-specification:'Droid Sans Fallback';letter-spacing:0px;word-spacing:0px;fill:#000000;fill-opacity:1;stroke:none;stroke-width:0.26458332"
       x="50.541271"
       y="119.79954"
       id="text4744-2"><tspan
         sodipodi:role="line"
         id="tspan4742-7"
         x="50.541271"
         y="119.79954"
         style="font-style:normal;font-variant:normal;font-weight:normal;font-stretch:normal;font-size:6.35px;font-family:'Droid Sans Mono';-inkscape-font-specification:'Droid Sans Mono';fill:#ffffff;fill-opacity:1;stroke-width:0.26458332">NC1</tspan></text>
    <text
       xml:space="preserve"
       style="font-style:normal;font-variant:normal;font-weight:normal;font-stretch:normal;font-size:10.58333302px;line-height:1.25;font-family:'Droid Sans Fallback';-inkscape-font-specification:'Droid Sans Fallback';letter-spacing:0px;word-spacing:0px;fill:#000000;fill-opacity:1;stroke:none;stroke-width:0.26458332"
       x="69.806297"
       y="119.80109"
       id="text4744-2-0"><tspan
         sodipodi:role="line"
         id="tspan4742-7-9"
         x="69.806297"
         y="119.80109"
         style="font-style:normal;font-variant:normal;font-weight:normal;font-stretch:normal;font-size:6.35px;font-family:'Droid Sans Mono';-inkscape-font-specification:'Droid Sans Mono';fill:#ffffff;fill-opacity:1;stroke-width:0.26458332">NO1</tspan></text>
    <text
       xml:space="preserve"
       style="font-style:normal;font-variant:normal;font-weight:normal;font-stretch:normal;font-size:10.58333302px;line-height:1.25;font-family:'Droid Sans Fallback';-inkscape-font-specification:'Droid Sans Fallback';letter-spacing:0px;word-spacing:0px;fill:#000000;fill-opacity:1;stroke:none;stroke-width:0.26458332"
       x="-99.50425"
       y="52.899544"
       id="text4744-2-3"
       transform="rotate(-90)"><tspan
         sodipodi:role="line"
         id="tspan4742-7-6"
         x="-99.50425"
         y="52.899544"
         style="font-style:normal;font-variant:normal;font-weight:normal;font-stretch:normal;font-size:6.35px;font-family:'Droid Sans Mono';-inkscape-font-specification:'Droid Sans Mono';fill:#ffffff;fill-opacity:1;stroke-width:0.26458332">NC2</tspan></text>
    <text
       xml:space="preserve"
       style="font-style:normal;font-variant:normal;font-weight:normal;font-stretch:normal;font-size:10.58333302px;line-height:1.25;font-family:'Droid Sans Fallback';-inkscape-font-specification:'Droid Sans Fallback';letter-spacing:0px;word-spacing:0px;fill:#000000;fill-opacity:1;stroke:none;stroke-width:0.26458332"
       x="-73.10257"
       y="-98.198906"
       id="text4744-2-3-0"
       transform="scale(-1)"><tspan
         sodipodi:role="line"
         id="tspan4742-7-6-6"
         x="-73.10257"
         y="-98.198906"
         style="font-style:normal;font-variant:normal;font-weight:normal;font-stretch:normal;font-size:6.35px;font-family:'Droid Sans Mono';-inkscape-font-specification:'Droid Sans Mono';fill:#ffffff;fill-opacity:1;stroke-width:0.26458332">NO2</tspan></text>
  </g>
</svg>
