<svg xmlns="http://www.w3.org/2000/svg" width="20" height="20" viewBox="0 0 20 20">
  <path id="Path_2124" data-name="Path 2124" d="M.75,10.75a9.63,9.63,0,0,0,2.933,7.067A9.63,9.63,0,0,0,10.75,20.75a9.633,9.633,0,0,0,7.067-2.933A9.633,9.633,0,0,0,20.75,10.75a9.636,9.636,0,0,0-2.933-7.067A9.636,9.636,0,0,0,10.75.75,9.633,9.633,0,0,0,3.683,3.683,9.633,9.633,0,0,0,.75,10.75Zm18.462,0a8.156,8.156,0,0,1-2.476,5.986,8.155,8.155,0,0,1-5.986,2.476,8.153,8.153,0,0,1-5.986-2.476A8.153,8.153,0,0,1,2.288,10.75,8.155,8.155,0,0,1,4.764,4.764,8.156,8.156,0,0,1,10.75,2.288a8.158,8.158,0,0,1,5.986,2.476A8.158,8.158,0,0,1,19.212,10.75ZM9.981,9.981H6.135v1.538H9.981v3.846h1.538V11.519h3.846V9.981H11.519V6.135H9.981Z" transform="translate(-0.75 -0.75)" fill-rule="evenodd"/>
</svg>
