<svg xmlns="http://www.w3.org/2000/svg" width="90" height="90" viewBox="0 0 90 90">
  <g id="Group_11" data-name="Group 11" transform="translate(-23 -521)">
    <circle id="Ellipse_12" data-name="Ellipse 12" cx="45" cy="45" r="45" transform="translate(23 521)" fill="#f5f5f5"/>
    <path id="Path_2413" data-name="Path 2413" d="M15.178,47.749A24.932,24.932,0,1,1,24.851,49.7,24.768,24.768,0,0,1,15.178,47.749ZM4.36,24.851A20.491,20.491,0,1,0,24.851,4.36,20.514,20.514,0,0,0,4.36,24.851Zm18.311,2.18V8.284h4.36V22.671H37.494v4.36Z" transform="translate(43 541)" fill="#ea5298"/>
  </g>
</svg>
