<svg xmlns="http://www.w3.org/2000/svg" width="90" height="90" viewBox="0 0 90 90">
  <g id="Group_8" data-name="Group 8" transform="translate(-23 -578)">
    <circle id="Ellipse_14" data-name="Ellipse 14" cx="45" cy="45" r="45" transform="translate(23 578)" fill="#f5f5f5"/>
    <path id="Polygon_1" data-name="Polygon 1" d="M34.518,0l2.087,2.922L39.493.788,41.1,4l3.186-1.656,1.082,3.424,3.406-1.138L49.3,8.183l3.542-.591-.029,3.591,3.591-.029L55.817,14.7l3.551.533-1.138,3.406,3.424,1.082L60,22.9l3.213,1.6-2.135,2.888L64,29.482,61.44,32,64,34.518l-2.922,2.087,2.135,2.888L60,41.1l1.656,3.186-3.424,1.082,1.138,3.406-3.551.533.591,3.542-3.591-.029.029,3.591L49.3,55.817l-.533,3.551-3.406-1.138-1.082,3.424L41.1,60l-1.6,3.213-2.888-2.135L34.518,64,32,61.44,29.482,64l-2.087-2.922-2.888,2.135L22.9,60l-3.186,1.656-1.082-3.424-3.406,1.138L14.7,55.817l-3.542.591.029-3.591-3.591.029L8.183,49.3l-3.551-.533,1.138-3.406L2.344,44.284,4,41.1l-3.213-1.6,2.135-2.888L0,34.518,2.56,32,0,29.482l2.922-2.087L.788,24.507,4,22.9,2.344,19.716l3.424-1.082L4.631,15.228,8.183,14.7l-.591-3.542,3.591.029-.029-3.591,3.542.591.533-3.551,3.406,1.138,1.082-3.424L22.9,4l1.6-3.213,2.888,2.135L29.482,0,32,2.56Z" transform="translate(36 591)" fill="#ea5298"/>
    <path id="Path_2438" data-name="Path 2438" d="M10.273,0H7.93V-4.875H3.359V0H1.016V-11.375H3.359v4.609H7.93v-4.609h2.344ZM21.664-5.43a6.867,6.867,0,0,1-.594,2.945,4.472,4.472,0,0,1-1.7,1.953,4.7,4.7,0,0,1-2.535.688,4.732,4.732,0,0,1-2.523-.68,4.515,4.515,0,0,1-1.719-1.941,6.67,6.67,0,0,1-.617-2.9V-5.93a6.831,6.831,0,0,1,.605-2.957,4.508,4.508,0,0,1,1.711-1.961,4.706,4.706,0,0,1,2.527-.684,4.706,4.706,0,0,1,2.527.684,4.508,4.508,0,0,1,1.711,1.961,6.811,6.811,0,0,1,.605,2.949Zm-2.375-.516a4.787,4.787,0,0,0-.641-2.719,2.088,2.088,0,0,0-1.828-.93A2.088,2.088,0,0,0,15-8.676a4.732,4.732,0,0,0-.648,2.691v.555a4.847,4.847,0,0,0,.641,2.7,2.082,2.082,0,0,0,1.844.961,2.064,2.064,0,0,0,1.813-.926,4.819,4.819,0,0,0,.641-2.7ZM31.266-9.477H27.781V0H25.438V-9.477H22v-1.9h9.266ZM34.75-3.492H32.875l-.266-7.883h2.406Zm-.937,1.234a1.265,1.265,0,0,1,.918.336,1.143,1.143,0,0,1,.348.859,1.134,1.134,0,0,1-.348.852,1.265,1.265,0,0,1-.918.336,1.255,1.255,0,0,1-.91-.336,1.134,1.134,0,0,1-.348-.852,1.146,1.146,0,0,1,.348-.855A1.246,1.246,0,0,1,33.813-2.258Z" transform="translate(50 629)" fill="#fff"/>
  </g>
</svg>
