﻿51172,Escort not present on agency page
72235,Escort not present on agency page
72236,Escort not present on agency page
62052,Escort not present on agency site
71547,Escort not present on agency site
71548,Escort not present on agency site
71549,Escort not present on agency site
76338,Escort not present on agency site
63608,Escort not present on agency site
68699,Escort not present on agency site
68702,Escort not present on agency site
57933,Escort not present on agency site
53143,Escort not present on agency site
53145,Escort not present on agency site
53152,Escort not present on agency site
53220,Escort not present on agency site
53223,Escort not present on agency site
53227,Escort not present on agency site
53234,Escort not present on agency site
53235,Escort not present on agency site
53286,Escort not present on agency site
53290,Escort not present on agency site
53295,Escort not present on agency site
53296,Escort not present on agency site
64753,Escort not present on agency site
72199,Escort not present on agency site
45438,Escort not present on agency site
45439,Escort not present on agency site
60208,Escort not present on agency site
60426,Escort not present on agency site
64651,Escort not present on agency site
65548,Escort not present on agency site
68460,Escort not present on agency site
58411,Escort not present on agency site
58414,Escort not present on agency site
61316,Escort not present on agency site
65434,Escort not present on agency site
65434,Escort not present on agency site
46066,Escort not present on agency site
60998,Escort not present on agency site
69985,Escort not present on agency site
47404,Escort not present on agency site
46069,Escort not present on agency site
47406,Escort not present on agency site
47060,Escort not present on agency site
47049,Escort not present on agency site
65732,Escort not present on agency site
58170,Escort not present on agency site
76724,Escort not present on agency site
67330,Escort not present on agency site
72207,Escort not present on agency site
48077,Escort not present on agency site
11804,Makes you register and redirects you to differnt sites
11836,Makes you register and redirects you to differnt sites
11831,Makes you register and redirects you to differnt sites
11833,Makes you register and redirects you to differnt sites
59005,Agency site can't be reached
58855,Escort not present on agency site
66377,Escort not present on agency site
58501,Escort not present on agency site
20324,Redirects you to search engine
20321,Redirects you to search engine
20325,Redirects you to search engine
20323,Redirects you to search engine
46747,Escort not present on agency site
60323,Escort not present on agency site
63055,Escort not present on agency site
57298,Agency page not found
57255,Agency page not found
57253,Agency page not found
57297,Agency page not found
57254,Agency page not found
57252,Agency page not found
57763,Escort not present on agency site
57691,Escort not present on agency site
57689,Escort not present on agency site
57611,Escort not present on agency site
57607,Escort not present on agency site
58037,Escort not present on agency site
57764,Escort not present on agency site
57762,Escort not present on agency site
57690,Escort not present on agency site
57688,Escort not present on agency site
57609,Escort not present on agency site
58039,Escort not present on agency site
58036,Escort not present on agency site
60854,Agency page on infinite loading
60855,Agency page on infinite loading
62168,Agency site can't be reached
62905,Agency site can't be reached
63519,Agency site can't be reached
62166,Agency site can't be reached
62900,Agency site can't be reached
63716,Agency site can't be reached
63714,Agency site can't be reached
63520,Agency site can't be reached
62167,Agency site can't be reached
62903,Agency site can't be reached
63517,Agency site can't be reached
63717,Agency site can't be reached
63715,Agency site can't be reached
46336,Escort not present on agency site
71484,Escort not present on agency site
22246,Escort not present on agency site
26588,Escort not present on agency site
26587,Escort not present on agency site
59943,Escort not present on agency site
24250,Escort not present on agency site
22248,Escort not present on agency site
20256,Escort not present on agency site
25666,Escort not present on agency site
10195,Escort not present on agency site
21364,Escort not present on agency site
11790,Escort not present on agency site
29163,Redirects you to a lotery page
55578,Redirects you to a lotery page
21823,Redirects you to a lotery page
19073,Redirects you to a lotery page
48824,Agency site can't be reached
24127,Domain fore sale
29708,Domain fore sale
24123,Domain fore sale
28543,Redirects you to a login page
40988,Agency site can't be reached
37101,Agency site can't be reached
41747,Escort not present on agency site
71058,Agency site not present
71062,Agency site not present
60489,Agency site not present
33040,Redirects you to search engine
46101,Redirects you to search engine
32702,Redirects you to search engine
46368,Redirects you to search engine
46366,Redirects you to search engine
46364,Redirects you to search engine
46359,Redirects you to search engine
46114,Redirects you to search engine
39975,Redirects you to search engine
46120,Redirects you to search engine
33041,Redirects you to search engine
46104,Redirects you to search engine
33038,Redirects you to search engine
46367,Redirects you to search engine
46365,Redirects you to search engine
46363,Redirects you to search engine
46133,Redirects you to search engine
46100,Redirects you to search engine
46125,Redirects you to search engine
38031,Redirects you to search engine
46110,Redirects you to search engine
72903,Escort not present on agency site
25415,Agency site not present
29979,Agency site not present
46879,Escort not present on site
24541,Agency site can't be reached
24539,Agency site can't be reached
23492,Agency site can't be reached
21798,Agency site can't be reached
21796,Agency site can't be reached
20533,Agency site can't be reached
19116,Agency site can't be reached
14534,Agency site can't be reached
24540,Agency site can't be reached
23493,Agency site can't be reached
23491,Agency site can't be reached
21797,Agency site can't be reached
20534,Agency site can't be reached
20532,Agency site can't be reached
19117,Agency site can't be reached
19115,Agency site can't be reached
92748,Agency site can't be reached
70577,Agency site can't be reached
70581,Agency site can't be reached
24528,Agency site can't be reached
92745,Agency site can't be reached
70574,Agency site can't be reached
17216,Agency site can't be reached
92739,Agency site can't be reached
92732,Agency site can't be reached
27957,Agency site can't be reached
92727,Agency site can't be reached
25884,Agency site can't be reached
70589,Agency site can't be reached
24530,Agency site can't be reached
70587,Agency site can't be reached
92755,Agency site can't be reached
70580,Agency site can't be reached
70584,Agency site can't be reached
92752,Agency site can't be reached
70578,Agency site can't be reached
70582,Agency site can't be reached
92747,Agency site can't be reached
70575,Agency site can't be reached
92741,Agency site can't be reached
70573,Agency site can't be reached
92734,Agency site can't be reached
27958,Agency site can't be reached
92728,Agency site can't be reached
27956,Agency site can't be reached
92723,Agency site can't be reached
25883,Agency site can't be reached
70588,Agency site can't be reached
24529,Agency site can't be reached
70586,Agency site can't be reached
92754,Agency site can't be reached
70579,Agency site can't be reached
70583,Agency site can't be reached
77662,Redirects you to search engine
77660,Redirects you to search engine
77657,Redirects you to search engine
77661,Redirects you to search engine
77658,Redirects you to search engine
37146,Redirects you to search engine
64711,Escort not present on agency site
55346,Redirects you to search engine
22932,Redirects you to search engine
55344,Redirects you to search engine
19321,Redirects you to search engine
55343,Redirects you to search engine
55345,Redirects you to search engine
22931,Redirects you to search engine
20042,Redirects you to search engine
55349,Redirects you to search engine
22006,Redirects you to search engine
19322,Redirects you to search engine
10879,Escort not present on agency site
21067,Escort not present on agency site
72488,Escort not present on agency site
53497,Escort not present on agency site
43016,Agency site can't be reached
49037,Escort not present on agency site
49031,Escort not present on agency site
49033,Escort not present on agency site
