<svg xmlns="http://www.w3.org/2000/svg" width="22.289" height="20" viewBox="0 0 22.289 20">
  <path fill="#fff" id="Fresh_comments" data-name="Fresh comments" d="M.28,1.614v11.94H3.464v4.08l1.294-1.095,3.781-2.985H16.2V.818H.28Zm14.328.8v9.552H7.942l-.2.2-2.687,2.09V11.962H1.872V2.41Zm3.184,3.184h3.184v9.552H17.792v2.289l-2.886-2.289H8.937l-1.99,1.592H14.31l5.075,4.08v-4.08h3.184V4H17.792Z" transform="translate(-0.28 -0.818)" fill-rule="evenodd"/>
</svg>
