<svg xmlns="http://www.w3.org/2000/svg" width="90" height="90" viewBox="0 0 90 90">
  <g id="Group_6" data-name="Group 6" transform="translate(-23 -161)">
    <circle id="Ellipse_1" data-name="Ellipse 1" cx="45" cy="45" r="45" transform="translate(23 161)" fill="#f5f5f5"/>
    <path id="Path_2426" data-name="Path 2426" d="M47-934H0v-50H33l-4,4H4v42H43v-26l4-4v34h0ZM11.027-949.576l1.7-8.3.094-.472.283-.378L36.68-982.208l1.038-1.038.942.943.095-.189A4.792,4.792,0,0,1,42.245-984a4.8,4.8,0,0,1,3.489,1.508,4.688,4.688,0,0,1,1.415,3.443,5,5,0,0,1-1.415,3.536l-.188.188.942.85-1.037,1.038L21.967-949.858l-.377.283-.472.1-8.3,1.7-2.17.377Zm3.867-3.677,1.6,1.6,3.018-.66-.754-3.207-3.207-.755Zm2.735-5.659,2.83.566.942.188.189.944.566,2.829,15.75-15.845-4.432-4.432Zm17.919-17.92,4.527,4.528,2.17-2.264L37.812-979Zm5.376-3.584-.094.188,2.641,2.641.188-.094a1.746,1.746,0,0,0,0-2.735,2.139,2.139,0,0,0-1.414-.566A2.039,2.039,0,0,0,40.924-980.416Z" transform="translate(44 1165)" fill="#ea5298"/>
  </g>
</svg>
