<?xml version="1.0" encoding="utf-8"?>
<!-- Generator: Adobe Illustrator 19.0.0, SVG Export Plug-In . SVG Version: 6.00 Build 0)  -->
<svg version="1.1" id="Layer_1" xmlns="http://www.w3.org/2000/svg" xmlns:xlink="http://www.w3.org/1999/xlink" x="0px" y="0px"
	 viewBox="-293 387 24 20" style="enable-background:new -293 387 24 20;" xml:space="preserve">
<style type="text/css">
	.st0{fill:#FFFFFF;}
</style>
<path class="st0" d="M-269,388c0-0.6-0.4-1-1-1h-22c-0.6,0-1,0.4-1,1l0,0c0,0.6,0.4,1,1,1h22C-269.4,389-269,388.6-269,388L-269,388
	z"/>
<path class="st0" d="M-269,397c0-0.6-0.4-1-1-1h-22c-0.6,0-1,0.4-1,1l0,0c0,0.6,0.4,1,1,1h22C-269.4,398-269,397.6-269,397L-269,397
	z"/>
<path class="st0" d="M-269,406c0-0.6-0.4-1-1-1h-22c-0.6,0-1,0.4-1,1l0,0c0,0.6,0.4,1,1,1h22C-269.4,407-269,406.6-269,406L-269,406
	z"/>
</svg>
