<?xml version="1.0" encoding="utf-8"?>
<!-- Generator: Adobe Illustrator 22.1.0, SVG Export Plug-In . SVG Version: 6.00 Build 0)  -->
<svg version="1.1" id="Layer_1" xmlns="http://www.w3.org/2000/svg" xmlns:xlink="http://www.w3.org/1999/xlink" x="0px" y="0px"
	 viewBox="0 0 32 32" style="enable-background:new 0 0 32 32;" xml:space="preserve">
<style type="text/css">
	.st0{fill-rule:evenodd;clip-rule:evenodd;fill:#B4834F;}
	.st1{fill-rule:evenodd;clip-rule:evenodd;fill:#3D9B1F;}
</style>
<g>
	<path class="st0" d="M18,23.6c0.2,0.2,0.4,0.5,0.7,0.7c1,0.8,2.5,1,3.7,1.2c1.3,0.2,2.6,0.5,3.7,1.3c1.6,1.1,2.1,2.9,2.1,4.8V32
		h-27v-0.5c0-1.9,0.4-3.7,2.1-4.8c0.3-0.2,0.7-0.4,1-0.6c0,0.4,0.2,0.8,0.3,1.2c1,2.1,3.1,3.4,5.3,3.8l1,0.2l-0.5-0.8
		c-0.5-0.9-0.9-1.9-0.4-2.9c0.1-0.1,0.1-0.3,0.2-0.4c2,1.8,5.1,2.9,8.7,2.9c3.1,0,5.8-0.8,7.8-2.2c-2.6-3.4-9.5-0.6-10-6.7
		c-0.1,0.1-0.2,0.1-0.3,0.2c-1.6,0.8-1.9,0.8-3.5,0c-0.1-0.1-0.2-0.1-0.3-0.2c-0.1,3.4-2.3,4.4-3,6.2c-0.5,1.2-0.1,2.3,0.5,3.3
		c-2.1-0.3-4.1-1.5-5-3.5c-1.4-3.1,2.3-5.9,1.6-9c-0.3-1.2-0.9-2.5-1.5-3.9C2.6,7.7,6.9-0.6,14.8,0C25.8,1,25.2,17.8,18,23.6
		L18,23.6z M21.8,12.9c-0.3,0.7-0.6,1.3-1.3,1.9c1.2-2.8,0.7-5.5-1.1-6.9c-1,1.7-2.8,2.8-4.9,3.2c1.2-0.7,2.2-1.8,2.8-3
		c-1.4,2.4-4.2,3.6-6.8,3.1c1.7-0.3,3.2-1.3,4.2-2.7c-0.9,1-3.3,2.1-6,1.9c-0.5,3.2,0.7,6.7,3.6,8.8c-1.3-0.5-2.2-1-3-2.2
		c0.7,1.7,2.3,3.1,4,4c1.4,0.8,1.6,0.8,3.1,0C19.3,19.4,21.3,16.2,21.8,12.9z"/>
	<circle class="st1" cx="27.7" cy="3" r="3"/>
</g>
</svg>
