<svg xmlns="http://www.w3.org/2000/svg" width="20.301" height="21" viewBox="0 0 20.301 21">
  <path id="Path_2413" data-name="Path 2413" d="M8.1,1.478,7.667,3.737A7.4,7.4,0,0,0,5.7,4.939L3.437,4.17l-.625-.192-.289.529L.985,7.2.7,7.728l.433.433,1.731,1.49a8.694,8.694,0,0,0-.144,1.2,8.679,8.679,0,0,0,.144,1.2L1.129,13.545.7,13.978l.289.529L2.523,17.2l.289.529.625-.192L5.7,16.766a7.383,7.383,0,0,0,1.971,1.2L8.1,20.228l.144.625h4.327l.144-.625.432-2.259a7.4,7.4,0,0,0,1.971-1.2l2.259.769.625.192.289-.529,1.538-2.692.289-.529-.433-.432-1.731-1.491a8.7,8.7,0,0,0,.144-1.2,8.711,8.711,0,0,0-.144-1.2l1.731-1.49.433-.433L19.831,7.2,18.292,4.507,18,3.978l-.625.192-2.259.769a7.422,7.422,0,0,0-1.971-1.2l-.432-2.259L12.571.853H8.244Zm3.221.914.385,2.019.1.432.432.144a6.439,6.439,0,0,1,2.308,1.346l.385.289.385-.1,1.971-.673L18.2,7.391,16.658,8.737l-.385.289.144.481a6.352,6.352,0,0,1,0,2.692l-.1.481.337.289L18.2,14.315l-.914,1.538-1.971-.673-.385-.1-.385.288a6.429,6.429,0,0,1-2.308,1.346l-.432.144-.1.432-.385,2.019H9.494L9.11,17.3l-.1-.432-.432-.144a6.435,6.435,0,0,1-2.308-1.346l-.385-.288-.385.1-1.971.673-.914-1.538,1.538-1.346.385-.289L4.4,12.2a6.367,6.367,0,0,1,0-2.692l.144-.481-.385-.289L2.619,7.391l.914-1.538L5.5,6.526l.385.1.385-.289A6.445,6.445,0,0,1,8.581,4.987l.432-.144.1-.432.385-2.019ZM6.562,10.853A3.857,3.857,0,0,0,10.408,14.7a3.858,3.858,0,0,0,3.846-3.846,3.857,3.857,0,0,0-3.846-3.846,3.857,3.857,0,0,0-3.846,3.846Zm6.154,0a2.3,2.3,0,0,1-2.308,2.308A2.3,2.3,0,0,1,8.1,10.853a2.3,2.3,0,0,1,2.308-2.308,2.3,2.3,0,0,1,2.308,2.308Z" transform="translate(-0.257 -0.353)" fill="#fff" stroke="#707070" stroke-linejoin="bevel" stroke-width="1" fill-rule="evenodd"/>
</svg>
