<svg xmlns="http://www.w3.org/2000/svg" width="23.77" height="28.562" viewBox="0 0 23.77 28.562">
  <path id="Path_2122" data-name="Path 2122" d="M15.619,28.541c-1-.017-2.172-.033-3.518-.006-1.913,0-3.791,0-5.724,0-.133-.008-.306,0-.5,0-1.054.03-2.791.06-2.7-1.8.139-.852,1.254-2.229,2.938-4.464a11.889,11.889,0,1,1,11.55,0,21.643,21.643,0,0,1,2.92,4.422c.1,1.622-.886,1.861-3.272,1.861C16.806,28.562,16.245,28.551,15.619,28.541ZM7.746,25.364h8.276A16.312,16.312,0,0,0,14.5,23.487a11.942,11.942,0,0,1-5.236,0A16.982,16.982,0,0,0,7.746,25.364Zm4.136-4.755c11.456-.5,11.634-16.812.087-17.422C.485,3.5.128,20.005,11.881,20.608Zm0-14.266a5.54,5.54,0,0,1,.092,11.08A5.54,5.54,0,1,1,11.881,6.342Zm-.31,3.2a2.368,2.368,0,1,0,.186,0Q11.665,9.534,11.571,9.539Z" transform="translate(0 0)" fill="#fff"/>
</svg>
