<svg xmlns="http://www.w3.org/2000/svg" width="16" height="16.138" viewBox="0 0 16 16.138">
  <path id="Path_2168" data-name="Path 2168" d="M5.48,4.433H8.047v7.335H9.514V4.433h2.567L8.781.9ZM.712,16.169V16.9H16.85V5.167H15.383V15.436H2.179V5.167H.712Z" transform="translate(16.903 -0.712) rotate(90)" fill="#fff" fill-rule="evenodd"/>
</svg>
