<?xml version="1.0" encoding="utf-8"?>
<!-- Generator: Adobe Illustrator 19.0.0, SVG Export Plug-In . SVG Version: 6.00 Build 0)  -->
<svg version="1.1" id="icons" xmlns="http://www.w3.org/2000/svg" xmlns:xlink="http://www.w3.org/1999/xlink" x="0px" y="0px"
	 viewBox="-275 367 60 60" style="enable-background:new -275 367 60 60;" xml:space="preserve">
<style type="text/css">
	.st0{fill:#757575;}
</style>
<polygon class="st0" points="-232.4,389 -237,384.4 -245,392.3 -253,384.4 -257.6,389 -249.7,397 -257.6,405 -253,409.6 -245,401.7 
	-237,409.6 -232.4,405 -240.3,397 "/>
</svg>
