<svg xmlns="http://www.w3.org/2000/svg" width="49.397" height="40.594" viewBox="0 0 49.397 40.594">
  <g id="type_3" data-name="type 3" transform="translate(-303 -171.864)">
    <path id="Path_8" data-name="Path 8" d="M-479.856-363.7l-.565-.565c.019-.033.037-.065.055-.1s.037-.073.055-.11.039-.085.057-.127.031-.078.045-.116.031-.086.044-.129.025-.08.035-.12.022-.087.032-.131.017-.08.025-.121.014-.088.02-.133.01-.081.014-.122.007-.089.009-.133,0-.083,0-.124,0-.089,0-.134,0-.081-.006-.121-.009-.09-.015-.134v-.012c0-.037-.009-.073-.015-.109s-.016-.083-.025-.124l-.007-.033c-.007-.032-.014-.064-.022-.1s-.02-.072-.031-.109l-.015-.049c-.009-.029-.018-.059-.028-.088s-.028-.075-.043-.112l-.019-.048c-.012-.03-.022-.056-.034-.081s-.032-.068-.05-.1l-.03-.058c-.012-.024-.025-.049-.038-.073s-.042-.071-.065-.106l-.034-.054c-.013-.02-.025-.041-.04-.062-.03-.044-.063-.086-.1-.128l-.028-.037c-.015-.021-.025-.034-.036-.047-.06-.072-.121-.139-.182-.2l-.45-.45a2.939,2.939,0,0,0-2.095-.865c-.073,0-.145,0-.217.009l-.045,0c-.072.006-.142.014-.211.026l-.026,0c-.065.012-.123.023-.18.036.006-.024.023-.089.023-.089.005-.019.009-.033.012-.047.018-.079.032-.162.043-.243,0-.012.006-.058.006-.058.007-.062.013-.126.016-.189,0-.022,0-.044,0-.066v-.022c0-.053,0-.108,0-.162,0-.032,0-.063-.005-.094,0-.053-.009-.106-.015-.159l0-.017c0-.024-.006-.048-.009-.071-.009-.06-.02-.117-.033-.175,0,0-.011-.055-.015-.07-.02-.083-.042-.162-.068-.24,0-.01-.007-.019-.011-.029-.025-.072-.051-.139-.079-.2-.008-.018-.016-.035-.024-.052l-.011-.024c-.024-.051-.049-.1-.075-.152q-.023-.042-.047-.083c-.027-.047-.056-.094-.086-.14l-.008-.013-.045-.067c-.033-.048-.069-.095-.106-.142l-.014-.018c-.013-.017-.025-.032-.037-.047-.061-.073-.119-.137-.177-.195l-.451-.45a2.946,2.946,0,0,0-2.1-.866c-.069,0-.144,0-.229.01l-.047,0c-.072.006-.145.016-.217.028l-.04.008c-.063.011-.127.025-.19.04l.014-.059c.013-.061.024-.12.033-.179l.006-.046c.006-.043.011-.087.016-.132l0-.055c0-.046.006-.09.007-.135l0-.044c0-.063,0-.123,0-.183v-.017a2.689,2.689,0,0,0-.193-.919l-.069-.176,0,0c-.017-.037-.035-.075-.054-.111l-.005-.012c-.033-.064-.067-.124-.1-.183l-.034-.052c-.026-.04-.053-.081-.082-.121l-.042-.058c-.029-.039-.06-.077-.091-.115l-.04-.048c-.047-.053-.093-.1-.143-.154l-.45-.45a2.89,2.89,0,0,0-.218-.2,2.928,2.928,0,0,0-1.879-.668c-.069,0-.141,0-.226.01l-.048,0c-.071.006-.144.016-.216.028l-.036.007c-.067.012-.132.026-.2.042l.01-.041c.005-.023.011-.045.015-.068.013-.064.023-.129.032-.195,0,0,.006-.037.007-.049.009-.077.015-.158.018-.241,0-.015,0-.07,0-.07,0-.057,0-.116,0-.174,0-.021-.006-.088-.006-.088,0-.053-.009-.106-.016-.159,0-.03-.008-.059-.013-.089-.009-.055-.02-.109-.032-.163l0-.022c0-.019-.008-.038-.013-.057-.018-.071-.038-.14-.06-.209l-.007-.022c-.026-.078-.056-.154-.091-.234-.006-.015-.014-.031-.022-.047l-.01-.021c-.024-.052-.05-.1-.078-.156-.012-.022-.024-.044-.037-.066-.035-.06-.063-.107-.094-.153l-.011-.017-.041-.06c-.033-.047-.068-.093-.1-.139l-.016-.021-.034-.043c-.062-.073-.118-.135-.174-.19l-.45-.45a2.942,2.942,0,0,0-2.1-.865h-.067c-.055,0-.111,0-.17.008l-.057.006-.023,0c-.05.005-.1.011-.156.02l-.065.012-.026.005c-.048.009-.1.019-.142.03-.029.007-.06.016-.091.025-.047.013-.091.026-.135.04l-.1.034c-.041.015-.084.032-.126.049l-.093.041c-.04.018-.081.039-.121.059l-.088.047-.051.03-.048.043a17.427,17.427,0,0,0-2.065,2.136,1.868,1.868,0,0,0-.244.532l-.048-.048c-.016-.014-1.191-1.1-1.637-1.471A13.11,13.11,0,0,1-505-389.094,13.221,13.221,0,0,1-491.793-402.3a13.077,13.077,0,0,1,8.084,2.764c.3.235,1.464,1.411,2.158,2.114l.441.445c-.13.124-.264.254-.4.386l-.09.087.011.011-3.214,3.214c-.553.569-1.123,1.158-1.7,1.76l-.022.023-.062.233-.341,1.285-2.119,8,.542.032.1.005c.316.017,1.133.057,1.878.057a7.663,7.663,0,0,0,1.223-.069c.137-.025.274-.056.406-.093a4.807,4.807,0,0,0,.574-.2,5.456,5.456,0,0,0,3.092-3.577l.628-2.353,3.67-3.671,13.835,13.835a2.088,2.088,0,0,1,.615,1.486,2.088,2.088,0,0,1-.615,1.486l-.45.451a2.087,2.087,0,0,1-1.486.612,2.087,2.087,0,0,1-1.486-.612l-10.832-10.831-.355-.325-.6.6,10.8,10.8a2.1,2.1,0,0,1,0,2.972l-.45.45a2.087,2.087,0,0,1-1.486.612,2.085,2.085,0,0,1-1.486-.612l-10.8-10.8-.612.612,10.429,10.429a2.1,2.1,0,0,1,0,2.971l-.451.451a2.088,2.088,0,0,1-1.486.612,2.088,2.088,0,0,1-1.486-.612l-10.428-10.428-.612.612,9.95,9.95a2.087,2.087,0,0,1,.612,1.486,2.087,2.087,0,0,1-.612,1.486l-.45.451a2.088,2.088,0,0,1-1.486.612A2.088,2.088,0,0,1-479.856-363.7Z" transform="translate(808 574.6)"/>
    <path id="Path_9" data-name="Path 9" d="M-491.836-363.319l-.451-.45a2.1,2.1,0,0,1,0-2.973l1.01-1.01a2.07,2.07,0,0,1,.21-.181,2.116,2.116,0,0,1,1.279-.431,2.082,2.082,0,0,1,1.483.611l.451.451a2.107,2.107,0,0,1,.181,2.762,2.165,2.165,0,0,1-.181.211l-1.01,1.01a2.085,2.085,0,0,1-1.486.613A2.087,2.087,0,0,1-491.836-363.319Zm-3.994-4.1-.451-.451a2.087,2.087,0,0,1-.612-1.486,2.087,2.087,0,0,1,.612-1.486l1.01-1.01a2.014,2.014,0,0,1,.158-.143,2.106,2.106,0,0,1,1.328-.47,2.127,2.127,0,0,1,.615.09,2.063,2.063,0,0,1,.239.088,2.083,2.083,0,0,1,.632.435l.451.45a2.121,2.121,0,0,1,.143,2.814,2.035,2.035,0,0,1-.143.158l-1.01,1.01a2.087,2.087,0,0,1-1.486.612A2.087,2.087,0,0,1-495.83-367.422Zm-4.053-4.023-.451-.45a2.1,2.1,0,0,1,0-2.972l1.01-1.01a2.083,2.083,0,0,1,.172-.153,2.109,2.109,0,0,1,1.315-.459,2.085,2.085,0,0,1,1.485.612l.451.451a2.014,2.014,0,0,1,.209.244,2.076,2.076,0,0,1,.365.854l.007.034.006.043,0,.021a2.118,2.118,0,0,1-.436,1.6,2.1,2.1,0,0,1-.153.172l-1.01,1.01a2.088,2.088,0,0,1-1.486.612A2.087,2.087,0,0,1-499.883-371.445Zm-4.053-4.019-.451-.451a2.1,2.1,0,0,1,0-2.973l1.01-1.01a2.079,2.079,0,0,1,.188-.165,2.112,2.112,0,0,1,1.3-.447,2.084,2.084,0,0,1,1.484.612l.451.451a2.081,2.081,0,0,1,.591,1.174,2.1,2.1,0,0,1,0,.63,2.1,2.1,0,0,1-.425.98l-.008.01a2.127,2.127,0,0,1-.157.178l-1.01,1.01a2.087,2.087,0,0,1-1.486.612A2.088,2.088,0,0,1-503.935-375.464Zm33.157-5.144-.423-.439,0,0L-483.3-393.134l-4.447,4.447-.688,2.578a4.505,4.505,0,0,1-3.392,3.237,6.966,6.966,0,0,1-1.067.055c-.486,0-1.01-.018-1.406-.035l2.13-8.036.081-.3,5.366-5.366-.014-.014.394-.394-.01-.01.445-.449c.693-.7,1.853-1.877,2.156-2.112a13.077,13.077,0,0,1,8.084-2.763,13.221,13.221,0,0,1,13.207,13.206,13.112,13.112,0,0,1-3.925,9.394c-.382.318-1.525,1.4-1.856,1.719C-468.515-378.268-469.448-379.235-470.779-380.608Z" transform="translate(814.354 574.664)" fill="none" stroke="#000" stroke-width="1"/>
  </g>
</svg>
