<svg xmlns="http://www.w3.org/2000/svg" width="90" height="90" viewBox="0 0 90 90">
  <g id="Group_14" data-name="Group 14" transform="translate(-143 -834)">
    <circle id="Ellipse_19" data-name="Ellipse 19" cx="45" cy="45" r="45" transform="translate(143 834)" fill="#f5f5f5"/>
    <path id="Path_2446" data-name="Path 2446" d="M150.863,61.177a10.418,10.418,0,0,1-.941-2.283c-.368-1.029-.755-2.056-1.2-3.055a1.047,1.047,0,0,0,.079-.309c.014-.152-.05-.318.032-.459.094-.161.292-.223.42-.351a1.654,1.654,0,0,0,.266-.359.465.465,0,0,1-.27.2c-.118.038-.286-.04-.381.068.025-.029,0-.2.006-.242a.965.965,0,0,0-.023-.39,1.016,1.016,0,0,0-.428-.525.6.6,0,0,1-.282-.32,5.192,5.192,0,0,0-.12-.608,1.581,1.581,0,0,0-.362-.449,1.687,1.687,0,0,1-.375-.6,1.614,1.614,0,0,1-.044-.662c.016-.225-.014-.441-.009-.664a1.021,1.021,0,0,0,.206.479,1.691,1.691,0,0,1,.175.451,3.354,3.354,0,0,0,.066.432c.04.108.095.056.122-.034a1.1,1.1,0,0,0-.038-.524,5.824,5.824,0,0,0-.134-.672,2,2,0,0,0-.224-.446c-.064-.1-.175-.207-.16-.334.012-.107.12-.177.188-.25a1.828,1.828,0,0,0,.5-.879.274.274,0,0,1,.073.07c.185.2.5.292.382.634-.069.2-.272.3-.423.428a2.252,2.252,0,0,0-.246.246,1.21,1.21,0,0,0,.888-.826c.1-.45-.33-.517-.6-.743a1.235,1.235,0,0,1-.316-.6,2.1,2.1,0,0,0-.261-.533,3.929,3.929,0,0,1-.5-1.382,6.767,6.767,0,0,1-.127-.709,2.3,2.3,0,0,0-.117-.587,3.77,3.77,0,0,0-.29-.5,2.768,2.768,0,0,1-.295-1.2,8.171,8.171,0,0,0-.313-1.726,1.4,1.4,0,0,0-.09-.292c.03.053.135.112.179.158a1.792,1.792,0,0,1,.139.166c.118.157.216.328.323.492a2.952,2.952,0,0,1,.28,1.737c0,.175,0,.35,0,.526a2.692,2.692,0,0,1,.076-.413c.026-.143.05-.286.061-.431a2.828,2.828,0,0,0-.105-1.158,3.28,3.28,0,0,0-.459-.772c-.2-.266-.36-.554-.545-.828a5.349,5.349,0,0,0-1.205-1.243c-.309-.237-.638-.446-.964-.661a2.553,2.553,0,0,0-1.937-.39c-.323.062-.644.134-.969.186-.548.087-1.269.172-1.554.729.032-.062.181-.146.237-.194a.837.837,0,0,1,.3-.184,1.7,1.7,0,0,1,.356-.1,5.663,5.663,0,0,0,.577-.087,2.222,2.222,0,0,0-.438.2,7.14,7.14,0,0,0-1.4.887c-.23.183-.449.381-.679.565a5.352,5.352,0,0,0-.784.688,4.444,4.444,0,0,0-.278.349c-.061.089-.2.2-.173.318.127-.045.168-.181.248-.276a3.782,3.782,0,0,1,.319-.315c.088-.081.16-.173.241-.261.035-.038.148-.156.2-.141.18.046-.168.443-.215.5-.217.253-.468.476-.69.724s-.466.534-.689.808a1.471,1.471,0,0,0-.426,1.493,2.03,2.03,0,0,0,.227.4,1.268,1.268,0,0,1-.144-.557,1.1,1.1,0,0,1,.08-.6c.068-.135.117-.277.179-.412a.132.132,0,0,1,.006.051c0,.3-.008.6-.014.9a2.466,2.466,0,0,1-.014.721.69.69,0,0,1-.276.351c-.125.086-.271.109-.4.181-.046.026-.131.122-.065.153.038.018.121-.031.153-.045.069-.031.4-.288.465-.243.141.093-.229.472-.282.533a6.027,6.027,0,0,0-.617.834,3.133,3.133,0,0,0-.3.635,3.579,3.579,0,0,0-.1.962,3.464,3.464,0,0,1-.241,1.243,5.759,5.759,0,0,1-.279.527l-.014.01a4.922,4.922,0,0,0-1.514,1.29,5.329,5.329,0,0,0-.407.709c-.028-.066-.055-.133-.083-.2s-.079-.173-.079-.173a1.674,1.674,0,0,0-.055.292,1.056,1.056,0,0,0,.059.427c-.1.232-.188.466-.269.705-.119.349-.225.7-.332,1.056l0,.015a.732.732,0,0,0-.056.164c0,.01,0,.02,0,.03q-.852,2.791-1.8,5.556a14.948,14.948,0,0,0-.812,2.687,4.465,4.465,0,0,0,.462,2.561,32.956,32.956,0,0,0,3.075,5.363,4.377,4.377,0,0,0,1.2,1.433,3.666,3.666,0,0,0,1.68.355,6.583,6.583,0,0,1,1.42.317.723.723,0,0,1-.144.281.7.7,0,0,0-.2.341.4.4,0,0,0,.074.02c-.322.516-.679,1.013-.952,1.561l-1.349,2.7-1.18,2.276s-1.37,3.1-1.37,3.224a7.184,7.184,0,0,1-.379,1.138c-.085.169-.506,1.5-.506,1.5s-.527,1.265-.527,1.37-.042,1.138-.063,1.37-.084.906-.084.906l-.211,1.9-.042,2.8.274,4.425.148,2.951s.105,3.646.105,3.73-.253,1.2-.3,1.412-.338,1.9-.338,1.9-.336,1.328-.358,1.391-.084.632-.084.632a3.978,3.978,0,0,0-.295.4c-.021.064-.127.19-.19.316s-.126.169-.126.338-.147.211.063.316a4.35,4.35,0,0,0,1.033.253,5.914,5.914,0,0,0,1.348-.169,7.77,7.77,0,0,0,1.1-.506c.084-.084.422-.337.506-.442a.7.7,0,0,0,.168-.442,5.181,5.181,0,0,0-.211-.906c-.042-.127-.063-.654-.084-.8a1.3,1.3,0,0,1,.042-.506c.042-.105.19-.611.19-.611l.253,1.833.379-.021.148-.379-.126-.864s.063-1.454.042-1.517a3.977,3.977,0,0,1,.211-.653s.231-.464.295-.548a3.085,3.085,0,0,0,.253-.611,1.854,1.854,0,0,0-.084-.674c-.063-.106-.3-.485-.379-.611s-.4-.927-.4-.927l.084-1.349.379-2.719.653-2.719.126-2.339-.1-1.265-.148-2.128a2.307,2.307,0,0,1-.021-.8c.085-.211.822-1.328.822-1.328l1.307-2.486,1.875-2.7,1.243-1.77,1.623-3.1.59-1.159a.494.494,0,0,1,.19-.253c.126-.063.716-.379.716-.379a2.145,2.145,0,0,0,.3-.38c.021-.084.169-.316.19-.4a.951.951,0,0,1,.037-.1l.038-.014a4.08,4.08,0,0,1,.38-.149c.235-.057.46.047.683-.046v.6l.232,4.8s.421,2.318.421,2.4v1.622c0,.148.126,2.213.126,2.213s.316,1.58.316,1.686.169.864.169,1.244v1.581l-.127,2.086.063,2.7.169,2.465-.042,2.213s.042,2,.042,2.17-.021,1.37-.021,1.454a4.977,4.977,0,0,1-.168.653c-.042.126-.253.442-.274.569a2.077,2.077,0,0,0-.063.485c0,.252.085.442.105.716s.105.843.105.948-.063,1.412-.063,1.412-.169,1.011-.169,1.075.084.527.084.633a1.248,1.248,0,0,0,.106.484,2.242,2.242,0,0,0,.7.274,9.506,9.506,0,0,0,1.264.042,6.14,6.14,0,0,0,.97-.126c.085-.063.3-.169.358-.38s.169-.716.211-.863a7.972,7.972,0,0,0-.211-1.37c-.042-.169-.253-1.243-.253-1.37a7.359,7.359,0,0,0-.274-.885c-.021-.063,0-.337-.021-.463a3.446,3.446,0,0,1-.127-.442c0-.127.063-.4.063-.569a7.8,7.8,0,0,1,.042-1.159c.063-.337.4-1.517.4-1.517l.569-2.192.316-2.508.633-3.288.126-2.38-.042-1.434-.211-3.329.189-1.812.042-2.8.232-2.739a16.725,16.725,0,0,1,.3-2.647c.138-.854.3-1.706.368-2.57a10.51,10.51,0,0,0-.179-2.516c-.022-.138-.049-.275-.076-.411a.856.856,0,0,0,.016-.7c-.075-.254-.159-.507-.253-.755a1.984,1.984,0,0,0-.253-.589,7.243,7.243,0,0,0-.472-1c-.114-.2-.272-.431-.423-.665a.254.254,0,0,0-.044-.3c-.023-.032-.229-.274-.216-.3-.012.028-.027.053-.041.08a1.592,1.592,0,0,1-.125-.369c.025.136.856.2.966.206a3.847,3.847,0,0,0,.741-.012,1.006,1.006,0,0,0,.974-1.029c.046-.6.293-1.159.356-1.756A4.418,4.418,0,0,0,150.863,61.177Zm-2.183-6.148a1.049,1.049,0,0,1-.054.6c-.058-.128-.119-.255-.179-.382A.54.54,0,0,0,148.68,55.028Zm-.413-.328a.258.258,0,0,1-.03.115c-.061-.121-.121-.244-.184-.364A.292.292,0,0,1,148.267,54.7ZM135.916,69.044c-.423.259-1.174.589-1.6.128a3.921,3.921,0,0,1-.565-1.226c-.282-.689-.746-1.3-1.068-1.972-.259-.541-.424-1.117-.651-1.671a4.789,4.789,0,0,1-.489-2.208,7.1,7.1,0,0,1,.556-1.934,18.837,18.837,0,0,1,.978-2.14q.217-.4.465-.771c.012-.018.045-.06.085-.111a4.771,4.771,0,0,0,.368.875c.14.281.264.569.385.858.073.172.13.37.31.457a.611.611,0,0,0,.083.029c.124.584.207,1.176.334,1.759a6,6,0,0,0,.654,1.726,12.388,12.388,0,0,1,.868,1.7c.49,1.314.842,3.031-.27,4.149A2.364,2.364,0,0,1,135.916,69.044Zm12.95-5.238c-.233.145-.55-.184-.832-.05-.071.033-.668.383-.574.49a23.138,23.138,0,0,1-1.565-1.8,3.1,3.1,0,0,1-.838-1.868,7.838,7.838,0,0,1-.081-1.387c0-.027.014-.053.02-.079a1.28,1.28,0,0,0,1.054-.684c.026-.045.049-.091.072-.137.022.031.043.062.062.094.192.3.36.623.523.944.313.619.6,1.26.971,1.844a13.431,13.431,0,0,1,.99,1.473C148.761,62.849,149.162,63.622,148.866,63.806Z" transform="translate(34.187 805.255)" fill="#ea5298"/>
    <circle id="Ellipse_20" data-name="Ellipse 20" cx="19.5" cy="19.5" r="19.5" transform="translate(187 860)" fill="#ea5298"/>
    <path id="Video" d="M16.567,12.968v16.15l2.019-1.177,12.112-6.9,2.019-1.177L30.7,18.689l-12.112-6.9-2.019-1.177Zm10.766,6.9-8.075,4.626V15.24Z" transform="translate(183.433 859.386)" fill="#fff" fill-rule="evenodd"/>
  </g>
</svg>
