<?xml version="1.0" encoding="utf-8"?>
<!-- Generator: Adobe Illustrator 22.1.0, SVG Export Plug-In . SVG Version: 6.00 Build 0)  -->
<svg version="1.1" id="Layer_1" xmlns="http://www.w3.org/2000/svg" xmlns:xlink="http://www.w3.org/1999/xlink" x="0px" y="0px"
	 viewBox="0 0 32 32" style="enable-background:new 0 0 32 32;" xml:space="preserve">
<style type="text/css">
	.st0{fill:#B4834F;}
</style>
<path id="XMLID_679_" class="st0" d="M26,4h-6c0-2.2-1.8-4-4-4c-2.2,0-4,1.8-4,4H6C3.8,4,2,5.8,2,8v20c0,2.2,1.8,4,4,4h20
	c2.2,0,4-1.8,4-4V8C30,5.8,28.2,4,26,4z M14,4h4v4h-4V4z M18,28H8v-4h10V28z M24,22H8v-4h16V22z M24,16H8v-4h16V16z"/>
</svg>
