(footprint "MountingHole_1.15mm_M1" (version 20211014) (generator pcbnew)
  (layer "F.Cu")
  (tedit 56D1B4CB)
  (descr "Mounting Hole 2.2mm, no annular, M2")
  (tags "mounting hole 2.2mm no annular m2")
  (property "Sheetfile" "handwire8x16.kicad_sch")
  (property "Sheetname" "")
  (attr exclude_from_pos_files)
  (fp_text reference "H1" (at 0 -3.2) (layer "F.SilkS")
    (effects (font (size 1 1) (thickness 0.15)))
    (tstamp 395bbafa-da61-47f4-a8c2-e3f7a79b376e)
  )
  (fp_text value "MountingHole" (at 0 3.2) (layer "F.Fab")
    (effects (font (size 1 1) (thickness 0.15)))
    (tstamp 32a8dd6d-7829-4bd7-9eaf-a48607377353)
  )
  (fp_text user "${REFERENCE}" (at 0 0) (layer "F.Fab")
    (effects (font (size 1 1) (thickness 0.15)))
    (tstamp 0aa7cc64-d01a-4655-ba2b-120a619a0a98)
  )
  (fp_circle (center 0 0) (end 1.4 0) (layer "Cmts.User") (width 0.15) (fill none) (tstamp 292d937c-f280-4c06-ba1d-12dfe548b7fa))
  (fp_circle (center 0 0) (end 1.25 0) (layer "F.CrtYd") (width 0.05) (fill none) (tstamp d89f172f-eeef-4444-9125-f6decb0597cd))
  (pad "" np_thru_hole circle (at 0 0) (size 1.5 1.5) (drill 1.5) (layers F&B.Cu *.Mask) (tstamp dcd369b2-ac4d-4041-bf3c-c5cd296c705d))
)
