(footprint "R4700" (version 20211014) (generator pcbnew)
  (layer "F.Cu")
  (tedit 61D96B20)
  (descr "Resistor, Axial_DIN0207 series, Axial, Horizontal, pin pitch=7.62mm, 0.25W = 1/4W, length*diameter=6.3*2.5mm^2, http://cdn-reichelt.de/documents/datenblatt/B400/1_4W%23YAG.pdf")
  (tags "Resistor Axial_DIN0207 series Axial Horizontal pin pitch 7.62mm 0.25W = 1/4W length 6.3mm diameter 2.5mm")
  (property "Sheetfile" "m65.kicad_sch")
  (property "Sheetname" "")
  (attr through_hole)
  (fp_text reference "R*" (at 3.81 -2.37) (layer "F.SilkS")
    (effects (font (size 1 1) (thickness 0.15)))
    (tstamp 31861b10-e240-4549-bce8-0a542b9e855d)
  )
  (fp_text value "4.7kΩ" (at 6.2 2.4) (layer "F.SilkS")
    (effects (font (size 1 1) (thickness 0.15)))
    (tstamp 082a1d7d-b933-47bd-8e8c-0135e64802ef)
  )
  (fp_text user "${VALUE}" (at 3.825 -0.025) (layer "B.SilkS")
    (effects (font (size 1 1) (thickness 0.15)) (justify mirror))
    (tstamp 4a7d2179-a48f-4b2e-8def-4923498db4bf)
  )
  (fp_text user "${REFERENCE}" (at -2.325 0.05) (layer "B.SilkS")
    (effects (font (size 1 1) (thickness 0.15)) (justify mirror))
    (tstamp 61345ba4-1ee2-409d-9169-c398ebefb7a0)
  )
  (fp_text user "${REFERENCE}" (at 3.81 0) (layer "F.Fab")
    (effects (font (size 1 1) (thickness 0.15)))
    (tstamp 08a9f999-1cfc-412f-bf41-d7862ce086a5)
  )
  (fp_line (start 7.08 -1.37) (end 7.08 -1.04) (layer "F.SilkS") (width 0.12) (tstamp 2c4099b7-757b-4262-ad89-12d6bf6fd2fe))
  (fp_line (start 0.54 -1.37) (end 7.08 -1.37) (layer "F.SilkS") (width 0.12) (tstamp 936ae2d1-e6a3-4792-beb9-96cc80916743))
  (fp_line (start 0.54 -1.04) (end 0.54 -1.37) (layer "F.SilkS") (width 0.12) (tstamp af1d9769-3f7e-406c-a060-621d0f9a84ae))
  (fp_line (start 7.08 1.37) (end 7.08 1.04) (layer "F.SilkS") (width 0.12) (tstamp afa41341-4bae-40d6-a939-2cfc1707b9e0))
  (fp_line (start 0.54 1.37) (end 7.08 1.37) (layer "F.SilkS") (width 0.12) (tstamp b1f3c57a-43c7-4910-be92-878bbaea3c3e))
  (fp_line (start 0.54 1.04) (end 0.54 1.37) (layer "F.SilkS") (width 0.12) (tstamp e25dafe9-21d1-41d8-8710-2f5119681fb9))
  (fp_line (start 8.67 1.5) (end 8.67 -1.5) (layer "F.CrtYd") (width 0.05) (tstamp 35f0b6d2-d058-4327-bf7f-2824dadfe02e))
  (fp_line (start -1.05 1.5) (end 8.67 1.5) (layer "F.CrtYd") (width 0.05) (tstamp 944f56fa-edd0-4215-b73c-057e1e3ccd9f))
  (fp_line (start 8.67 -1.5) (end -1.05 -1.5) (layer "F.CrtYd") (width 0.05) (tstamp f2792d9e-7948-468f-b20b-56bd136554ee))
  (fp_line (start -1.05 -1.5) (end -1.05 1.5) (layer "F.CrtYd") (width 0.05) (tstamp ff397433-39ae-43d0-a8fa-743792c07a43))
  (fp_line (start 0 0) (end 0.66 0) (layer "F.Fab") (width 0.1) (tstamp 04843ad7-c6b2-4f89-a318-f553e4b6b2c5))
  (fp_line (start 6.96 -1.25) (end 0.66 -1.25) (layer "F.Fab") (width 0.1) (tstamp b267a65b-6570-42ee-96a1-0c25d5372e90))
  (fp_line (start 0.66 1.25) (end 6.96 1.25) (layer "F.Fab") (width 0.1) (tstamp c0845e4f-f2e7-49e7-a896-196b1ebb938d))
  (fp_line (start 0.66 -1.25) (end 0.66 1.25) (layer "F.Fab") (width 0.1) (tstamp c9f84269-2f69-4d9d-84ec-eaf65de5bf2c))
  (fp_line (start 6.96 1.25) (end 6.96 -1.25) (layer "F.Fab") (width 0.1) (tstamp e5542197-0ac9-454a-b665-60cc9ab6848c))
  (fp_line (start 7.62 0) (end 6.96 0) (layer "F.Fab") (width 0.1) (tstamp fdf15803-0b9d-4c66-8fac-4f24b0b66872))
  (pad "1" thru_hole circle (at 0 0) (size 1.6 1.6) (drill 0.8) (layers *.Cu *.Mask) (tstamp b977bc04-4be7-4ba0-bfce-4d5ce40fa552))
  (pad "2" thru_hole oval (at 7.62 0) (size 1.6 1.6) (drill 0.8) (layers *.Cu *.Mask) (tstamp 94b3caf9-3126-4b44-ba19-59f0a80edde4))
  (model "/home/drFaustroll/playground/keyboard/m65/m65-pcb/packages3d/resistors/R472.wrl"
    (offset (xyz 4 0 0))
    (scale (xyz 1 1 1))
    (rotate (xyz 0 0 0))
  )
)
