(footprint "Kailh_ChocV2_1u_19.05" (version 20211014) (generator pcbnew)
  (layer "F.Cu")
  (tedit 6210F833)
  (attr through_hole)
  (fp_text reference "SW*" (at 5.1 7.95 180) (layer "Dwgs.User") hide
    (effects (font (size 1 1) (thickness 0.15)))
    (tstamp 74e882a7-fabc-4536-8f63-fd47169a0dcb)
  )
  (fp_text value "SW_PUSH" (at 0 7.9 180) (layer "Dwgs.User") hide
    (effects (font (size 1 1) (thickness 0.15)))
    (tstamp 99bc9321-5e69-49cc-9141-f747a179a5d7)
  )
  (fp_line (start -7 -7) (end -6 -7) (layer "Dwgs.User") (width 0.15) (tstamp 0b66caeb-7875-4b19-8abf-69bec2492fb2))
  (fp_line (start 6 7) (end 7 7) (layer "Dwgs.User") (width 0.15) (tstamp 2eef366c-07e0-41f3-a6e9-65978ddcf5f3))
  (fp_line (start -9.525 9.525) (end -9.525 -9.525) (layer "Dwgs.User") (width 0.15) (tstamp 3dccb93e-32f0-406c-b27c-a2c0fd27aed1))
  (fp_line (start 9.525 -9.525) (end 9.525 9.525) (layer "Dwgs.User") (width 0.15) (tstamp 68345329-f788-408e-9d8a-7c74eac07bb3))
  (fp_line (start -7 -6) (end -7 -7) (layer "Dwgs.User") (width 0.15) (tstamp 7ab8c7e8-b828-4ec1-ac36-203d3aac85e5))
  (fp_line (start 9.525 9.525) (end -9.525 9.525) (layer "Dwgs.User") (width 0.15) (tstamp 93dd6c4a-50c1-40e2-8e3c-3e1e4f691c88))
  (fp_line (start 7 7) (end 7 6) (layer "Dwgs.User") (width 0.15) (tstamp 9b13fb9b-94cc-4b6c-bfd6-2af7d2c53746))
  (fp_line (start -9.525 -9.525) (end 9.525 -9.525) (layer "Dwgs.User") (width 0.15) (tstamp e502cbe5-a154-4ad9-be72-72f01a595494))
  (pad "" np_thru_hole circle (at 0 0 270) (size 4.9 4.9) (drill 4.9) (layers *.Cu *.Mask) (tstamp 60ac1008-28b2-44be-a5ab-c4d6d4e1e4c1))
  (pad "1" thru_hole circle (at 5.1 -3.9 180) (size 2.2 2.2) (drill 1) (layers *.Cu "B.Mask") (tstamp 6d91bfc5-50f9-41a7-9a1c-800d382c9cad))
  (pad "2" thru_hole circle (at 0 -5.9 180) (size 2.2 2.2) (drill 1) (layers *.Cu "B.Mask") (tstamp 7214d438-532a-4bfb-9a5b-d195f9c7a005))
  (pad "3" thru_hole circle (at -5 5.55 180.5) (size 2.2 2.2) (drill 1) (layers *.Cu "B.Mask") (tstamp 423b2cca-6605-49b4-bb3b-c0f48e70f448))
  (model "/Users/foostan/src/github.com/foostan/kbd/kicad-packages3D/kbd.3dshapes/kailh_choc.step"
    (offset (xyz 0 0 0))
    (scale (xyz 1 1 1))
    (rotate (xyz 0 0 180))
  )
)
