(footprint "SW-1u-MXandChocV2-v2" (version 20211014) (generator pcbnew)
  (layer "F.Cu")
  (tedit 5F85C937)
  (property "Sheetfile" "m1.kicad_sch")
  (property "Sheetname" "")
  (attr through_hole)
  (fp_text reference "MK1" (at 5.1 7.95 180) (layer "Dwgs.User") hide
    (effects (font (size 1 1) (thickness 0.15)))
    (tstamp 63c975b6-82f8-40e6-8a30-0c20d1d3bf0f)
  )
  (fp_text value "MK" (at 0 7.9 180) (layer "Dwgs.User") hide
    (effects (font (size 1 1) (thickness 0.15)))
    (tstamp 0f29b2a0-ea17-4520-b1e5-bd93249e7bce)
  )
  (fp_text user "J2" (at -8.7 -0.79 90 unlocked) (layer "B.SilkS")
    (effects (font (size 0.8 0.8) (thickness 0.15)) (justify mirror))
    (tstamp 071bae86-cd47-4c7e-add2-4e33efd533f8)
  )
  (fp_text user "J3" (at -2.675 -2.9 unlocked) (layer "B.SilkS")
    (effects (font (size 0.8 0.8) (thickness 0.15)) (justify mirror))
    (tstamp 1b7a375a-6ffe-4e96-ade3-23d06c7b2080)
  )
  (fp_text user "C" (at 2.7 3 unlocked) (layer "B.SilkS")
    (effects (font (size 1 1) (thickness 0.15)) (justify mirror))
    (tstamp 23be1d9b-2c10-4d50-8e30-93a11163fd99)
  )
  (fp_text user "SW" (at -6.1 -2.8 unlocked) (layer "B.SilkS")
    (effects (font (size 1 1) (thickness 0.15)) (justify mirror))
    (tstamp 523c1975-90d5-4bc4-99c9-0e246589f560)
  )
  (fp_text user "R" (at -1.8 1 unlocked) (layer "B.SilkS")
    (effects (font (size 1 1) (thickness 0.15)) (justify mirror))
    (tstamp 80670f9c-e332-46b8-a62f-8df460994ad9)
  )
  (fp_text user "1N4148" (at -8.8 7.6 90 unlocked) (layer "B.SilkS")
    (effects (font (size 0.6 0.6) (thickness 0.15)) (justify mirror))
    (tstamp c20d403c-38bf-4414-a624-591b419aec16)
  )
  (fp_text user "C" (at -6.5 0.4 unlocked) (layer "B.SilkS")
    (effects (font (size 1 1) (thickness 0.15)) (justify mirror))
    (tstamp d8494868-9efb-4a25-88e1-f5406395eef3)
  )
  (fp_text user "J1" (at -8.7 1.11 90 unlocked) (layer "B.SilkS")
    (effects (font (size 0.8 0.8) (thickness 0.15)) (justify mirror))
    (tstamp f4b7054d-41c0-4744-b8da-f5a0cc9f8108)
  )
  (fp_text user "J4" (at 3.75 -2.8 unlocked) (layer "B.SilkS")
    (effects (font (size 0.8 0.8) (thickness 0.15)) (justify mirror))
    (tstamp fef5d86f-3e44-4f42-9242-1c932d65ef7a)
  )
  (fp_text user "SW-${REFERENCE}" (at -2.1 11.2 unlocked) (layer "F.Fab")
    (effects (font (size 1 1) (thickness 0.15)))
    (tstamp 45241c6d-8953-4d69-8813-04f97d5421f5)
  )
  (fp_text user "D${REFERENCE}" (at -10.5 7.2 270) (layer "F.Fab")
    (effects (font (size 0.8 0.8) (thickness 0.12)))
    (tstamp be01de30-6723-4320-8019-275d7f9a7443)
  )
  (fp_line (start -9.6 5.38) (end -11.4 5.38) (layer "B.SilkS") (width 0.12) (tstamp 01d1b7ce-6e90-4157-abf2-43e16a44aa84))
  (fp_line (start -11.4 9.62) (end -9.6 9.62) (layer "B.SilkS") (width 0.12) (tstamp 236e591d-b25d-43ec-beb6-fde8c56d4331))
  (fp_line (start -11.4 9.02) (end -9.6 9.02) (layer "B.SilkS") (width 0.12) (tstamp 2a701c74-7e8b-4531-b655-dc33da5876a8))
  (fp_line (start -10.5 10.27) (end -10.5 9.62) (layer "B.SilkS") (width 0.12) (tstamp 3bea9474-636a-4998-a45b-66dc5a0ded35))
  (fp_line (start -11.4 5.38) (end -11.4 9.62) (layer "B.SilkS") (width 0.12) (tstamp b12f93f6-9140-4fd7-b611-2e9f6dbc01c6))
  (fp_line (start -9.6 9.62) (end -9.6 5.38) (layer "B.SilkS") (width 0.12) (tstamp c60f1fff-c734-48b2-88f3-10284bfa4a9b))
  (fp_line (start -10.5 4.73) (end -10.5 5.38) (layer "B.SilkS") (width 0.12) (tstamp daa2d942-3750-4edd-9ec1-67a6d92423f0))
  (fp_line (start -9.54 -0.92) (end -9.54 -1.92) (layer "F.SilkS") (width 0.15) (tstamp 0eb3d854-590f-4b55-a6cc-90b57e2ff7c1))
  (fp_line (start -11.9925 0.71) (end -11.9925 -3.825) (layer "F.SilkS") (width 0.1) (tstamp 183c3860-2090-4a02-bcf0-5c216df7134f))
  (fp_line (start 5.06 7.74) (end 5.06 12.275) (layer "F.SilkS") (width 0.1) (tstamp 3a2e38ba-2004-47b2-a5bd-debef4216434))
  (fp_line (start 4.575 12.75) (end 0.04 12.75) (layer "F.SilkS") (width 0.1) (tstamp 477b72d6-30bc-4e04-895c-0c71be83c6ff))
  (fp_line (start -11.525 -3.825) (end 4.575 -3.825) (layer "F.SilkS") (width 0.1) (tstamp 4e2c41d9-1b43-4211-9913-387f6a3e56c8))
  (fp_line (start 4.575 12.275) (end -11.525 12.275) (layer "F.SilkS") (width 0.1) (tstamp 863d4709-8b29-4076-91c9-3a903c8aa963))
  (fp_line (start -9.54 -1.92) (end -8.54 -1.92) (layer "F.SilkS") (width 0.15) (tstamp 97cd6183-b769-4dca-9a78-46e78c0751c8))
  (fp_line (start 4.575 -3.825) (end 4.575 12.275) (layer "F.SilkS") (width 0.1) (tstamp b489b806-8b38-4eb4-a251-9480ce96703f))
  (fp_line (start -11.525 12.275) (end -11.525 -3.825) (layer "F.SilkS") (width 0.1) (tstamp b6c5bd44-457a-43ad-8ced-4edbda986817))
  (fp_line (start -11.525 -4.295) (end -6.99 -4.295) (layer "F.SilkS") (width 0.1) (tstamp d298e59d-a4c8-4f1d-bb7d-00409794dd32))
  (fp_rect (start -12.9925 -5.2949) (end 6.0575 13.7551) (layer "F.SilkS") (width 0.12) (fill none) (tstamp 074d58e4-52c8-4dd1-8962-1658a549c4ea))
  (fp_arc (start -11.9925 -3.825) (mid -11.85609 -4.156822) (end -11.525 -4.295) (layer "F.SilkS") (width 0.1) (tstamp 2cfa5f2f-bfff-4dc9-8448-510ba768fd02))
  (fp_arc (start 5.06 12.275) (mid 4.915876 12.612947) (end 4.575 12.75) (layer "F.SilkS") (width 0.1) (tstamp 56ce90f7-32fb-4e1d-9e36-16b12d560804))
  (fp_line (start 3.46 12.08) (end 4.46 12.08) (layer "Dwgs.User") (width 0.15) (tstamp 12cca375-db9a-4344-b98a-cc7c61a51988))
  (fp_line (start -9.54 -1.92) (end -8.54 -1.92) (layer "Dwgs.User") (width 0.15) (tstamp 17933f3f-5740-4864-a00d-25df5069f2a4))
  (fp_line (start -9.54 -0.92) (end -9.54 -1.92) (layer "Dwgs.User") (width 0.15) (tstamp 3027f7fb-0cf9-471f-a400-639d37106494))
  (fp_line (start 4.46 12.08) (end 4.46 11.08) (layer "Dwgs.User") (width 0.15) (tstamp 8dc37ce0-9aca-40e7-ab7f-2f7455d44ba9))
  (fp_rect (start -11.525 -3.825) (end 4.575 12.275) (layer "Dwgs.User") (width 0.12) (fill none) (tstamp 4e6dc3dd-a1f9-448a-ac5c-230b3d6e1d23))
  (fp_line (start -9.7 9.5) (end -9.7 5.5) (layer "F.Fab") (width 0.1) (tstamp 0e8a60c4-60a2-4555-a53e-ae63d04a5ea7))
  (fp_line (start -11.3 8.8) (end -9.7 8.8) (layer "F.Fab") (width 0.1) (tstamp 12071f4a-b60b-4b85-afd7-ed30e4ee70b3))
  (fp_line (start -11.3 9.5) (end -9.7 9.5) (layer "F.Fab") (width 0.1) (tstamp 327ed6c3-50ee-4c0e-bd53-deb35ff46962))
  (fp_line (start -11.3 5.5) (end -11.3 9.5) (layer "F.Fab") (width 0.1) (tstamp 3fa0549f-2d35-4afe-8407-1ae46e08c1db))
  (fp_line (start -9.7 5.5) (end -11.3 5.5) (layer "F.Fab") (width 0.1) (tstamp 4a662103-4db1-4d28-ac68-b7b31d6b84bf))
  (fp_line (start -10.5 11.31) (end -10.5 9.5) (layer "F.Fab") (width 0.1) (tstamp 7d906da5-0523-48ea-83b7-66d7f95f99a6))
  (fp_line (start -11.3 9) (end -9.7 9) (layer "F.Fab") (width 0.1) (tstamp ad00bed8-38c7-46e1-a3ad-3acddf1426e6))
  (fp_line (start -10.5 3.69) (end -10.5 5.5) (layer "F.Fab") (width 0.1) (tstamp b098e207-6f27-4049-aa65-a9f6de9f0437))
  (fp_line (start -11.3 8.9) (end -9.7 8.9) (layer "F.Fab") (width 0.1) (tstamp edd6bd41-7872-4ceb-ad9a-1422c0974401))
  (pad "" np_thru_hole circle (at 2.54 5.08) (size 1.7 1.7) (drill 1.7) (layers F&B.Cu *.Mask) (tstamp 3c363264-f9ea-4533-9432-5f848c3c6c30))
  (pad "" np_thru_hole circle (at -2.54 5.08 90) (size 4.9 4.9) (drill 4.9) (layers *.Cu *.Mask) (tstamp 671df3ae-596a-4468-9e87-004a6a01fdf0))
  (pad "" np_thru_hole circle (at -7.62 5.08) (size 1.7 1.7) (drill 1.7) (layers F&B.Cu *.Mask) (tstamp 806a117c-26ba-4d8e-b3f2-25b0338fba95))
  (pad "" thru_hole circle (at -7.54 10.63 0.5) (size 2 2) (drill 1) (layers *.Cu *.Mask) (tstamp a2136e37-da91-4bd0-bf9f-efead8df2748))
  (pad "1" thru_hole roundrect (at -0.6 -2.9) (size 2.5 2.75) (drill 0.8 (offset 0 0.625)) (layers *.Cu *.Mask) (roundrect_rratio 0.37) (tstamp 2a5e6e0e-95d7-4296-9ccc-e3c8f7af9886))
  (pad "1" thru_hole circle (at 0 0) (size 2.8 2.8) (drill 1.2) (layers *.Cu *.Mask) (tstamp 40227ba6-3f39-493d-86b8-c017c8bdbaa9))
  (pad "1" thru_hole oval (at -2.54 -0.82) (size 3 1.5) (drill oval 1 0.3) (layers *.Cu *.Mask) (tstamp 65b845ce-f3e0-466a-8523-0ff907896cf2))
  (pad "1" thru_hole oval (at 1.725 -2.9) (size 2.5 1.5) (drill 0.8) (layers *.Cu *.Mask) (tstamp 76fba6fd-b597-4b42-a2df-ef22bd2bb8d6))
  (pad "2" thru_hole oval (at 2.56 1.18) (size 2.2 1.6) (drill oval 1 0.4) (layers *.Cu *.Mask) (tstamp 12bb6293-7750-482c-acb5-cfc8670b9080))
  (pad "2" thru_hole circle (at -6.35 2.54) (size 2.4 2.4) (drill 1.2) (layers *.Cu *.Mask) (tstamp 5f412e32-bcc9-4569-a64d-808e384d81b6))
  (pad "3" thru_hole rect (at -10.5 11.31 90) (size 1.5 1.5) (drill 0.8) (layers *.Cu *.Mask) (tstamp 7771c34f-40d5-49c2-b849-c2683bc6d4f5))
  (pad "3" smd rect (at -10.52 9.68 90) (size 2 1.16) (layers "F.Cu" "F.Paste" "F.Mask") (tstamp 7bbcd74a-7c41-4865-8f78-b941127116ef))
  (pad "4" smd rect (at -10.485 5.29 90) (size 1.98 1.23) (layers "F.Cu" "F.Paste" "F.Mask") (tstamp 59d7dfd0-dc47-40ab-a071-6de4880c29c1))
  (pad "4" thru_hole oval (at -10.5 1.8 90) (size 2.5 1.5) (drill 0.8) (layers *.Cu *.Mask) (tstamp a437822d-2421-4e72-be48-e4192e1f18cb))
  (pad "4" thru_hole oval (at -10.5 -0.425 90) (size 2.5 1.5) (drill 0.8) (layers *.Cu *.Mask) (tstamp bdcf1fae-21fa-4fc6-a690-ca553509f980))
  (pad "4" thru_hole circle (at -10.5 3.69 90) (size 1.5 1.5) (drill 0.8) (layers *.Cu *.Mask) (tstamp eb55ade1-f0d0-4b57-a6f7-d083603ed5b1))
  (model "${KIPRJMOD}/packages3d/Switch_Keyboard_Cherry_MX.3dshapes/SW_Cherry_MX_PCB.step" hide
    (offset (xyz 0 0 0))
    (scale (xyz 1 1 1))
    (rotate (xyz 0 0 0))
  )
  (model "${KIPRJMOD}/packages3d/Kailh_PG1353.STEP"
    (offset (xyz -2.5 -5 2.5))
    (scale (xyz 1 1 1))
    (rotate (xyz -90 0 -90))
  )
)
