(footprint "74HC595-sop16" (version 20211014) (generator pcbnew)
  (layer "F.Cu")
  (tedit 5A02F25C)
  (descr "16-Lead Plastic Small Outline http://www.vishay.com/docs/49633/sg2098.pdf")
  (tags "SOP 1.27")
  (property "Sheetfile" "m2x3.kicad_sch")
  (property "Sheetname" "")
  (attr smd)
  (fp_text reference "U**" (at 0.06 -6.25) (layer "F.SilkS")
    (effects (font (size 1 1) (thickness 0.15)))
    (tstamp 4454f2bf-b3c8-4b27-b441-1973f3028176)
  )
  (fp_text value "U**" (at -0.73 6.25) (layer "B.SilkS")
    (effects (font (size 1 1) (thickness 0.15)) (justify mirror))
    (tstamp 88f7bacf-f235-4eaa-827e-d2d95cde8c15)
  )
  (fp_text user "Qe" (at -5.08 -0.71 unlocked) (layer "B.SilkS")
    (effects (font (size 0.6 0.6) (thickness 0.15)) (justify mirror))
    (tstamp 0e92a96d-4a1e-491b-adb3-138240625d8d)
  )
  (fp_text user "G" (at -4.61 4.53 unlocked) (layer "B.SilkS")
    (effects (font (size 0.6 0.6) (thickness 0.15)) (justify mirror))
    (tstamp 18fc2c55-a7a0-4006-920e-1a053a9bd1ac)
  )
  (fp_text user "clock" (at 5.33 1.87 unlocked) (layer "B.SilkS")
    (effects (font (size 0.6 0.6) (thickness 0.15)) (justify mirror))
    (tstamp 192a9046-5787-4053-bc3f-f20efb772c5b)
  )
  (fp_text user "Qd" (at -5.08 -1.95 unlocked) (layer "B.SilkS")
    (effects (font (size 0.6 0.6) (thickness 0.15)) (justify mirror))
    (tstamp 2697692d-6403-4a84-bd4b-0dbce7e5eb4d)
  )
  (fp_text user "Vcc" (at 5.13 -4.39 unlocked) (layer "B.SilkS")
    (effects (font (size 0.6 0.6) (thickness 0.15)) (justify mirror))
    (tstamp 36e0a24a-3a07-4ed1-a7e5-13c5a3e55ab7)
  )
  (fp_text user "latch" (at 5.33 0.65 unlocked) (layer "B.SilkS")
    (effects (font (size 0.6 0.6) (thickness 0.15)) (justify mirror))
    (tstamp 40883ca7-faed-49a2-bc7f-ca7356fa808d)
  )
  (fp_text user "srclr" (at 5.23 3.12 unlocked) (layer "B.SilkS")
    (effects (font (size 0.6 0.6) (thickness 0.15)) (justify mirror))
    (tstamp 48a416f7-0719-4d11-bd67-b7a12f036e93)
  )
  (fp_text user "Qg" (at -5.08 1.85 unlocked) (layer "B.SilkS")
    (effects (font (size 0.6 0.6) (thickness 0.15)) (justify mirror))
    (tstamp 54fc4f83-59dc-40fe-b427-f8eff3c87e55)
  )
  (fp_text user "Oe" (at 5.13 -0.61 unlocked) (layer "B.SilkS")
    (effects (font (size 0.6 0.6) (thickness 0.15)) (justify mirror))
    (tstamp 5b4f087f-7daa-48a1-a385-50e69c7e8ac3)
  )
  (fp_text user "data" (at 5.13 -1.89 unlocked) (layer "B.SilkS")
    (effects (font (size 0.6 0.6) (thickness 0.15)) (justify mirror))
    (tstamp a8cc6bee-2ee1-4709-bb91-e04b3013bcd3)
  )
  (fp_text user "Qc" (at -5.08 -3.27 unlocked) (layer "B.SilkS")
    (effects (font (size 0.6 0.6) (thickness 0.15)) (justify mirror))
    (tstamp bbf8fa73-93ff-44b1-88ee-30f22e1ad70f)
  )
  (fp_text user "next" (at 5.23 4.49 unlocked) (layer "B.SilkS")
    (effects (font (size 0.6 0.6) (thickness 0.15)) (justify mirror))
    (tstamp c78832ef-a46d-4efb-9d16-dbcf030efc93)
  )
  (fp_text user "Qh" (at -5.08 3.19 unlocked) (layer "B.SilkS")
    (effects (font (size 0.6 0.6) (thickness 0.15)) (justify mirror))
    (tstamp d739ba81-94bc-4bd5-ac8c-6ddb3b339cda)
  )
  (fp_text user "Qf" (at -5.08 0.61 unlocked) (layer "B.SilkS")
    (effects (font (size 0.6 0.6) (thickness 0.15)) (justify mirror))
    (tstamp de2e81da-91b1-434b-9868-e4a3ab5c7e65)
  )
  (fp_text user "Qb" (at -5.08 -4.55 unlocked) (layer "B.SilkS")
    (effects (font (size 0.6 0.6) (thickness 0.15)) (justify mirror))
    (tstamp e77c9732-d020-48e9-83a5-2ddce9a27554)
  )
  (fp_text user "Qa" (at 5.13 -3.15 unlocked) (layer "B.SilkS")
    (effects (font (size 0.6 0.6) (thickness 0.15)) (justify mirror))
    (tstamp fc939815-eedc-4fdf-b08d-e5cf1cc0f40a)
  )
  (fp_text user "Qh" (at -5.05 3.19 unlocked) (layer "F.SilkS")
    (effects (font (size 0.6 0.6) (thickness 0.15)))
    (tstamp 08774ff3-c2ef-4d2d-b6fb-f8ff8263ece2)
  )
  (fp_text user "Qf" (at -5.05 0.61 unlocked) (layer "F.SilkS")
    (effects (font (size 0.6 0.6) (thickness 0.15)))
    (tstamp 09d207fa-6e5d-429a-b265-50ec449fca58)
  )
  (fp_text user "clock" (at 5.25 1.85 unlocked) (layer "F.SilkS")
    (effects (font (size 0.6 0.6) (thickness 0.15)))
    (tstamp 144cdf23-b66d-4e05-8168-f9e7fadbe501)
  )
  (fp_text user "next" (at 5.15 4.47 unlocked) (layer "F.SilkS")
    (effects (font (size 0.6 0.6) (thickness 0.15)))
    (tstamp 209c9e70-f976-4008-b84d-5d9679f0675f)
  )
  (fp_text user "Qa" (at 5.05 -3.17 unlocked) (layer "F.SilkS")
    (effects (font (size 0.6 0.6) (thickness 0.15)))
    (tstamp 284b2ef6-acbd-4efd-8b58-8aacef16eedc)
  )
  (fp_text user "data" (at 5.05 -1.91 unlocked) (layer "F.SilkS")
    (effects (font (size 0.6 0.6) (thickness 0.15)))
    (tstamp 3c94ae99-c15d-4089-80a8-adcdce434f07)
  )
  (fp_text user "Qg" (at -5.05 1.85 unlocked) (layer "F.SilkS")
    (effects (font (size 0.6 0.6) (thickness 0.15)))
    (tstamp 52dd61f7-bd0c-43d8-9672-c045c566744c)
  )
  (fp_text user "Qb" (at -5.05 -4.55 unlocked) (layer "F.SilkS")
    (effects (font (size 0.6 0.6) (thickness 0.15)))
    (tstamp 59fb1cd6-edaa-4db5-9927-3a573fcc3ffe)
  )
  (fp_text user "srclr" (at 5.15 3.1 unlocked) (layer "F.SilkS")
    (effects (font (size 0.6 0.6) (thickness 0.15)))
    (tstamp 6babf3fb-a758-4606-8c51-fe24eb9f31f6)
  )
  (fp_text user "latch" (at 5.25 0.63 unlocked) (layer "F.SilkS")
    (effects (font (size 0.6 0.6) (thickness 0.15)))
    (tstamp 6cf11ebb-d68f-4f94-9ede-3696be9b2d0b)
  )
  (fp_text user "Oe" (at 5.05 -0.63 unlocked) (layer "F.SilkS")
    (effects (font (size 0.6 0.6) (thickness 0.15)))
    (tstamp 6e509bdd-9952-4f0d-a4a8-45599f08229a)
  )
  (fp_text user "Vcc" (at 5.05 -4.41 unlocked) (layer "F.SilkS")
    (effects (font (size 0.6 0.6) (thickness 0.15)))
    (tstamp 80319ae9-a162-4516-adfe-ac6a1bf2b2a8)
  )
  (fp_text user "Qc" (at -5.05 -3.27 unlocked) (layer "F.SilkS")
    (effects (font (size 0.6 0.6) (thickness 0.15)))
    (tstamp b187e03c-98d2-494f-b8b5-5a5f51e817c6)
  )
  (fp_text user "${VALUE}" (at 0.78 6.29 180) (layer "F.SilkS")
    (effects (font (size 1 1) (thickness 0.15)))
    (tstamp b262c0e8-8530-46d0-a0a6-71a879f0b202)
  )
  (fp_text user "Qd" (at -5.05 -1.95 unlocked) (layer "F.SilkS")
    (effects (font (size 0.6 0.6) (thickness 0.15)))
    (tstamp dd144331-01ac-4ebd-9419-0ba4257a8913)
  )
  (fp_text user "G" (at -4.62 4.49 unlocked) (layer "F.SilkS")
    (effects (font (size 0.6 0.6) (thickness 0.15)))
    (tstamp ecead9db-721a-4599-93e5-cf58472f7d5d)
  )
  (fp_text user "Qe" (at -5.05 -0.71 unlocked) (layer "F.SilkS")
    (effects (font (size 0.6 0.6) (thickness 0.15)))
    (tstamp fbb0b02c-698f-49fa-8c3d-691d0d128e38)
  )
  (fp_text user "${REFERENCE}" (at 0 0) (layer "F.Fab")
    (effects (font (size 0.8 0.8) (thickness 0.15)))
    (tstamp 8e24020a-be60-4ec2-8bd1-238bbe65e2b6)
  )
  (fp_line (start -2.4 5.4) (end 2.4 5.4) (layer "F.SilkS") (width 0.12) (tstamp 38ef6869-68e6-4f05-a8e8-5313946ec242))
  (fp_line (start -2.4 -5) (end -3.8 -5) (layer "F.SilkS") (width 0.12) (tstamp 56fb4dcc-879a-4425-adb6-d2fb6d622ea5))
  (fp_line (start -2.4 -5.4) (end -2.4 -5) (layer "F.SilkS") (width 0.12) (tstamp e9f5c640-f44b-4737-9bd8-bce0ae1c2c80))
  (fp_line (start -2.4 -5.4) (end 2.4 -5.4) (layer "F.SilkS") (width 0.12) (tstamp fa8c5e71-3e24-4c5b-8f8e-2d1bcfedf89e))
  (fp_line (start -4.05 -5.45) (end -4.05 5.45) (layer "F.CrtYd") (width 0.05) (tstamp 5aa084d3-f940-4a99-b794-e6bc6f750f08))
  (fp_line (start 4.05 5.45) (end -4.05 5.45) (layer "F.CrtYd") (width 0.05) (tstamp 8229f51b-b8bd-4498-8a1c-9aa20913ebc1))
  (fp_line (start -4.05 -5.45) (end 4.05 -5.45) (layer "F.CrtYd") (width 0.05) (tstamp a67c2b46-d012-4208-b52f-8a68b91ee43d))
  (fp_line (start 4.05 5.45) (end 4.05 -5.45) (layer "F.CrtYd") (width 0.05) (tstamp ad184a5f-f8b7-43da-afdf-dfdae7ee2d9e))
  (fp_line (start 2.2 -5.2) (end 2.2 5.2) (layer "F.Fab") (width 0.1) (tstamp 0e0f0033-6341-4049-88d2-5ae36ed557cd))
  (fp_line (start -2.2 5.2) (end -2.2 -4.6) (layer "F.Fab") (width 0.1) (tstamp 9a9a6221-467f-4558-8577-acb6328e8066))
  (fp_line (start 2.2 5.2) (end -2.2 5.2) (layer "F.Fab") (width 0.1) (tstamp b7b1b7f5-ca07-4cfd-afca-8cd1f3376896))
  (fp_line (start -1.6 -5.2) (end 2.2 -5.2) (layer "F.Fab") (width 0.1) (tstamp bdf1df0f-f1f9-4456-a702-2986a14bea56))
  (fp_line (start -2.2 -4.6) (end -1.6 -5.2) (layer "F.Fab") (width 0.1) (tstamp e09a0336-2a18-4a82-81fa-36243da03799))
  (pad "1" smd rect (at -3.15 -4.45) (size 1.3 0.8) (layers "F.Cu" "F.Paste" "F.Mask") (tstamp 1dc3da33-5f7e-4302-940a-f38e0a729643))
  (pad "1" thru_hole circle (at -3.15 -4.45) (size 0.8 0.8) (drill 0.6) (layers *.Cu *.Mask) (tstamp f91bdd49-faf6-4854-a09d-c41651faa876))
  (pad "2" thru_hole circle (at -3.15 -3.17) (size 0.8 0.8) (drill 0.6) (layers *.Cu *.Mask) (tstamp 6295b798-0911-4936-bc39-4d0cc12367c7))
  (pad "2" smd rect (at -3.15 -3.17) (size 1.3 0.8) (layers "F.Cu" "F.Paste" "F.Mask") (tstamp c5333035-2d91-4510-8562-f51787b04ef0))
  (pad "3" thru_hole circle (at -3.15 -1.91) (size 0.8 0.8) (drill 0.6) (layers *.Cu *.Mask) (tstamp 1f669b1c-3ac0-4719-8c8f-bc9c15a8f6fb))
  (pad "3" smd rect (at -3.15 -1.91) (size 1.3 0.8) (layers "F.Cu" "F.Paste" "F.Mask") (tstamp 81d716c8-d89a-42e5-bd34-6a59e621a207))
  (pad "4" smd rect (at -3.15 -0.64) (size 1.3 0.8) (layers "F.Cu" "F.Paste" "F.Mask") (tstamp 6bd649f4-f9af-452a-92d4-edb955ef9be1))
  (pad "4" thru_hole circle (at -3.15 -0.64) (size 0.8 0.8) (drill 0.6) (layers *.Cu *.Mask) (tstamp 9d7057f7-e1a7-401d-a3c7-bca657abc49e))
  (pad "5" smd rect (at -3.15 0.64) (size 1.3 0.8) (layers "F.Cu" "F.Paste" "F.Mask") (tstamp 74e3caf3-3376-4860-94d1-f1af6f1c3efc))
  (pad "5" thru_hole circle (at -3.15 0.64) (size 0.8 0.8) (drill 0.6) (layers *.Cu *.Mask) (tstamp f0bd2f4f-324a-4e30-85b4-aa437817afca))
  (pad "6" thru_hole circle (at -3.15 1.91) (size 0.8 0.8) (drill 0.6) (layers *.Cu *.Mask) (tstamp 29073353-4436-42d3-b7c5-489fc1a8f85e))
  (pad "6" smd rect (at -3.15 1.91) (size 1.3 0.8) (layers "F.Cu" "F.Paste" "F.Mask") (tstamp 3571bff3-b98a-43b9-9350-a120c281d9af))
  (pad "7" thru_hole circle (at -3.15 3.17) (size 0.8 0.8) (drill 0.6) (layers *.Cu *.Mask) (tstamp d333960d-8f87-4ed8-b9ee-5da42ed4f046))
  (pad "7" smd rect (at -3.15 3.17) (size 1.3 0.8) (layers "F.Cu" "F.Paste" "F.Mask") (tstamp f3c646b8-ce12-46b2-bab3-98a1e9d202bd))
  (pad "8" thru_hole circle (at -3.15 4.45) (size 0.8 0.8) (drill 0.6) (layers *.Cu *.Mask) (tstamp 3727bcc2-dfd1-40d1-887c-1a2c9dee42db))
  (pad "8" smd rect (at -3.15 4.45) (size 1.3 0.8) (layers "F.Cu" "F.Paste" "F.Mask") (tstamp 940c8cc6-ebc6-4bf9-aa96-18980c159b26))
  (pad "9" smd rect (at 3.15 4.45) (size 1.3 0.8) (layers "F.Cu" "F.Paste" "F.Mask") (tstamp 3b87c70e-f53b-466a-921e-f09a5ebff4c1))
  (pad "9" thru_hole circle (at 3.15 4.45) (size 0.8 0.8) (drill 0.6) (layers *.Cu *.Mask) (tstamp 9173c85e-67f0-401d-988d-30ccaa1eaf32))
  (pad "10" smd rect (at 3.15 3.17) (size 1.3 0.8) (layers "F.Cu" "F.Paste" "F.Mask") (tstamp 3af55d6d-10fb-454a-a2e8-debcf121b570))
  (pad "10" thru_hole circle (at 3.15 3.17) (size 0.8 0.8) (drill 0.6) (layers *.Cu *.Mask) (tstamp a77c0829-c487-40c8-92d3-d7c0fb3ab43f))
  (pad "11" thru_hole circle (at 3.15 1.91) (size 0.8 0.8) (drill 0.6) (layers *.Cu *.Mask) (tstamp 5c88f152-5896-429c-aa67-26417d9f53af))
  (pad "11" smd rect (at 3.15 1.91) (size 1.3 0.8) (layers "F.Cu" "F.Paste" "F.Mask") (tstamp de34c238-3c0d-4ebd-b43b-ed6555b6f38e))
  (pad "12" thru_hole circle (at 3.15 0.64) (size 0.8 0.8) (drill 0.6) (layers *.Cu *.Mask) (tstamp 1315922e-22f5-4881-b0d2-af2b8b9a5be6))
  (pad "12" smd rect (at 3.15 0.64) (size 1.3 0.8) (layers "F.Cu" "F.Paste" "F.Mask") (tstamp e909441b-27cb-4bb7-9660-9e08e3b6ff0e))
  (pad "13" thru_hole circle (at 3.15 -0.64) (size 0.8 0.8) (drill 0.6) (layers *.Cu *.Mask) (tstamp 340d0410-875e-4adf-89a4-4c4e15c53007))
  (pad "13" smd rect (at 3.15 -0.64) (size 1.3 0.8) (layers "F.Cu" "F.Paste" "F.Mask") (tstamp e563f1af-5e66-4a69-8f69-0299f109fde2))
  (pad "14" thru_hole circle (at 3.15 -1.91) (size 0.8 0.8) (drill 0.6) (layers *.Cu *.Mask) (tstamp 6f09b4d6-c903-4fe7-b18a-328ffb51a736))
  (pad "14" smd rect (at 3.15 -1.91) (size 1.3 0.8) (layers "F.Cu" "F.Paste" "F.Mask") (tstamp f9dc1617-d1e9-4c06-955b-272f271ee911))
  (pad "15" thru_hole circle (at 3.15 -3.17) (size 0.8 0.8) (drill 0.6) (layers *.Cu *.Mask) (tstamp 38871982-82c1-43d2-98d7-b36f7e00c1da))
  (pad "15" smd rect (at 3.15 -3.17) (size 1.3 0.8) (layers "F.Cu" "F.Paste" "F.Mask") (tstamp 4f9345ec-8dbe-4e1e-86b5-5adf19d7d5e7))
  (pad "16" smd rect (at 3.15 -4.45) (size 1.3 0.8) (layers "F.Cu" "F.Paste" "F.Mask") (tstamp 1347d418-10d4-4c87-907b-ef39845db544))
  (pad "16" thru_hole circle (at 3.15 -4.45) (size 0.8 0.8) (drill 0.6) (layers *.Cu *.Mask) (tstamp 7ed9a114-56ac-41d4-a301-1939bfa05dbb))
  (model "${KICAD6_3DMODEL_DIR}/Package_SO.3dshapes/SOP-16_4.4x10.4mm_P1.27mm.wrl"
    (offset (xyz 0 0 0))
    (scale (xyz 1 1 1))
    (rotate (xyz 0 0 0))
  )
)
