(footprint "diode_v" (version 20211014) (generator pcbnew)
  (layer "F.Cu")
  (tedit 61D72203)
  (descr "Diode, DO-35_SOD27 series, Axial, Horizontal, pin pitch=7.62mm, , length*diameter=4*2mm^2, , http://www.diodes.com/_files/packages/DO-35.pdf")
  (tags "Diode DO-35_SOD27 series Axial Horizontal pin pitch 7.62mm  length 4mm diameter 2mm")
  (attr through_hole)
  (fp_text reference "D*" (at 10.16 0) (layer "F.SilkS")
    (effects (font (size 1 1) (thickness 0.15)))
    (tstamp 31a812be-4e7a-43e7-b2dc-99df26e87a40)
  )
  (fp_text value "1N4148" (at 3.81 2.12 180) (layer "F.Fab")
    (effects (font (size 1 1) (thickness 0.15)))
    (tstamp a0e0ccfc-5027-4615-9983-f194828a8da2)
  )
  (fp_text user "A" (at 7.83 1.97 270 unlocked) (layer "B.SilkS")
    (effects (font (size 1 1) (thickness 0.15)) (justify mirror))
    (tstamp 2df99c95-66a6-4856-b528-ba159477d77a)
  )
  (fp_text user "K" (at -0.01 2.06 270 unlocked) (layer "B.SilkS")
    (effects (font (size 1 1) (thickness 0.15)) (justify mirror))
    (tstamp 68370e77-ce1f-42ae-ab19-2c17fb33a5e9)
  )
  (fp_text user "${REFERENCE}" (at 11.175 0 unlocked) (layer "B.SilkS")
    (effects (font (size 1 1) (thickness 0.15)) (justify mirror))
    (tstamp 96cb0df6-19df-41b4-8f7f-c79a37cc8fbc)
  )
  (fp_text user "${VALUE}" (at 1.87 -1.88 180) (layer "B.SilkS")
    (effects (font (size 1 1) (thickness 0.15)) (justify mirror))
    (tstamp ac1fa3a6-eb14-40a0-8e88-ac1139951ec7)
  )
  (fp_text user "${REFERENCE}" (at 4.11 0 180) (layer "F.Fab")
    (effects (font (size 0.8 0.8) (thickness 0.12)))
    (tstamp f8e9aba6-2ace-4a9f-9a4a-d6dc9ba45f8d)
  )
  (fp_line (start 5.93 1.12) (end 5.93 -1.12) (layer "B.SilkS") (width 0.12) (tstamp 1697e27c-ecb4-42a1-97eb-588f18c7ed11))
  (fp_line (start 5.92 -1.12) (end 1.68 -1.12) (layer "B.SilkS") (width 0.12) (tstamp 1b3ed14f-b71b-4b0b-a0a5-ce190afe22f0))
  (fp_line (start 2.42 -1.12) (end 2.42 1.12) (layer "B.SilkS") (width 0.12) (tstamp 373e60a3-df5e-4a80-bbc3-a117b77df988))
  (fp_line (start 1.04 0) (end 1.69 0) (layer "B.SilkS") (width 0.12) (tstamp 3838d799-d043-4779-83f8-1a020386e437))
  (fp_line (start 2.3 -1.12) (end 2.3 1.12) (layer "B.SilkS") (width 0.12) (tstamp 4ddae915-6fab-460c-af3e-3cbbde5fbd37))
  (fp_line (start 1.68 1.12) (end 5.92 1.12) (layer "B.SilkS") (width 0.12) (tstamp 6eca6ec3-db0c-4f65-954c-b3a5cde9dc3a))
  (fp_line (start 2.54 -1.12) (end 2.54 1.12) (layer "B.SilkS") (width 0.12) (tstamp 79b738df-f580-4022-9f36-f07a5822cf51))
  (fp_line (start 6.58 0) (end 5.93 0) (layer "B.SilkS") (width 0.12) (tstamp b680950b-29aa-4de8-bdd8-c452671f0f17))
  (fp_line (start 1.69 -1.12) (end 1.69 1.12) (layer "B.SilkS") (width 0.12) (tstamp bf59e63d-e081-48e3-8c23-7588e73d0be1))
  (fp_line (start 5.93 1.12) (end 5.93 -1.12) (layer "F.SilkS") (width 0.12) (tstamp 02bacc90-e2e4-4f0b-9100-14c9ad83d988))
  (fp_line (start 6.58 0) (end 5.93 0) (layer "F.SilkS") (width 0.12) (tstamp 0898b233-8216-4491-a85c-62727d904ede))
  (fp_line (start 1.04 0) (end 1.69 0) (layer "F.SilkS") (width 0.12) (tstamp 2cbbcd3a-7fd7-422c-8ec1-1358b451f3f6))
  (fp_line (start 5.93 -1.12) (end 1.69 -1.12) (layer "F.SilkS") (width 0.12) (tstamp 3b776863-9c3e-4402-9512-b20018bfcb2d))
  (fp_line (start 1.69 1.12) (end 5.93 1.12) (layer "F.SilkS") (width 0.12) (tstamp 3d6b7653-84e0-4ae1-b967-406aa3a04045))
  (fp_line (start 2.53 -1.12) (end 2.53 1.12) (layer "F.SilkS") (width 0.12) (tstamp 46d70b7b-86fd-4f3f-be6b-f0bf8c33a366))
  (fp_line (start 1.69 -1.12) (end 1.69 1.12) (layer "F.SilkS") (width 0.12) (tstamp 52df4eda-4002-496a-bca1-6f4bd518ff0c))
  (fp_line (start 2.29 -1.12) (end 2.29 1.12) (layer "F.SilkS") (width 0.12) (tstamp 555e7d4a-4f19-433d-a6f8-1b4b4bea8f3a))
  (fp_line (start 2.41 -1.12) (end 2.41 1.12) (layer "F.SilkS") (width 0.12) (tstamp 9abb1af2-35c8-4cf3-bcc8-be75332b4994))
  (fp_line (start -1.05 1.25) (end 8.67 1.25) (layer "F.CrtYd") (width 0.05) (tstamp 6a9f56a3-acc7-4987-ac3c-b44c2c8eefd1))
  (fp_line (start -1.05 -1.25) (end -1.05 1.25) (layer "F.CrtYd") (width 0.05) (tstamp 93d1d4c6-63f7-42fc-91bf-e84d9ced8555))
  (fp_line (start 8.67 -1.25) (end -1.05 -1.25) (layer "F.CrtYd") (width 0.05) (tstamp ab800f3f-ad0f-4505-ac57-e171ade84b9c))
  (fp_line (start 8.67 1.25) (end 8.67 -1.25) (layer "F.CrtYd") (width 0.05) (tstamp d676156c-f4dc-4c27-b761-3fbb77683a34))
  (fp_line (start 2.51 -1) (end 2.51 1) (layer "F.Fab") (width 0.1) (tstamp 21ad77bf-5ff1-4e47-a420-889e2c26128b))
  (fp_line (start 0 0) (end 1.81 0) (layer "F.Fab") (width 0.1) (tstamp 2a6834a1-7167-4431-9ae0-9e232ebe45d8))
  (fp_line (start 2.41 -1) (end 2.41 1) (layer "F.Fab") (width 0.1) (tstamp 2db5fd90-d40e-4dca-89b7-459d14ed9ce9))
  (fp_line (start 7.62 0) (end 5.81 0) (layer "F.Fab") (width 0.1) (tstamp 486eaab3-d7cc-4680-9908-1e201534e59b))
  (fp_line (start 1.81 1) (end 5.81 1) (layer "F.Fab") (width 0.1) (tstamp 78afaab9-638f-4e53-99d8-e5be6a721b46))
  (fp_line (start 1.81 -1) (end 1.81 1) (layer "F.Fab") (width 0.1) (tstamp 8929974f-76b4-48c9-8791-ebcdb07f6c7c))
  (fp_line (start 5.81 1) (end 5.81 -1) (layer "F.Fab") (width 0.1) (tstamp a56de55f-d6f3-4a0c-ae4f-0b3c1fa716a3))
  (fp_line (start 5.81 -1) (end 1.81 -1) (layer "F.Fab") (width 0.1) (tstamp b6c09e7c-39a2-4973-9a9b-d65be78b3b02))
  (fp_line (start 2.31 -1) (end 2.31 1) (layer "F.Fab") (width 0.1) (tstamp f59b7631-3c6a-461f-9101-cb11edf3c064))
  (pad "1" smd rect (at 1.725 0) (size 1.85 1.6) (layers "F.Cu" "F.Paste" "F.Mask") (tstamp 3742e85b-3c10-48d4-a54b-e5b7059679d6))
  (pad "1" thru_hole rect (at 0 0) (size 1.6 1.6) (drill 0.8) (layers *.Cu *.Mask) (tstamp 54dcd051-9d7a-4d68-816c-3ee1e16966ce))
  (pad "2" thru_hole oval (at 7.62 0) (size 1.6 1.6) (drill 0.8) (layers *.Cu *.Mask) (tstamp 54d1e105-6577-4eb3-8184-87941158625b))
  (pad "2" smd rect (at 5.975 0) (size 1.85 1.2) (layers "F.Cu" "F.Paste" "F.Mask") (tstamp 8cb5a89f-074d-49ba-8ff7-b90306b4e842))
  (model "${KICAD6_3DMODEL_DIR}/Diode_THT.3dshapes/D_DO-35_SOD27_P7.62mm_Horizontal.step"
    (offset (xyz 0 0 0))
    (scale (xyz 1 1 1))
    (rotate (xyz 0 0 0))
  )
)
