(footprint "SW_Cherry_MX_1.00u_PCB" (version 20211014) (generator pcbnew)
  (layer "F.Cu")
  (tedit 61D877E6)
  (descr "Cherry MX keyswitch, 1.00u, PCB mount, http://cherryamericas.com/wp-content/uploads/2014/12/mx_cat.pdf")
  (tags "Cherry MX keyswitch 1.00u PCB")
  (attr through_hole)
  (fp_text reference "SW?" (at -2.7 -2.9) (layer "F.SilkS")
    (effects (font (size 1 1) (thickness 0.15)))
    (tstamp 6435c504-503e-4751-b486-98d0d8007cbc)
  )
  (fp_text value "${REFERENCE}" (at -2.54 12.954) (layer "F.Fab")
    (effects (font (size 1 1) (thickness 0.15)))
    (tstamp b3ecbdf3-ae6d-488e-b4b6-454a02ee4061)
  )
  (fp_text user "${REFERENCE}" (at 4.3 -2.9 unlocked) (layer "B.SilkS")
    (effects (font (size 1 1) (thickness 0.15)) (justify mirror))
    (tstamp 5abf742f-691d-4426-8452-7261263cd1a4)
  )
  (fp_text user "R" (at 0.616 -2.978 unlocked) (layer "B.SilkS")
    (effects (font (size 1 1) (thickness 0.15)) (justify mirror))
    (tstamp c0914eee-d34b-4da5-b9e3-111c5e1a36c9)
  )
  (fp_text user "C" (at -7.162 -2.813 unlocked) (layer "B.SilkS")
    (effects (font (size 1 1) (thickness 0.15)) (justify mirror))
    (tstamp dfc7e997-c545-4cc9-88cf-9ca55786baa9)
  )
  (fp_text user "R" (at 1.778 -2.794 unlocked) (layer "F.SilkS")
    (effects (font (size 1 1) (thickness 0.15)))
    (tstamp a088564d-45e9-4a1e-97e5-e0f250e57974)
  )
  (fp_text user "C" (at -8.128 -2.794 unlocked) (layer "F.SilkS")
    (effects (font (size 1 1) (thickness 0.15)))
    (tstamp b2ccdeab-6b42-4657-b2ea-7701557e6bc0)
  )
  (fp_line (start -6.4 1) (end -6.908 -2.051) (layer "B.SilkS") (width 0.12) (tstamp 5d65df36-7e53-4ab8-aa0d-ce16c20a04e5))
  (fp_line (start 0.616 -2.47) (end 0.1 -1.2) (layer "B.SilkS") (width 0.12) (tstamp 956a2a9c-f24b-41ca-aaf3-c95de9cef4d1))
  (fp_line (start -9.525 12.065) (end -9.525 -1.905) (layer "F.SilkS") (width 0.12) (tstamp 81e7a2db-4514-4d9e-ab04-395eb1c3f32a))
  (fp_line (start 4.445 -1.905) (end 4.445 12.065) (layer "F.SilkS") (width 0.12) (tstamp 88fcb3b2-e22a-45da-ae72-b8bad33cf65b))
  (fp_line (start -6.858 1.27) (end -7.874 -2.032) (layer "F.SilkS") (width 0.12) (tstamp a00ce615-351b-4248-9e55-03d9ffe1ba68))
  (fp_line (start -9.525 -1.905) (end 4.445 -1.905) (layer "F.SilkS") (width 0.12) (tstamp a9ac2053-4d34-4641-a149-08a0ee7619e4))
  (fp_line (start 4.445 12.065) (end -9.525 12.065) (layer "F.SilkS") (width 0.12) (tstamp bf798407-0164-46d5-bbe8-3cac96c9565f))
  (fp_line (start 1.778 -2.286) (end 0.762 -1.016) (layer "F.SilkS") (width 0.12) (tstamp f8cb3553-fe07-4641-9b7e-fb997495697c))
  (fp_line (start -12.065 -4.445) (end 6.985 -4.445) (layer "Dwgs.User") (width 0.15) (tstamp 17875c8c-8727-42c5-8872-c4d3b4705644))
  (fp_line (start 6.985 14.605) (end -12.065 14.605) (layer "Dwgs.User") (width 0.15) (tstamp 18529aee-fa68-401f-9d49-0e60d0263079))
  (fp_line (start 6.985 -4.445) (end 6.985 14.605) (layer "Dwgs.User") (width 0.15) (tstamp 3924b59f-04a2-4816-a264-b373ff52ed93))
  (fp_line (start -12.065 14.605) (end -12.065 -4.445) (layer "Dwgs.User") (width 0.15) (tstamp f05e2533-f911-4c72-841c-db33649aaa0b))
  (fp_line (start 4.06 -1.52) (end 4.06 11.68) (layer "F.CrtYd") (width 0.05) (tstamp 1f97d4ba-8dd1-4d23-a1db-1c4549464103))
  (fp_line (start -9.14 -1.52) (end 4.06 -1.52) (layer "F.CrtYd") (width 0.05) (tstamp afb11357-1c53-4a8e-9b7f-b8995b3d515b))
  (fp_line (start -9.14 11.68) (end -9.14 -1.52) (layer "F.CrtYd") (width 0.05) (tstamp b9db4a05-93ce-46e5-9e56-f394110c5ac4))
  (fp_line (start 4.06 11.68) (end -9.14 11.68) (layer "F.CrtYd") (width 0.05) (tstamp f324866e-a735-42d8-a578-c0d2751f87a4))
  (fp_line (start -8.89 11.43) (end -8.89 -1.27) (layer "F.Fab") (width 0.1) (tstamp 11140fd8-0def-4316-a095-29e1c8de2ccd))
  (fp_line (start 3.81 -1.27) (end 3.81 11.43) (layer "F.Fab") (width 0.1) (tstamp 22f7a9a7-52b7-4def-9f01-74ce752895c6))
  (fp_line (start 3.81 11.43) (end -8.89 11.43) (layer "F.Fab") (width 0.1) (tstamp 3d357196-16a7-43c8-a9c0-2fb0aec0b012))
  (fp_line (start -8.89 -1.27) (end 3.81 -1.27) (layer "F.Fab") (width 0.1) (tstamp cafe7d40-c316-4f68-8f05-8f4fa2790967))
  (pad "" np_thru_hole circle (at -2.54 5.08) (size 4 4) (drill 4) (layers *.Cu *.Mask) (tstamp 8c6d2a68-1e86-4cd8-86da-9252a6831921))
  (pad "" np_thru_hole circle (at 2.54 5.08) (size 1.7 1.7) (drill 1.7) (layers *.Cu *.Mask) (tstamp f01dc7a1-172b-4ea2-badd-a4253a165448))
  (pad "" np_thru_hole circle (at -7.62 5.08) (size 1.7 1.7) (drill 1.7) (layers *.Cu *.Mask) (tstamp faa47df8-079a-4cf0-9532-c75cf51ad6aa))
  (pad "1" thru_hole circle (at 0 0) (size 2.2 2.2) (drill 1.5) (layers *.Cu *.Mask) (tstamp 0ae91059-c3cb-42ca-b237-3365d95bbdf4))
  (pad "2" thru_hole circle (at -6.35 2.54) (size 2.2 2.2) (drill 1.5) (layers *.Cu *.Mask) (tstamp 2c75b0fd-8d39-4134-8230-331aada634fa))
)
