(footprint "74hc595n" (version 20211014) (generator pcbnew)
  (layer "F.Cu")
  (tedit 6295DA34)
  (descr "<b>Dual In Line Package</b>")
  (property "Sheetfile" "handwire8x16.kicad_sch")
  (property "Sheetname" "")
  (attr through_hole)
  (fp_text reference "U2" (at -11.240957 -0.317545 180) (layer "F.SilkS")
    (effects (font (size 0.70009 0.70009) (thickness 0.15)))
    (tstamp 63376e16-2b58-4ca6-98ee-01891fefa822)
  )
  (fp_text value "74HC595" (at 8.32149 0.190569) (layer "F.Fab")
    (effects (font (size 0.700252 0.700252) (thickness 0.15)))
    (tstamp 31865461-aea9-4130-af69-513a6d33b335)
  )
  (fp_line (start -10.16 -2.921) (end -10.16 -1.016) (layer "F.SilkS") (width 0.1524) (tstamp 387cd4d6-ae96-4449-aad6-20e5483eab8c))
  (fp_line (start -10.16 -2.921) (end -9.7 -2.921) (layer "F.SilkS") (width 0.127) (tstamp 437d5c58-847d-4b90-bece-eeb57fd3f04a))
  (fp_line (start -10.16 2.921) (end -9.7 2.921) (layer "F.SilkS") (width 0.127) (tstamp 4b235751-fc0b-4c62-a0cd-0fb2a4246f30))
  (fp_line (start -10.16 2.921) (end -10.16 1.016) (layer "F.SilkS") (width 0.1524) (tstamp 69f95d13-9095-4887-b2c2-a5325c37298c))
  (fp_arc (start -10.16 -1.016) (mid -9.144 0) (end -10.16 1.016) (layer "F.SilkS") (width 0.1524) (tstamp bf75da0f-7a50-49bc-8c69-f0b02daf0f3e))
  (fp_poly (pts
      (xy -10.1675 -2.921)
      (xy 10.16 -2.921)
      (xy 10.16 2.92316)
      (xy -10.1675 2.92316)
    ) (layer "F.CrtYd") (width 0.01) (fill solid) (tstamp c9eb2dd0-d67d-40e5-afea-d33db83a8a0a))
  (pad "1" thru_hole oval (at -8.89 3.81) (size 1.3208 2.6416) (drill 0.8128) (layers *.Cu *.Mask) (tstamp 8c000278-bb54-44c4-8ebe-1187b6b5ba68))
  (pad "2" thru_hole oval (at -6.35 3.81) (size 1.3208 2.6416) (drill 0.8128) (layers *.Cu *.Mask) (tstamp 0977bd26-bbca-4021-9c96-fadd31e7451b))
  (pad "3" thru_hole oval (at -3.81 3.81) (size 1.3208 2.6416) (drill 0.8128) (layers *.Cu *.Mask) (tstamp 15511719-3960-4850-ac82-a3998d985c1d))
  (pad "4" thru_hole oval (at -1.27 3.81) (size 1.3208 2.6416) (drill 0.8128) (layers *.Cu *.Mask) (tstamp c9b975db-8c6b-49c1-929e-a17c98ae226e))
  (pad "5" thru_hole oval (at 1.27 3.81) (size 1.3208 2.6416) (drill 0.8128) (layers *.Cu *.Mask) (tstamp 08b671dd-e474-40f4-bf25-4bb678839c44))
  (pad "6" thru_hole oval (at 3.81 3.81) (size 1.3208 2.6416) (drill 0.8128) (layers *.Cu *.Mask) (tstamp 22ece754-0318-4ea4-91da-f496be7a1dac))
  (pad "7" thru_hole oval (at 6.35 3.81) (size 1.3208 2.6416) (drill 0.8128) (layers *.Cu *.Mask) (tstamp 364f0c54-41e5-46fb-b394-d74bb3a654fd))
  (pad "8" thru_hole oval (at 8.89 3.81) (size 1.3208 2.6416) (drill 0.8128) (layers *.Cu *.Mask) (tstamp f41e5ac6-bc80-44af-9564-ba4883f47122))
  (pad "9" thru_hole oval (at 8.89 -3.81) (size 1.3208 2.6416) (drill 0.8128) (layers *.Cu *.Mask) (tstamp 99aeb6e4-6350-43f2-946c-3ff48bdaa4c4))
  (pad "10" thru_hole oval (at 6.35 -3.81) (size 1.3208 2.6416) (drill 0.8128) (layers *.Cu *.Mask) (tstamp 8c3680ea-6a7c-4d0e-9871-3dab79446927))
  (pad "11" thru_hole oval (at 3.81 -3.81) (size 1.3208 2.6416) (drill 0.8128) (layers *.Cu *.Mask) (tstamp 809ec5ef-05e5-4762-8842-cc1a46706e91))
  (pad "12" thru_hole oval (at 1.27 -3.81) (size 1.3208 2.6416) (drill 0.8128) (layers *.Cu *.Mask) (tstamp a4054d87-5531-444c-97c5-96f0cdad692a))
  (pad "13" thru_hole oval (at -1.27 -3.81) (size 1.3208 2.6416) (drill 0.8128) (layers *.Cu *.Mask) (tstamp 3c8fc06d-0288-43cd-a5e7-76d27e4f7522))
  (pad "14" thru_hole oval (at -3.81 -3.81) (size 1.3208 2.6416) (drill 0.8128) (layers *.Cu *.Mask) (tstamp 127e8bbd-01de-439d-bcca-d231b6b1c6da))
  (pad "15" thru_hole oval (at -6.35 -3.81) (size 1.3208 2.6416) (drill 0.8128) (layers *.Cu *.Mask) (tstamp c2648ca0-e789-454f-95e8-2218b302baa6))
  (pad "16" thru_hole oval (at -8.89 -3.81) (size 1.3208 2.6416) (drill 0.8128) (layers *.Cu *.Mask) (tstamp f0eba038-d8d3-4081-9190-7ab179add70b))
  (model "/home/drFaustroll/playground/keyboard/m65/m65-pcb/packages3d/74HC595N_DIP16.step"
    (offset (xyz 0 0 0))
    (scale (xyz 1 1 1))
    (rotate (xyz -90 0 -90))
  )
)
