(footprint "rows0-7" (version 20211014) (generator pcbnew)
  (layer "F.Cu")
  (tedit 5A19A420)
  (descr "Through hole straight socket strip, 1x08, 2.54mm pitch, single row (from Kicad 4.0.7), script generated")
  (tags "Through hole socket strip THT 1x08 2.54mm single row")
  (property "Sheetfile" "handwire8x16.kicad_sch")
  (property "Sheetname" "")
  (attr through_hole)
  (fp_text reference "J*" (at 0 -2.77) (layer "F.SilkS")
    (effects (font (size 1 1) (thickness 0.15)))
    (tstamp 0cac914b-bd4d-4fec-a127-718ba12e481c)
  )
  (fp_text value "rows 0-7" (at 4.4 8.625 90) (layer "F.Fab")
    (effects (font (size 1 1) (thickness 0.15)))
    (tstamp 5adddfe1-e5e2-49af-9164-ef190eff4380)
  )
  (fp_text user "r3" (at 2.625 6.39 unlocked) (layer "B.SilkS")
    (effects (font (size 1 1) (thickness 0.15)) (justify mirror))
    (tstamp 41479ed4-1fa4-49fc-b787-2b79a4345253)
  )
  (fp_text user "${REFERENCE}" (at 1.85 -2.8) (layer "B.SilkS")
    (effects (font (size 1 1) (thickness 0.15)) (justify mirror))
    (tstamp 46c4feea-0afa-4d14-959f-c1fbbfce3cd8)
  )
  (fp_text user "r0" (at 2.625 -1.23 unlocked) (layer "B.SilkS")
    (effects (font (size 1 1) (thickness 0.15)) (justify mirror))
    (tstamp 7541dd62-e6c1-4dd0-a6f2-71e352faabf4)
  )
  (fp_text user "r7" (at 2.625 16.55 unlocked) (layer "B.SilkS")
    (effects (font (size 1 1) (thickness 0.15)) (justify mirror))
    (tstamp 890206a0-1dcf-4a58-af40-45afb19837b2)
  )
  (fp_text user "r1" (at 2.625 1.31 unlocked) (layer "B.SilkS")
    (effects (font (size 1 1) (thickness 0.15)) (justify mirror))
    (tstamp acb5b163-404e-45a7-b7de-af3a8e4e3f46)
  )
  (fp_text user "r5" (at 2.625 11.47 unlocked) (layer "B.SilkS")
    (effects (font (size 1 1) (thickness 0.15)) (justify mirror))
    (tstamp ada830f8-2731-4261-a0b3-06efb5dab3cc)
  )
  (fp_text user "r4" (at 2.625 8.96 unlocked) (layer "B.SilkS")
    (effects (font (size 1 1) (thickness 0.15)) (justify mirror))
    (tstamp e56f711a-c396-4e42-ab34-b49f8eaa47e1)
  )
  (fp_text user "r2" (at 2.625 3.85 unlocked) (layer "B.SilkS")
    (effects (font (size 1 1) (thickness 0.15)) (justify mirror))
    (tstamp ecda7550-068d-4f83-8d9c-5214b5d47634)
  )
  (fp_text user "r6" (at 2.625 14.01 unlocked) (layer "B.SilkS")
    (effects (font (size 1 1) (thickness 0.15)) (justify mirror))
    (tstamp f4a52b9a-40b1-4ae8-aee9-ca377d89ad69)
  )
  (fp_text user "r1" (at 2.54 2.54 unlocked) (layer "F.SilkS")
    (effects (font (size 1 1) (thickness 0.15)))
    (tstamp 0b87ac07-81e5-44a5-86bb-a320da1a61f7)
  )
  (fp_text user "r0" (at 2.54 0 unlocked) (layer "F.SilkS")
    (effects (font (size 1 1) (thickness 0.15)))
    (tstamp 12ba9748-f930-4ec7-a8d8-c071e6518e79)
  )
  (fp_text user "r6" (at 2.54 15.24 unlocked) (layer "F.SilkS")
    (effects (font (size 1 1) (thickness 0.15)))
    (tstamp 364a5a2d-740c-4faf-8f06-fc0f5286b28f)
  )
  (fp_text user "r5" (at 2.54 12.7 unlocked) (layer "F.SilkS")
    (effects (font (size 1 1) (thickness 0.15)))
    (tstamp 4ba429e5-03a1-4324-962e-72609475f572)
  )
  (fp_text user "r3" (at 2.54 7.62 unlocked) (layer "F.SilkS")
    (effects (font (size 1 1) (thickness 0.15)))
    (tstamp 8662fc6d-bca4-4032-a33f-5b06fba1ab57)
  )
  (fp_text user "r7" (at 2.54 17.78 unlocked) (layer "F.SilkS")
    (effects (font (size 1 1) (thickness 0.15)))
    (tstamp d7d8fb8a-7172-40f6-b1bf-03b89df90c90)
  )
  (fp_text user "r2" (at 2.54 5.08 unlocked) (layer "F.SilkS")
    (effects (font (size 1 1) (thickness 0.15)))
    (tstamp f22af15d-2b40-43ae-8afc-93a61428542e)
  )
  (fp_text user "r4" (at 2.54 10.19 unlocked) (layer "F.SilkS")
    (effects (font (size 1 1) (thickness 0.15)))
    (tstamp f8d7b594-c0f3-470f-8b4f-456d3835882d)
  )
  (fp_text user "${REFERENCE}" (at 0 8.89 90) (layer "F.Fab")
    (effects (font (size 1 1) (thickness 0.15)))
    (tstamp dd4be62c-2eaf-4a72-9d33-1c1e6d234610)
  )
  (fp_line (start 0 -1.33) (end 1.33 -1.33) (layer "F.SilkS") (width 0.12) (tstamp 1a8175a6-51f8-47af-ad8c-2200a6a42cef))
  (fp_line (start -1.33 1.27) (end -1.33 19.11) (layer "F.SilkS") (width 0.12) (tstamp 2449fef2-0919-4e5d-862b-c24245af792e))
  (fp_line (start 1.33 1.27) (end 1.33 19.11) (layer "F.SilkS") (width 0.12) (tstamp 40a8077f-fac6-4d6a-848e-dca97c24a0ee))
  (fp_line (start -1.33 1.27) (end 1.33 1.27) (layer "F.SilkS") (width 0.12) (tstamp 570dc5bd-5386-41cb-8f00-9add4a89222f))
  (fp_line (start 1.33 -1.33) (end 1.33 0) (layer "F.SilkS") (width 0.12) (tstamp 6874dbd9-292f-46d2-acb0-d55e865a0086))
  (fp_line (start -1.33 19.11) (end 1.33 19.11) (layer "F.SilkS") (width 0.12) (tstamp f69feda8-9fa8-4dab-a4f6-b5dd40822bcd))
  (fp_line (start 1.75 19.55) (end -1.8 19.55) (layer "F.CrtYd") (width 0.05) (tstamp 64d201c4-3573-4ed2-8dbd-fb97eb4bc326))
  (fp_line (start 1.75 -1.8) (end 1.75 19.55) (layer "F.CrtYd") (width 0.05) (tstamp 650adfe1-0872-486b-a6e0-9351833188f3))
  (fp_line (start -1.8 -1.8) (end 1.75 -1.8) (layer "F.CrtYd") (width 0.05) (tstamp 9161067a-b853-424b-b2d0-473298338dee))
  (fp_line (start -1.8 19.55) (end -1.8 -1.8) (layer "F.CrtYd") (width 0.05) (tstamp bb7d70c8-b8c3-402c-92ac-4e55f573f378))
  (fp_line (start 1.27 19.05) (end -1.27 19.05) (layer "F.Fab") (width 0.1) (tstamp 35aa66e6-a6fc-4d74-9b5b-b3ee179c1090))
  (fp_line (start 0.635 -1.27) (end 1.27 -0.635) (layer "F.Fab") (width 0.1) (tstamp 591d44a5-5639-49b3-aee5-87ed94bcf0dd))
  (fp_line (start 1.27 -0.635) (end 1.27 19.05) (layer "F.Fab") (width 0.1) (tstamp 718acb63-1492-4d5a-a09c-f488b12e2d71))
  (fp_line (start -1.27 19.05) (end -1.27 -1.27) (layer "F.Fab") (width 0.1) (tstamp a0a4e6b1-0cf4-4e47-b9fe-7db4d053db49))
  (fp_line (start -1.27 -1.27) (end 0.635 -1.27) (layer "F.Fab") (width 0.1) (tstamp a5151bd7-9934-4940-8c2d-38488cace32e))
  (pad "1" thru_hole circle (at 0 0) (size 1.7 1.7) (drill 1) (layers *.Cu *.Mask) (tstamp 5dbfa600-c8c0-4921-bb5c-0888f6fada4b))
  (pad "2" thru_hole oval (at 0 2.54) (size 1.7 1.7) (drill 1) (layers *.Cu *.Mask) (tstamp 5bd649e7-ffc2-4000-9e5e-98a96b8eadde))
  (pad "3" thru_hole oval (at 0 5.08) (size 1.7 1.7) (drill 1) (layers *.Cu *.Mask) (tstamp bc43237c-6553-4a98-8aee-854bd83ed8ab))
  (pad "4" thru_hole oval (at 0 7.62) (size 1.7 1.7) (drill 1) (layers *.Cu *.Mask) (tstamp d19991cf-09fd-4ec3-9876-27de1d6913d0))
  (pad "5" thru_hole oval (at 0 10.16) (size 1.7 1.7) (drill 1) (layers *.Cu *.Mask) (tstamp a456ffe0-81b4-4a27-a336-5089794175b4))
  (pad "6" thru_hole oval (at 0 12.7) (size 1.7 1.7) (drill 1) (layers *.Cu *.Mask) (tstamp ce2b5c96-b7f5-4130-9a70-08050aa38583))
  (pad "7" thru_hole oval (at 0 15.24) (size 1.7 1.7) (drill 1) (layers *.Cu *.Mask) (tstamp 2574eac4-a77e-4a87-9e79-708829d4dae5))
  (pad "8" thru_hole oval (at 0 17.78) (size 1.7 1.7) (drill 1) (layers *.Cu *.Mask) (tstamp 70130007-2a0f-42ed-9ec3-b0e60e226fa8))
  (model "${KICAD6_3DMODEL_DIR}/Connector_JST.3dshapes/JST_EH_S8B-EH_1x08_P2.50mm_Horizontal.wrl"
    (offset (xyz 0 0 -2))
    (scale (xyz 1 1 1))
    (rotate (xyz 0 -180 -90))
  )
)
