(footprint "OLED_128x32" (version 20211014) (generator pcbnew)
  (layer "F.Cu")
  (tedit 61D8C713)
  (descr "Connecteur 4 pins")
  (tags "oled ")
  (attr through_hole)
  (fp_text reference "OLED**" (at 6.8 -0.55 270) (layer "F.Fab")
    (effects (font (size 0.8128 0.8128) (thickness 0.15)))
    (tstamp 658dad07-97fd-466c-8b49-21892ac96ea4)
  )
  (fp_text value "OLED" (at 0 2.25) (layer "F.SilkS") hide
    (effects (font (size 0.8128 0.8128) (thickness 0.15)))
    (tstamp 40b14a16-fb82-4b9d-89dd-55cd98abb5cc)
  )
  (fp_text user "SDA" (at -4.975 2.5 90 unlocked) (layer "B.SilkS")
    (effects (font (size 1 1) (thickness 0.15)) (justify mirror))
    (tstamp 14b9faa9-957e-4578-9815-5cfd5927f898)
  )
  (fp_text user "GND" (at 2.645 2.754 90 unlocked) (layer "B.SilkS")
    (effects (font (size 1 1) (thickness 0.15)) (justify mirror))
    (tstamp 7a8b621f-c159-4391-a799-29138b6235e5)
  )
  (fp_text user "SCL" (at -2.689 2.5 90 unlocked) (layer "B.SilkS")
    (effects (font (size 1 1) (thickness 0.15)) (justify mirror))
    (tstamp 92a8ea0d-29ef-42ca-a802-81ab56227b78)
  )
  (fp_text user "VCC" (at -0.149 2.754 90 unlocked) (layer "B.SilkS")
    (effects (font (size 1 1) (thickness 0.15)) (justify mirror))
    (tstamp cf5ca99e-9a69-4792-a6c3-8dc64549fac6)
  )
  (fp_text user "${VALUE}" (at -1.675 -1.55) (layer "B.SilkS")
    (effects (font (size 0.8128 0.8128) (thickness 0.15)) (justify mirror))
    (tstamp f7d3f176-16f4-483b-a6ee-86a6f16d3798)
  )
  (fp_text user "VCC" (at 1.016 2.794 90 unlocked) (layer "F.SilkS")
    (effects (font (size 1 1) (thickness 0.15)))
    (tstamp bb8256d3-6c00-42ef-a0d3-87ad661aebe1)
  )
  (fp_text user "SDA" (at -3.81 2.54 90 unlocked) (layer "F.SilkS")
    (effects (font (size 1 1) (thickness 0.15)))
    (tstamp bfffd2e4-7635-401f-999b-8833d671fd88)
  )
  (fp_text user "SCL" (at -1.524 2.54 90 unlocked) (layer "F.SilkS")
    (effects (font (size 1 1) (thickness 0.15)))
    (tstamp c172cf14-8e22-4ac1-804a-bbcff417cfbe)
  )
  (fp_text user "GND" (at 3.81 2.794 90 unlocked) (layer "F.SilkS")
    (effects (font (size 1 1) (thickness 0.15)))
    (tstamp da73faa9-83d7-4523-a3cd-58a47072793e)
  )
  (fp_text user "${VALUE}" (at 2.85 -1.475) (layer "F.SilkS")
    (effects (font (size 0.8128 0.8128) (thickness 0.15)))
    (tstamp f3168173-8706-46a5-be80-74ad7d968518)
  )
  (fp_line (start -6 1.27) (end -6 -36.73) (layer "Dwgs.User") (width 0.12) (tstamp 240c10af-51b5-420e-a6f4-a2c8f5db1db5))
  (fp_line (start -6 -36.73) (end 6 -36.73) (layer "Dwgs.User") (width 0.12) (tstamp 2d697cf0-e02e-4ed1-a048-a704dab0ee43))
  (fp_line (start -6 1.27) (end 6 1.27) (layer "Dwgs.User") (width 0.12) (tstamp 503dbd88-3e6b-48cc-a2ea-a6e28b52a1f7))
  (fp_line (start 6 -36.73) (end 6 1.27) (layer "Dwgs.User") (width 0.12) (tstamp c09938fd-06b9-4771-9f63-2311626243b3))
  (pad "1" thru_hole circle (at -3.81 0) (size 1.397 1.397) (drill 0.8128) (layers *.Cu *.Mask) (tstamp cb614b23-9af3-4aec-bed8-c1374e001510))
  (pad "2" thru_hole circle (at -1.27 0) (size 1.397 1.397) (drill 0.8128) (layers *.Cu *.Mask) (tstamp 20cca02e-4c4d-4961-b6b4-b40a1731b220))
  (pad "3" thru_hole circle (at 1.27 0) (size 1.397 1.397) (drill 0.8128) (layers *.Cu *.Mask) (tstamp 5487601b-81d3-4c70-8f3d-cf9df9c63302))
  (pad "4" thru_hole roundrect (at 3.81 0) (size 1.397 1.397) (drill 0.8128) (layers *.Cu *.Mask) (roundrect_rratio 0.25) (tstamp a29f8df0-3fae-4edf-8d9c-bd5a875b13e3))
  (model "/home/drFaustroll/playground/keyboard/m65/m65-pcb/packages3d/OLED_0.91_128x321.stp" hide
    (offset (xyz 0 18 10))
    (scale (xyz 1 1 1))
    (rotate (xyz 0 0 -90))
  )
  (model "${KIPRJMOD}/packages3d/OLED_0.91_128x321.stp"
    (offset (xyz 0 17.5 9.5))
    (scale (xyz 1 1 1))
    (rotate (xyz 0 0 -90))
  )
  (model "${KICAD6_3DMODEL_DIR}/Connector_PinSocket_2.54mm.3dshapes/PinSocket_1x04_P2.54mm_Vertical.step"
    (offset (xyz 4 0.5 0))
    (scale (xyz 1 1 1))
    (rotate (xyz 0 0 90))
  )
)
