(footprint "el-copper" (version 20211014) (generator pcbnew)
  (layer "F.Cu")
  (tedit 61D8A65E)
  (attr board_only exclude_from_pos_files exclude_from_bom)
  (fp_text reference "G***" (at 0 0) (layer "F.SilkS") hide
    (effects (font (size 1.524 1.524) (thickness 0.3)))
    (tstamp e43d2caf-f88d-4854-b9ea-7932b7466c98)
  )
  (fp_text value "LOGO" (at 0.75 0) (layer "F.SilkS") hide
    (effects (font (size 1.524 1.524) (thickness 0.3)))
    (tstamp 006ac304-996e-4e86-853e-b0c77b8125c6)
  )
  (fp_poly (pts
      (xy -1.140573 0.428332)
      (xy -1.057959 0.602648)
      (xy -1.207028 0.772243)
      (xy -1.441236 0.830065)
      (xy -1.609281 0.785041)
      (xy -1.510029 0.600376)
      (xy -1.495634 0.582873)
      (xy -1.260622 0.419308)
    ) (layer "F.Cu") (width 0) (fill solid) (tstamp 0a6acf54-e9fa-4886-b9b2-53ceea962ace))
  (fp_poly (pts
      (xy 4.482353 0.581046)
      (xy 4.399347 0.664052)
      (xy 4.31634 0.581046)
      (xy 4.399347 0.498039)
    ) (layer "F.Cu") (width 0) (fill solid) (tstamp 0e7caeb4-9034-406f-9f74-d5a30973e6cc))
  (fp_poly (pts
      (xy -1.992157 2.075163)
      (xy -2.075163 2.15817)
      (xy -2.15817 2.075163)
      (xy -2.075163 1.992157)
    ) (layer "F.Cu") (width 0) (fill solid) (tstamp 11649d69-8872-453e-b6fe-a39ef15e003f))
  (fp_poly (pts
      (xy -7.636601 -0.24902)
      (xy -7.719608 -0.166013)
      (xy -7.802614 -0.24902)
      (xy -7.719608 -0.332026)
    ) (layer "F.Cu") (width 0) (fill solid) (tstamp 12563070-162b-49fe-9ea0-22682782c31c))
  (fp_poly (pts
      (xy -5.923817 -2.260413)
      (xy -5.917691 -2.010333)
      (xy -6.042383 -1.872289)
      (xy -6.200764 -1.952205)
      (xy -6.203065 -1.955872)
      (xy -6.20318 -2.075164)
      (xy -6.142483 -2.075164)
      (xy -6.059477 -1.992157)
      (xy -5.97647 -2.075164)
      (xy -6.059477 -2.15817)
      (xy -6.142483 -2.075164)
      (xy -6.20318 -2.075164)
      (xy -6.2033 -2.199222)
      (xy -6.154632 -2.304526)
      (xy -6.022217 -2.418397)
    ) (layer "F.Cu") (width 0) (fill solid) (tstamp 1705c65e-85a3-4693-8143-b2029aa1b3f8))
  (fp_poly (pts
      (xy -6.142483 3.403268)
      (xy -6.22549 3.486274)
      (xy -6.308497 3.403268)
      (xy -6.22549 3.320261)
    ) (layer "F.Cu") (width 0) (fill solid) (tstamp 1b67e2a3-3e7d-4670-8844-bbe56a8b3324))
  (fp_poly (pts
      (xy -9.35207 -0.774728)
      (xy -9.374858 -0.676033)
      (xy -9.462745 -0.664052)
      (xy -9.599392 -0.724794)
      (xy -9.57342 -0.774728)
      (xy -9.376402 -0.794596)
    ) (layer "F.Cu") (width 0) (fill solid) (tstamp 1f9f564c-83e0-4dd8-af26-da65d8c28d3e))
  (fp_poly (pts
      (xy -8.13464 -3.237255)
      (xy -8.217647 -3.154249)
      (xy -8.300653 -3.237255)
      (xy -8.217647 -3.320262)
    ) (layer "F.Cu") (width 0) (fill solid) (tstamp 214108ef-99e3-4bf5-937f-f0f9ec4226fa))
  (fp_poly (pts
      (xy -9.546587 -0.186036)
      (xy -9.497232 0.172927)
      (xy -9.495948 0.249019)
      (xy -9.568064 0.655577)
      (xy -9.743481 0.84681)
      (xy -9.960795 0.774291)
      (xy -10.036701 0.675523)
      (xy -10.027476 0.581046)
      (xy -9.960784 0.581046)
      (xy -9.877778 0.664052)
      (xy -9.794771 0.581046)
      (xy -9.877778 0.498039)
      (xy -9.960784 0.581046)
      (xy -10.027476 0.581046)
      (xy -10.015882 0.462308)
      (xy -9.963492 0.416706)
      (xy -9.821711 0.180986)
      (xy -9.794771 -0.009798)
      (xy -9.730431 -0.274306)
      (xy -9.645359 -0.332026)
    ) (layer "F.Cu") (width 0) (fill solid) (tstamp 28e947db-4c27-407c-b890-6c8ef8c19ea5))
  (fp_poly (pts
      (xy -2.04284 0.752271)
      (xy -2.13757 0.874335)
      (xy -2.277153 0.979246)
      (xy -2.242321 0.812898)
      (xy -2.230503 0.781402)
      (xy -2.098988 0.578112)
      (xy -2.024218 0.576653)
    ) (layer "F.Cu") (width 0) (fill solid) (tstamp 38a047d4-46e1-49b9-bf9e-dcb6d0d325e0))
  (fp_poly (pts
      (xy -7.861717 -2.863379)
      (xy -7.63511 -2.672589)
      (xy -7.616931 -2.603519)
      (xy -7.668262 -2.076175)
      (xy -7.901624 -1.750947)
      (xy -8.251334 -1.669081)
      (xy -8.651708 -1.871821)
      (xy -8.703828 -1.921009)
      (xy -8.889756 -2.221281)
      (xy -8.611456 -2.221281)
      (xy -8.516265 -2.097093)
      (xy -8.246452 -2.018797)
      (xy -7.952848 -2.126776)
      (xy -7.850957 -2.261928)
      (xy -7.942382 -2.401866)
      (xy -8.21073 -2.448693)
      (xy -8.562823 -2.389852)
      (xy -8.611456 -2.221281)
      (xy -8.889756 -2.221281)
      (xy -8.942446 -2.306375)
      (xy -8.859479 -2.642711)
      (xy -8.626409 -2.825578)
      (xy -8.236952 -2.924231)
    ) (layer "F.Cu") (width 0) (fill solid) (tstamp 3b83372b-e24a-47d7-bdc4-ed4dfbccc9f6))
  (fp_poly (pts
      (xy -10.306594 2.40689)
      (xy -10.430478 2.690394)
      (xy -10.619936 2.94473)
      (xy -10.821204 3.229819)
      (xy -10.749417 3.375886)
      (xy -10.744446 3.37796)
      (xy -10.718693 3.444377)
      (xy -10.910149 3.473168)
      (xy -11.1794 3.414684)
      (xy -11.187836 3.250091)
      (xy -10.960394 2.977462)
      (xy -10.86102 2.923275)
      (xy -10.64844 2.703468)
      (xy -10.624836 2.58821)
      (xy -10.5257 2.303341)
      (xy -10.458823 2.241176)
      (xy -10.309059 2.226656)
    ) (layer "F.Cu") (width 0) (fill solid) (tstamp 50de9d39-c7c9-4b2e-8cad-fd8bff28e95e))
  (fp_poly (pts
      (xy 15.439216 4.731372)
      (xy 15.356209 4.814379)
      (xy 15.273203 4.731372)
      (xy 15.356209 4.648366)
    ) (layer "F.Cu") (width 0) (fill solid) (tstamp 5221f2bd-fab0-41b7-8b4f-47d3e7ff6da5))
  (fp_poly (pts
      (xy -0.389092 0.267719)
      (xy -0.415032 0.332026)
      (xy -0.564213 0.4904)
      (xy -0.590843 0.498039)
      (xy -0.662149 0.369596)
      (xy -0.664052 0.332026)
      (xy -0.536429 0.172392)
      (xy -0.488241 0.166013)
    ) (layer "F.Cu") (width 0) (fill solid) (tstamp 5e51d126-45d8-4716-ae86-0b862afa7c62))
  (fp_poly (pts
      (xy -1.404995 1.638826)
      (xy -1.420118 1.674704)
      (xy -1.64931 1.809566)
      (xy -1.780603 1.826144)
      (xy -1.952399 1.771815)
      (xy -1.932014 1.710663)
      (xy -1.717201 1.59048)
      (xy -1.494146 1.563206)
    ) (layer "F.Cu") (width 0) (fill solid) (tstamp 61af002a-5ee4-4d64-bd5e-c3178123122d))
  (fp_poly (pts
      (xy -1.053145 -0.23032)
      (xy -1.079085 -0.166013)
      (xy -1.228265 -0.007639)
      (xy -1.254895 0)
      (xy -1.326201 -0.128443)
      (xy -1.328104 -0.166013)
      (xy -1.200481 -0.325647)
      (xy -1.152294 -0.332026)
    ) (layer "F.Cu") (width 0) (fill solid) (tstamp 6737c8ee-99fe-4c76-88a5-c9b97cd7019f))
  (fp_poly (pts
      (xy -0.830065 -0.581046)
      (xy -0.913072 -0.498039)
      (xy -0.996078 -0.581046)
      (xy -0.913072 -0.664052)
    ) (layer "F.Cu") (width 0) (fill solid) (tstamp 77212986-5f37-4dfe-908e-c1af1433d149))
  (fp_poly (pts
      (xy -9.130719 0.415032)
      (xy -9.213725 0.498039)
      (xy -9.296732 0.415032)
      (xy -9.213725 0.332026)
    ) (layer "F.Cu") (width 0) (fill solid) (tstamp 7ddf17dc-6fd1-4144-bfce-89305fdf1b46))
  (fp_poly (pts
      (xy -4.814379 0.249019)
      (xy -4.897385 0.332026)
      (xy -4.980392 0.249019)
      (xy -4.897385 0.166013)
    ) (layer "F.Cu") (width 0) (fill solid) (tstamp 86095b14-ca87-48e0-8138-482f224a1ba4))
  (fp_poly (pts
      (xy -8.552282 -3.490495)
      (xy -8.549884 -3.301739)
      (xy -8.747274 -3.240013)
      (xy -8.945048 -3.308113)
      (xy -9.026877 -3.403268)
      (xy -8.798693 -3.403268)
      (xy -8.715686 -3.320262)
      (xy -8.63268 -3.403268)
      (xy -8.715686 -3.486275)
      (xy -8.798693 -3.403268)
      (xy -9.026877 -3.403268)
      (xy -9.058919 -3.440528)
      (xy -8.900935 -3.538928)
      (xy -8.631367 -3.550366)
    ) (layer "F.Cu") (width 0) (fill solid) (tstamp 8752940a-6989-410a-a8a5-a49c1920631d))
  (fp_poly (pts
      (xy 3.367733 -2.203383)
      (xy 3.403268 -2.15817)
      (xy 3.461701 -2.008857)
      (xy 3.304634 -2.065092)
      (xy 3.154249 -2.15817)
      (xy 3.026621 -2.291442)
      (xy 3.102948 -2.321641)
    ) (layer "F.Cu") (width 0) (fill solid) (tstamp 88c6d81c-66fa-4a3a-b105-12a4e4586b68))
  (fp_poly (pts
      (xy -5.696529 -3.047013)
      (xy -5.727451 -2.988235)
      (xy -5.883871 -2.829693)
      (xy -5.913059 -2.822222)
      (xy -5.924386 -2.929458)
      (xy -5.893464 -2.988235)
      (xy -5.737044 -3.146778)
      (xy -5.707856 -3.154249)
    ) (layer "F.Cu") (width 0) (fill solid) (tstamp 8ad172fc-b044-433e-857a-cf95bbf92f0b))
  (fp_poly (pts
      (xy -8.798693 0.083006)
      (xy -8.881699 0.166013)
      (xy -8.964706 0.083006)
      (xy -8.881699 0)
    ) (layer "F.Cu") (width 0) (fill solid) (tstamp 91c48e4c-a585-464c-bc94-e70888e4fe70))
  (fp_poly (pts
      (xy -7.636601 -1.577124)
      (xy -7.719608 -1.494118)
      (xy -7.802614 -1.577124)
      (xy -7.719608 -1.660131)
    ) (layer "F.Cu") (width 0) (fill solid) (tstamp 9f02fbcf-a468-4c8a-8bf6-3edf554c7296))
  (fp_poly (pts
      (xy -1.546202 2.265406)
      (xy -1.577124 2.324183)
      (xy -1.733544 2.482726)
      (xy -1.762732 2.490196)
      (xy -1.774059 2.38296)
      (xy -1.743137 2.324183)
      (xy -1.586717 2.16564)
      (xy -1.557529 2.15817)
    ) (layer "F.Cu") (width 0) (fill solid) (tstamp c45d22d5-738d-45a4-b6a5-124d55f76785))
  (fp_poly (pts
      (xy -8.637764 -0.913072)
      (xy -8.720423 -0.64025)
      (xy -8.798693 -0.498039)
      (xy -8.930237 -0.365159)
      (xy -8.959621 -0.415033)
      (xy -8.876962 -0.687855)
      (xy -8.798693 -0.830066)
      (xy -8.667149 -0.962946)
    ) (layer "F.Cu") (width 0) (fill solid) (tstamp c5e62361-2eba-4e0d-a151-e1fb88eae2b4))
  (fp_poly (pts
      (xy 17.738634 4.068254)
      (xy 17.690763 4.329837)
      (xy 17.625007 4.443344)
      (xy 17.448063 4.568573)
      (xy 17.37853 4.540185)
      (xy 17.264694 4.273219)
      (xy 17.358931 4.040898)
      (xy 17.514379 3.984314)
    ) (layer "F.Cu") (width 0) (fill solid) (tstamp c90bf4c6-340e-4ed7-9989-23fbf63bd2fc))
  (fp_poly (pts
      (xy -1.660131 0.415032)
      (xy -1.743137 0.498039)
      (xy -1.826144 0.415032)
      (xy -1.743137 0.332026)
    ) (layer "F.Cu") (width 0) (fill solid) (tstamp cb9267bf-ea27-4b56-94c2-f368254f2009))
  (fp_poly (pts
      (xy -9.186056 -0.110676)
      (xy -9.166188 0.086343)
      (xy -9.186056 0.110675)
      (xy -9.284751 0.087887)
      (xy -9.296732 0)
      (xy -9.23599 -0.136648)
    ) (layer "F.Cu") (width 0) (fill solid) (tstamp d1feabe6-71a4-4ded-ae26-cc409eb773a2))
  (fp_poly (pts
      (xy -4.766908 2.27897)
      (xy -4.731372 2.324183)
      (xy -4.67294 2.473496)
      (xy -4.830006 2.417261)
      (xy -4.980392 2.324183)
      (xy -5.10802 2.190911)
      (xy -5.031693 2.160712)
    ) (layer "F.Cu") (width 0) (fill solid) (tstamp da4bfdd9-0c12-4e08-bacb-aeb157cd303d))
  (fp_poly (pts
      (xy 0.498039 2.905229)
      (xy 0.415033 2.988235)
      (xy 0.332026 2.905229)
      (xy 0.415033 2.822222)
    ) (layer "F.Cu") (width 0) (fill solid) (tstamp e054443f-ea04-4571-96f0-e5aa771ae0ba))
  (fp_poly (pts
      (xy -5.944665 -5.436955)
      (xy -5.373279 -5.329333)
      (xy -4.843391 -5.180773)
      (xy -4.438039 -5.016485)
      (xy -4.240262 -4.861678)
      (xy -4.241829 -4.800632)
      (xy -4.197755 -4.725781)
      (xy -4.048709 -4.761486)
      (xy -3.8555 -4.793802)
      (xy -3.899724 -4.650928)
      (xy -3.94603 -4.509823)
      (xy -3.834369 -4.555429)
      (xy -3.579381 -4.54709)
      (xy -3.176898 -4.369932)
      (xy -3.011886 -4.26869)
      (xy -2.086606 -3.69228)
      (xy -1.289104 -3.297984)
      (xy -0.50046 -3.045699)
      (xy 0.398249 -2.895324)
      (xy 1.28065 -2.821183)
      (xy 2.117639 -2.761635)
      (xy 2.700877 -2.694914)
      (xy 3.108462 -2.603086)
      (xy 3.418496 -2.468219)
      (xy 3.709076 -2.272382)
      (xy 3.725641 -2.259795)
      (xy 4.338184 -1.651601)
      (xy 4.848973 -0.822384)
      (xy 5.281325 0.270639)
      (xy 5.486634 0.971502)
      (xy 5.891678 2.144643)
      (xy 6.409365 3.076685)
      (xy 7.018414 3.734172)
      (xy 7.394852 3.97161)
      (xy 7.643872 4.053295)
      (xy 8.035179 4.115968)
      (xy 8.607147 4.161847)
      (xy 9.398154 4.193151)
      (xy 10.446574 4.212098)
      (xy 11.703607 4.22063)
      (xy 12.935212 4.223121)
      (xy 13.883903 4.2188)
      (xy 14.598781 4.203836)
      (xy 15.128945 4.174404)
      (xy 15.523496 4.126675)
      (xy 15.831533 4.056822)
      (xy 16.102156 3.961015)
      (xy 16.331888 3.859804)
      (xy 17.041175 3.581473)
      (xy 17.576237 3.504475)
      (xy 18.023058 3.623909)
      (xy 18.233977 3.751346)
      (xy 18.531557 4.110514)
      (xy 18.561439 4.454936)
      (xy 18.472165 4.754134)
      (xy 18.229765 4.921761)
      (xy 17.846405 5.015233)
      (xy 17.432163 5.066824)
      (xy 16.816063 5.104257)
      (xy 15.97756 5.127665)
      (xy 14.896107 5.137181)
      (xy 13.551159 5.13294)
      (xy 11.92217 5.115075)
      (xy 9.988593 5.083719)
      (xy 9.296732 5.070753)
      (xy 7.31843 5.037867)
      (xy 5.223987 5.012583)
      (xy 3.054411 4.994764)
      (xy 0.850711 4.984275)
      (xy -1.346104 4.980979)
      (xy -3.495024 4.984742)
      (xy -5.55504 4.995427)
      (xy -7.485144 5.0129)
      (xy -9.244326 5.037024)
      (xy -10.791577 5.067663)
      (xy -12.085889 5.104682)
      (xy -13.024178 5.144586)
      (xy -14.600558 5.218002)
      (xy -15.998981 5.262428)
      (xy -17.192215 5.278065)
      (xy -18.153026 5.265113)
      (xy -18.854183 5.223775)
      (xy -19.268454 5.154253)
      (xy -19.368944 5.09763)
      (xy -19.349135 4.858443)
      (xy -19.200688 4.713318)
      (xy -17.177688 4.713318)
      (xy -17.029252 4.759966)
      (xy -16.583646 4.788374)
      (xy -15.964924 4.80011)
      (xy -15.206896 4.795838)
      (xy -14.737757 4.762452)
      (xy -14.515205 4.694418)
      (xy -14.501715 4.651426)
      (xy -14.360131 4.651426)
      (xy -14.157307 4.620824)
      (xy -11.705623 4.620824)
      (xy -11.697977 4.657983)
      (xy -11.476402 4.742526)
      (xy -10.974132 4.786018)
      (xy -10.239927 4.788644)
      (xy -9.322547 4.75059)
      (xy -8.40084 4.681756)
      (xy -5.928129 4.681756)
      (xy -5.723754 4.714535)
      (xy -5.255802 4.743118)
      (xy -4.577871 4.767201)
      (xy -3.743564 4.786479)
      (xy -2.80648 4.800649)
      (xy -1.82022 4.809406)
      (xy -0.838384 4.812445)
      (xy 0.085426 4.809464)
      (xy 0.897612 4.800157)
      (xy 1.544571 4.78422)
      (xy 1.972704 4.76135)
      (xy 2.12841 4.731242)
      (xy 2.126594 4.727465)
      (xy 1.957004 4.703704)
      (xy 3.209586 4.703704)
      (xy 3.232375 4.802398)
      (xy 3.320262 4.814379)
      (xy 3.456909 4.753637)
      (xy 3.45615 4.752178)
      (xy 3.961277 4.752178)
      (xy 4.18178 4.78092)
      (xy 4.233334 4.782015)
      (xy 4.501767 4.765025)
      (xy 4.918034 4.765025)
      (xy 5.146405 4.788166)
      (xy 5.382083 4.762077)
      (xy 5.371638 4.740697)
      (xy 5.844893 4.740697)
      (xy 6.044432 4.768207)
      (xy 6.22549 4.772513)
      (xy 6.567159 4.75915)
      (xy 6.632272 4.731372)
      (xy 8.300654 4.731372)
      (xy 8.38366 4.814379)
      (xy 8.466667 4.731372)
      (xy 8.438999 4.703704)
      (xy 9.35207 4.703704)
      (xy 9.374858 4.802398)
      (xy 9.462745 4.814379)
      (xy 9.599393 4.753637)
      (xy 9.587812 4.731372)
      (xy 11.786928 4.731372)
      (xy 11.869935 4.814379)
      (xy 11.952941 4.731372)
      (xy 11.95271 4.731141)
      (xy 15.106925 4.731141)
      (xy 15.213344 4.85473)
      (xy 15.637428 4.907932)
      (xy 16.382642 4.89179)
      (xy 16.476798 4.88629)
      (xy 17.151546 4.83682)
      (xy 17.72212 4.780059)
      (xy 18.087861 4.726435)
      (xy 18.136928 4.71431)
      (xy 18.41031 4.525538)
      (xy 18.436492 4.260203)
      (xy 18.263829 3.993033)
      (xy 17.940674 3.798757)
      (xy 17.515383 3.752101)
      (xy 17.514379 3.752216)
      (xy 17.149224 3.837481)
      (xy 16.611025 4.008449)
      (xy 16.031171 4.218297)
      (xy 15.541049 4.4202)
      (xy 15.314706 4.536122)
      (xy 15.106925 4.731141)
      (xy 11.95271 4.731141)
      (xy 11.869935 4.648366)
      (xy 11.786928 4.731372)
      (xy 9.587812 4.731372)
      (xy 9.573421 4.703704)
      (xy 9.376402 4.683835)
      (xy 9.35207 4.703704)
      (xy 8.438999 4.703704)
      (xy 8.38366 4.648366)
      (xy 8.300654 4.731372)
      (xy 6.632272 4.731372)
      (xy 6.655345 4.721529)
      (xy 6.600955 4.700315)
      (xy 6.202286 4.669392)
      (xy 5.936903 4.696964)
      (xy 5.844893 4.740697)
      (xy 5.371638 4.740697)
      (xy 5.353922 4.704432)
      (xy 5.014035 4.682505)
      (xy 4.938889 4.704432)
      (xy 4.918034 4.765025)
      (xy 4.501767 4.765025)
      (xy 4.516855 4.76407)
      (xy 4.541817 4.712101)
      (xy 4.527016 4.705485)
      (xy 4.197449 4.672644)
      (xy 4.028977 4.699333)
      (xy 3.961277 4.752178)
      (xy 3.45615 4.752178)
      (xy 3.430937 4.703704)
      (xy 3.233918 4.683835)
      (xy 3.209586 4.703704)
      (xy 1.957004 4.703704)
      (xy 1.943322 4.701787)
      (xy 1.474119 4.675599)
      (xy 0.765074 4.650337)
      (xy -0.137725 4.627438)
      (xy -1.188188 4.608341)
      (xy -2.044564 4.597383)
      (xy -3.155953 4.590454)
      (xy -4.13632 4.593639)
      (xy -4.943754 4.606029)
      (xy -5.536347 4.626714)
      (xy -5.872185 4.654783)
      (xy -5.928129 4.681756)
      (xy -8.40084 4.681756)
      (xy -8.270753 4.672041)
      (xy -7.968627 4.643776)
      (xy -7.478019 4.593155)
      (xy -7.232014 4.558775)
      (xy -7.248055 4.539202)
      (xy -7.543587 4.533004)
      (xy -8.136054 4.538746)
      (xy -9.042901 4.554995)
      (xy -9.047712 4.55509)
      (xy -9.974006 4.567918)
      (xy -10.574512 4.563649)
      (xy -10.847587 4.542362)
      (xy -10.791589 4.504142)
      (xy -10.6596 4.482353)
      (xy 4.482353 4.482353)
      (xy 6.338012 4.482353)
      (xy 5.929098 3.996386)
      (xy 5.633961 3.564609)
      (xy 5.31564 2.978273)
      (xy 5.136733 2.585275)
      (xy 4.913305 2.095998)
      (xy 4.720712 1.76066)
      (xy 4.617818 1.660131)
      (xy 4.556602 1.813404)
      (xy 4.509784 2.22242)
      (xy 4.484679 2.81097)
      (xy 4.482353 3.071242)
      (xy 4.482353 4.482353)
      (xy -10.6596 4.482353)
      (xy -10.624836 4.476614)
      (xy -9.921096 4.397272)
      (xy -9.193193 4.343433)
      (xy -8.914566 4.332758)
      (xy -8.424859 4.304047)
      (xy -8.42078 4.302505)
      (xy -5.146267 4.302505)
      (xy -4.988498 4.331939)
      (xy -4.548409 4.357771)
      (xy -3.875704 4.378552)
      (xy -3.020081 4.392832)
      (xy -2.031243 4.399162)
      (xy -1.825981 4.399346)
      (xy -0.695668 4.397534)
      (xy 0.145121 4.389525)
      (xy 0.738882 4.371461)
      (xy 1.128108 4.339485)
      (xy 1.355296 4.289737)
      (xy 1.462938 4.218361)
      (xy 1.493531 4.121497)
      (xy 1.494143 4.097909)
      (xy 1.571508 3.708433)
      (xy 1.678971 3.451071)
      (xy 1.781005 3.206123)
      (xy 1.654788 3.169287)
      (xy 1.471455 3.214223)
      (xy 0.180613 3.419591)
      (xy -1.217615 3.370378)
      (xy -1.992157 3.234942)
      (xy -2.863779 3.040092)
      (xy -3.463041 2.915644)
      (xy -3.840871 2.856322)
      (xy -4.048194 2.856849)
      (xy -4.135939 2.911951)
      (xy -4.154938 3.010896)
      (xy -4.268648 3.262153)
      (xy -4.546639 3.611898)
      (xy -4.652977 3.72146)
      (xy -4.959783 4.0437)
      (xy -5.132406 4.26608)
      (xy -5.146267 4.302505)
      (xy -8.42078 4.302505)
      (xy -8.156917 4.202747)
      (xy -8.000648 3.966737)
      (xy -7.929287 3.776797)
      (xy -7.744962 3.325178)
      (xy -7.471677 2.739574)
      (xy -7.272343 2.345924)
      (xy -7.019452 1.856505)
      (xy -6.914636 1.600144)
      (xy -6.950672 1.51643)
      (xy -7.120338 1.544953)
      (xy -7.178538 1.561331)
      (xy -7.566547 1.664826)
      (xy -8.10685 1.801119)
      (xy -8.342157 1.858625)
      (xy -8.798245 1.995661)
      (xy -9.082996 2.132836)
      (xy -9.130719 2.193794)
      (xy -9.249134 2.42841)
      (xy -9.556561 2.798701)
      (xy -9.981273 3.234776)
      (xy -10.451541 3.666748)
      (xy -10.895638 4.024726)
      (xy -11.21877 4.228322)
      (xy -11.562237 4.437595)
      (xy -11.705623 4.620824)
      (xy -14.157307 4.620824)
      (xy -13.799836 4.566889)
      (xy -13.354 4.508477)
      (xy -13.039223 4.48244)
      (xy -13.029036 4.482353)
      (xy -12.793664 4.348399)
      (xy -12.72526 4.233333)
      (xy -12.284967 4.233333)
      (xy -12.201961 4.31634)
      (xy -12.118954 4.233333)
      (xy -12.201961 4.150327)
      (xy -12.284967 4.233333)
      (xy -12.72526 4.233333)
      (xy -12.718806 4.222477)
      (xy -12.730723 4.062999)
      (xy -12.965825 4.066723)
      (xy -13.447144 4.237656)
      (xy -13.862091 4.4214)
      (xy -14.360131 4.651426)
      (xy -14.501715 4.651426)
      (xy -14.487733 4.606863)
      (xy -14.680783 4.504589)
      (xy -15.108074 4.453836)
      (xy -15.676068 4.453182)
      (xy -16.291228 4.501208)
      (xy -16.860016 4.596491)
      (xy -17.04774 4.645752)
      (xy -17.177688 4.713318)
      (xy -19.200688 4.713318)
      (xy -19.074738 4.590187)
      (xy -18.611213 4.352166)
      (xy -18.504312 4.314312)
      (xy -18.114885 4.229989)
      (xy -17.485116 4.142066)
      (xy -16.706362 4.061669)
      (xy -15.975692 4.006314)
      (xy -14.832785 3.913337)
      (xy -14.811702 3.909833)
      (xy -12.45098 3.909833)
      (xy -12.322873 3.898128)
      (xy -12.007289 3.762558)
      (xy -11.933866 3.72543)
      (xy -11.509839 3.563293)
      (xy -11.254738 3.621418)
      (xy -11.236611 3.63816)
      (xy -11.156961 3.789791)
      (xy -11.283355 3.8183)
      (xy -11.430238 3.87303)
      (xy -11.409398 3.919142)
      (xy -11.216043 3.900902)
      (xy -10.872317 3.702209)
      (xy -10.455953 3.383874)
      (xy -10.044687 3.006709)
      (xy -9.716255 2.631524)
      (xy -9.659507 2.550232)
      (xy -9.306969 2.01243)
      (xy -9.828608 1.96079)
      (xy -10.278766 1.854498)
      (xy -10.360702 1.76828)
      (xy -9.671385 1.76828)
      (xy -9.468571 1.80202)
      (xy -9.368367 1.806886)
      (xy -8.916461 1.77016)
      (xy -8.318389 1.655146)
      (xy -7.957256 1.560185)
      (xy -7.230723 1.312634)
      (xy -6.81959 1.088407)
      (xy -6.708829 0.878294)
      (xy -6.735155 0.811255)
      (xy -6.96943 0.672113)
      (xy -7.290465 0.84183)
      (xy -7.337991 0.887197)
      (xy -7.625869 1.063468)
      (xy -8.134652 1.279889)
      (xy -8.762563 1.498382)
      (xy -9.407827 1.680866)
      (xy -9.545751 1.713239)
      (xy -9.671385 1.76828)
      (xy -10.360702 1.76828)
      (xy -10.427523 1.697966)
      (xy -10.275771 1.556179)
      (xy -9.824407 1.494118)
      (xy -9.822183 1.494117)
      (xy -9.199368 1.458439)
      (xy -8.787314 1.31246)
      (xy -8.593101 1.120554)
      (xy -8.261259 1.120554)
      (xy -8.206596 1.162091)
      (xy -8.022164 1.080565)
      (xy -7.715192 0.894913)
      (xy -7.451275 0.646864)
      (xy -7.413655 0.458774)
      (xy -7.586346 0.413062)
      (xy -7.793158 0.492978)
      (xy -8.023263 0.682991)
      (xy -8.202347 0.929489)
      (xy -8.261259 1.120554)
      (xy -8.593101 1.120554)
      (xy -8.468837 0.997766)
      (xy -8.290473 0.730586)
      (xy -7.988586 0.341449)
      (xy -7.653125 0.184269)
      (xy -7.399772 0.166013)
      (xy -6.842607 0.291588)
      (xy -6.552667 0.503397)
      (xy -6.415089 0.675656)
      (xy -6.36504 0.851111)
      (xy -6.419018 1.100695)
      (xy -6.593523 1.495336)
      (xy -6.905055 2.105967)
      (xy -6.94197 2.177005)
      (xy -7.332969 2.946873)
      (xy -7.556367 3.47325)
      (xy -7.603296 3.804275)
      (xy -7.464887 3.988081)
      (xy -7.132271 4.072807)
      (xy -6.596579 4.106587)
      (xy -6.58638 4.106973)
      (xy -5.78485 4.081955)
      (xy -5.262561 3.927397)
      (xy -4.988455 3.631898)
      (xy -4.948012 3.505378)
      (xy -4.726991 3.088704)
      (xy -4.329369 2.71298)
      (xy -3.89146 2.500516)
      (xy -3.814902 2.488694)
      (xy -3.301357 2.467961)
      (xy -3.071654 2.527579)
      (xy -3.084966 2.678383)
      (xy -3.087094 2.681859)
      (xy -3.106564 2.795881)
      (xy -3.019564 2.758578)
      (xy -2.766787 2.737595)
      (xy -2.315401 2.80633)
      (xy -1.956332 2.896085)
      (xy -1.312246 3.037056)
      (xy -0.648045 3.11102)
      (xy -0.05043 3.116981)
      (xy 0.3939 3.053943)
      (xy 0.596639 2.925409)
      (xy 0.742399 2.822222)
      (xy 1.992157 2.822222)
      (xy 2.052899 2.95887)
      (xy 2.102832 2.932897)
      (xy 2.122701 2.735879)
      (xy 2.102832 2.711547)
      (xy 2.004138 2.734335)
      (xy 1.992157 2.822222)
      (xy 0.742399 2.822222)
      (xy 0.796368 2.784016)
      (xy 1.17718 2.703352)
      (xy 1.182449 2.702971)
      (xy 1.621257 2.620409)
      (xy 1.916201 2.484345)
      (xy 2.14703 2.458798)
      (xy 2.383721 2.648209)
      (xy 2.552951 2.945091)
      (xy 2.5814 3.241956)
      (xy 2.514875 3.361988)
      (xy 2.356303 3.455219)
      (xy 2.320492 3.311961)
      (xy 2.238355 3.274445)
      (xy 2.0515 3.422382)
      (xy 1.841903 3.666658)
      (xy 1.691538 3.918159)
      (xy 1.663822 4.025817)
      (xy 1.773327 4.161809)
      (xy 2.058553 4.122496)
      (xy 2.433809 3.937275)
      (xy 2.813399 3.635544)
      (xy 2.819668 3.629301)
      (xy 3.177981 3.313322)
      (xy 3.409702 3.234142)
      (xy 3.537994 3.30711)
      (xy 3.633826 3.440336)
      (xy 3.456982 3.399962)
      (xy 3.444771 3.395342)
      (xy 3.192162 3.406615)
      (xy 3.117319 3.693321)
      (xy 3.134589 3.859804)
      (xy 3.04056 3.965898)
      (xy 3.029739 3.964654)
      (xy 2.68815 3.967185)
      (xy 2.551952 4.082454)
      (xy 2.573203 4.150327)
      (xy 2.785355 4.245456)
      (xy 3.214189 4.305518)
      (xy 3.519912 4.31634)
      (xy 4.364019 4.31634)
      (xy 4.257256 3.16761)
      (xy 4.217193 2.550743)
      (xy 4.215228 2.042789)
      (xy 4.251178 1.756499)
      (xy 4.462996 1.52017)
      (xy 4.764415 1.572165)
      (xy 5.069356 1.867647)
      (xy 5.256023 2.106011)
      (xy 5.294452 2.079458)
      (xy 5.254664 1.90915)
      (xy 5.15952 1.545925)
      (xy 5.026113 1.029692)
      (xy 4.974886 0.830065)
      (xy 4.750725 0.166013)
      (xy 4.980392 0.166013)
      (xy 5.041134 0.30266)
      (xy 5.091068 0.276688)
      (xy 5.110936 0.07967)
      (xy 5.091068 0.055337)
      (xy 4.992373 0.078126)
      (xy 4.980392 0.166013)
      (xy 4.750725 0.166013)
      (xy 4.626002 -0.203463)
      (xy 4.155308 -0.95851)
      (xy 3.516119 -1.473243)
      (xy 2.661752 -1.785827)
      (xy 1.59758 -1.931034)
      (xy 0.766045 -2.007306)
      (xy -0.096428 -2.120055)
      (xy -0.91714 -2.255917)
      (xy -1.623393 -2.401531)
      (xy -2.142488 -2.543531)
      (xy -2.398889 -2.665639)
      (xy -2.691007 -2.80319)
      (xy -2.849891 -2.822222)
      (xy -3.133362 -2.933563)
      (xy -3.521668 -3.216368)
      (xy -3.724226 -3.403268)
      (xy -3.870057 -3.533192)
      (xy -2.64245 -3.533192)
      (xy -2.631322 -3.472511)
      (xy -2.453937 -3.28238)
      (xy -2.061181 -3.018424)
      (xy -1.588549 -2.763487)
      (xy -1.041554 -2.525875)
      (xy -0.49022 -2.363217)
      (xy 0.171446 -2.252208)
      (xy 1.049439 -2.169539)
      (xy 1.144202 -2.162584)
      (xy 2.264908 -2.048737)
      (xy 3.107856 -1.8793)
      (xy 3.725223 -1.635863)
      (xy 4.169188 -1.300015)
      (xy 4.394594 -1.015691)
      (xy 4.625274 -0.707235)
      (xy 4.777773 -0.582167)
      (xy 4.792786 -0.587121)
      (xy 4.748244 -0.751219)
      (xy 4.556011 -1.091224)
      (xy 4.399347 -1.328105)
      (xy 4.117821 -1.697237)
      (xy 3.91106 -1.900829)
      (xy 3.851557 -1.914738)
      (xy 3.702909 -1.95938)
      (xy 3.567029 -2.106319)
      (xy 3.406324 -2.23594)
      (xy 3.107798 -2.327005)
      (xy 2.613002 -2.38935)
      (xy 1.863491 -2.432815)
      (xy 1.558457 -2.444407)
      (xy 0.289854 -2.533201)
      (xy -0.724187 -2.71196)
      (xy -1.553039 -2.997808)
      (xy -2.222754 -3.3777)
      (xy -2.541661 -3.565721)
      (xy -2.64245 -3.533192)
      (xy -3.870057 -3.533192)
      (xy -4.088372 -3.727693)
      (xy -4.396639 -3.937076)
      (xy -4.58898 -4.001788)
      (xy -4.605346 -3.8922)
      (xy -4.565359 -3.818301)
      (xy -4.588808 -3.665786)
      (xy -4.65696 -3.652288)
      (xy -4.683972 -3.564925)
      (xy -4.490049 -3.35197)
      (xy -4.459241 -3.325785)
      (xy -4.221149 -3.100079)
      (xy -4.174318 -2.994634)
      (xy -4.180241 -2.993759)
      (xy -4.212045 -2.852434)
      (xy -4.142692 -2.512867)
      (xy -4.123299 -2.448693)
      (xy -3.968243 -1.89519)
      (xy -3.829018 -1.305715)
      (xy -3.825886 -1.290609)
      (xy -3.76876 -0.860589)
      (xy -3.862594 -0.600873)
      (xy -4.131847 -0.382121)
      (xy -4.478203 -0.191504)
      (xy -4.709462 -0.135737)
      (xy -4.711628 -0.136347)
      (xy -4.944048 -0.12917)
      (xy -5.388297 -0.064016)
      (xy -5.768921 0.008609)
      (xy -6.317231 0.10581)
      (xy -6.648984 0.106249)
      (xy -6.867133 0.00348)
      (xy -6.942591 -0.064907)
      (xy -7.129148 -0.462984)
      (xy -7.185502 -1.133165)
      (xy -7.136143 -1.826144)
      (xy -7.149921 -2.155775)
      (xy -7.224479 -2.607641)
      (xy -7.227662 -2.622117)
      (xy -7.278329 -2.97751)
      (xy -6.896171 -2.97751)
      (xy -6.852231 -2.80353)
      (xy -6.667659 -2.711408)
      (xy -6.437099 -2.594976)
      (xy -6.436222 -2.355419)
      (xy -6.48613 -2.210612)
      (xy -6.574109 -1.853699)
      (xy -6.555996 -1.657671)
      (xy -6.587151 -1.458299)
      (xy -6.647618 -1.406726)
      (xy -6.773412 -1.162927)
      (xy -6.757573 -0.790682)
      (xy -6.625181 -0.448682)
      (xy -6.47451 -0.311379)
      (xy -6.123315 -0.293487)
      (xy -5.945881 -0.352883)
      (xy -5.56106 -0.46727)
      (xy -5.240326 -0.498039)
      (xy -4.90304 -0.579659)
      (xy -4.814379 -0.737261)
      (xy -4.723204 -1.013338)
      (xy -4.663848 -1.069517)
      (xy -4.575032 -1.009635)
      (xy -4.585524 -0.788791)
      (xy -4.626534 -0.539638)
      (xy -4.577888 -0.603328)
      (xy -4.514391 -0.747059)
      (xy -4.413252 -1.243432)
      (xy -4.43431 -2.003127)
      (xy -4.460946 -2.259513)
      (xy -4.561771 -2.504393)
      (xy -4.786972 -2.889209)
      (xy -4.870376 -3.015647)
      (xy -5.106709 -3.446443)
      (xy -5.215647 -3.812387)
      (xy -5.214859 -3.884091)
      (xy -5.220728 -4.085828)
      (xy -5.268097 -4.083973)
      (xy -5.458566 -4.086352)
      (xy -5.56564 -4.153814)
      (xy -5.812129 -4.204958)
      (xy -5.977925 -4.065567)
      (xy -6.10234 -3.883139)
      (xy -5.980682 -3.891406)
      (xy -5.933738 -3.908825)
      (xy -5.668874 -3.925172)
      (xy -5.594405 -3.871122)
      (xy -5.674185 -3.764991)
      (xy -5.98166 -3.701336)
      (xy -6.316424 -3.720307)
      (xy -6.406097 -3.878078)
      (xy -6.395379 -3.96419)
      (xy -6.44136 -4.210204)
      (xy -6.549319 -4.261002)
      (xy -6.721608 -4.145425)
      (xy -6.703693 -3.861617)
      (xy -6.508526 -3.503967)
      (xy -6.433006 -3.413468)
      (xy -6.190282 -3.084101)
      (xy -6.174651 -2.913978)
      (xy -6.383211 -2.942876)
      (xy -6.464435 -2.982843)
      (xy -6.775617 -3.067594)
      (xy -6.896171 -2.97751)
      (xy -7.278329 -2.97751)
      (xy -7.280972 -2.99605)
      (xy -7.201502 -3.124789)
      (xy -7.119293 -3.120157)
      (xy -6.922441 -3.193952)
      (xy -6.856645 -3.448422)
      (xy -6.912182 -3.763533)
      (xy -7.079333 -4.019255)
      (xy -7.197518 -4.086032)
      (xy -7.494249 -4.102347)
      (xy -7.59848 -4.015669)
      (xy -7.7758 -3.912126)
      (xy -7.92358 -3.938846)
      (xy -8.101278 -3.959513)
      (xy -8.058833 -3.82995)
      (xy -8.017466 -3.703744)
      (xy -8.195843 -3.763629)
      (xy -8.291752 -3.813537)
      (xy -8.623342 -3.916806)
      (xy -8.962066 -3.802239)
      (xy -9.087626 -3.724408)
      (xy -9.368642 -3.513933)
      (xy -9.390645 -3.369776)
      (xy -9.242506 -3.237771)
      (xy -9.021814 -2.989425)
      (xy -8.97127 -2.756657)
      (xy -9.112273 -2.656209)
      (xy -9.244452 -2.525487)
      (xy -9.252133 -2.448693)
      (xy -9.28118 -1.861608)
      (xy -9.421364 -1.57689)
      (xy -9.512507 -1.549456)
      (xy -9.707078 -1.674295)
      (xy -9.73955 -1.976918)
      (xy -9.617113 -2.349477)
      (xy -9.442856 -2.594373)
      (xy -9.23128 -2.895185)
      (xy -9.296122 -3.070844)
      (xy -9.298712 -3.072466)
      (xy -9.478736 -3.125658)
      (xy -9.626182 -3.009081)
      (xy -9.75724 -2.68249)
      (xy -9.888099 -2.105644)
      (xy -10.033888 -1.245098)
      (xy -10.273159 0.146289)
      (xy -10.516872 1.245531)
      (xy -10.781034 2.092306)
      (xy -11.081652 2.726293)
      (xy -11.434733 3.187171)
      (xy -11.856285 3.514618)
      (xy -11.98219 3.584406)
      (xy -12.306326 3.775201)
      (xy -12.450523 3.90592)
      (xy -12.45098 3.909833)
      (xy -14.811702 3.909833)
      (xy -13.953134 3.767139)
      (xy -13.289036 3.524911)
      (xy -13.098059 3.378259)
      (xy -12.254042 3.378259)
      (xy -12.186317 3.39864)
      (xy -11.928175 3.259836)
      (xy -11.893489 3.237422)
      (xy -11.5781 2.929137)
      (xy -11.234415 2.443329)
      (xy -11.044593 2.09968)
      (xy -10.762686 1.344246)
      (xy -10.514299 0.318341)
      (xy -10.360844 -0.581705)
      (xy -10.221653 -1.409612)
      (xy -10.056724 -2.192463)
      (xy -9.89 -2.824612)
      (xy -9.785769 -3.119217)
      (xy -9.456107 -3.650599)
      (xy -8.965163 -4.046246)
      (xy -8.268498 -4.325927)
      (xy -7.321671 -4.509409)
      (xy -6.474625 -4.592021)
      (xy -5.728133 -4.660945)
      (xy -5.312875 -4.738802)
      (xy -5.228154 -4.826496)
      (xy -5.473275 -4.92493)
      (xy -6.047542 -5.03501)
      (xy -6.124658 -5.046939)
      (xy -6.830574 -5.050471)
      (xy -7.65242 -4.898502)
      (xy -8.485992 -4.627114)
      (xy -9.227083 -4.272388)
      (xy -9.771488 -3.870403)
      (xy -9.88049 -3.746495)
      (xy -10.309938 -3.005233)
      (xy -10.714595 -1.93911)
      (xy -11.095313 -0.545639)
      (xy -11.302427 0.398459)
      (xy -11.527008 1.4031)
      (xy -11.758577 2.20062)
      (xy -12.03652 2.914343)
      (xy -12.254042 3.378259)
      (xy -13.098059 3.378259)
      (xy -12.792792 3.143844)
      (xy -12.416698 2.581131)
      (xy -12.113053 1.793964)
      (xy -11.834156 0.739534)
      (xy -11.705787 0.174446)
      (xy -11.318563 -1.304914)
      (xy -10.866725 -2.555187)
      (xy -10.363776 -3.547551)
      (xy -9.823217 -4.253185)
      (xy -9.510662 -4.511334)
      (xy -8.56276 -5.006994)
      (xy -7.517601 -5.345177)
      (xy -6.525416 -5.478032)
      (xy -6.47451 -5.478432)
    ) (layer "F.Cu") (width 0) (fill solid) (tstamp e87a8e18-60cf-48ad-bd25-79a1dc5f2966))
  (fp_poly (pts
      (xy -5.723058 1.360166)
      (xy -5.772878 1.483659)
      (xy -5.927807 1.566451)
      (xy -6.121758 1.616995)
      (xy -6.04219 1.495382)
      (xy -6.020741 1.473517)
      (xy -5.803078 1.342386)
    ) (layer "F.Cu") (width 0) (fill solid) (tstamp eb4092ac-99dc-4b46-967a-509516e8ed16))
  (fp_poly (pts
      (xy -9.568351 -1.323036)
      (xy -9.592736 -1.147425)
      (xy -9.725338 -0.922584)
      (xy -9.899782 -0.735068)
      (xy -9.958242 -0.756832)
      (xy -9.883549 -1.010323)
      (xy -9.72832 -1.247424)
      (xy -9.585241 -1.333533)
    ) (layer "F.Cu") (width 0) (fill solid) (tstamp edc81be3-0355-4cdd-b39f-29200f4a4f10))
  (fp_poly (pts
      (xy -1.140573 0.428332)
      (xy -1.057959 0.602648)
      (xy -1.207028 0.772243)
      (xy -1.441236 0.830065)
      (xy -1.609281 0.785041)
      (xy -1.510029 0.600376)
      (xy -1.495634 0.582873)
      (xy -1.260622 0.419308)
    ) (layer "F.Mask") (width 0) (fill solid) (tstamp 0a6acf54-e9fa-4886-b9b2-53ceea962ace))
  (fp_poly (pts
      (xy 4.482353 0.581046)
      (xy 4.399347 0.664052)
      (xy 4.31634 0.581046)
      (xy 4.399347 0.498039)
    ) (layer "F.Mask") (width 0) (fill solid) (tstamp 0e7caeb4-9034-406f-9f74-d5a30973e6cc))
  (fp_poly (pts
      (xy -1.992157 2.075163)
      (xy -2.075163 2.15817)
      (xy -2.15817 2.075163)
      (xy -2.075163 1.992157)
    ) (layer "F.Mask") (width 0) (fill solid) (tstamp 11649d69-8872-453e-b6fe-a39ef15e003f))
  (fp_poly (pts
      (xy -7.636601 -0.24902)
      (xy -7.719608 -0.166013)
      (xy -7.802614 -0.24902)
      (xy -7.719608 -0.332026)
    ) (layer "F.Mask") (width 0) (fill solid) (tstamp 12563070-162b-49fe-9ea0-22682782c31c))
  (fp_poly (pts
      (xy -5.923817 -2.260413)
      (xy -5.917691 -2.010333)
      (xy -6.042383 -1.872289)
      (xy -6.200764 -1.952205)
      (xy -6.203065 -1.955872)
      (xy -6.20318 -2.075164)
      (xy -6.142483 -2.075164)
      (xy -6.059477 -1.992157)
      (xy -5.97647 -2.075164)
      (xy -6.059477 -2.15817)
      (xy -6.142483 -2.075164)
      (xy -6.20318 -2.075164)
      (xy -6.2033 -2.199222)
      (xy -6.154632 -2.304526)
      (xy -6.022217 -2.418397)
    ) (layer "F.Mask") (width 0) (fill solid) (tstamp 1705c65e-85a3-4693-8143-b2029aa1b3f8))
  (fp_poly (pts
      (xy -6.142483 3.403268)
      (xy -6.22549 3.486274)
      (xy -6.308497 3.403268)
      (xy -6.22549 3.320261)
    ) (layer "F.Mask") (width 0) (fill solid) (tstamp 1b67e2a3-3e7d-4670-8844-bbe56a8b3324))
  (fp_poly (pts
      (xy -9.35207 -0.774728)
      (xy -9.374858 -0.676033)
      (xy -9.462745 -0.664052)
      (xy -9.599392 -0.724794)
      (xy -9.57342 -0.774728)
      (xy -9.376402 -0.794596)
    ) (layer "F.Mask") (width 0) (fill solid) (tstamp 1f9f564c-83e0-4dd8-af26-da65d8c28d3e))
  (fp_poly (pts
      (xy -8.13464 -3.237255)
      (xy -8.217647 -3.154249)
      (xy -8.300653 -3.237255)
      (xy -8.217647 -3.320262)
    ) (layer "F.Mask") (width 0) (fill solid) (tstamp 214108ef-99e3-4bf5-937f-f0f9ec4226fa))
  (fp_poly (pts
      (xy -9.546587 -0.186036)
      (xy -9.497232 0.172927)
      (xy -9.495948 0.249019)
      (xy -9.568064 0.655577)
      (xy -9.743481 0.84681)
      (xy -9.960795 0.774291)
      (xy -10.036701 0.675523)
      (xy -10.027476 0.581046)
      (xy -9.960784 0.581046)
      (xy -9.877778 0.664052)
      (xy -9.794771 0.581046)
      (xy -9.877778 0.498039)
      (xy -9.960784 0.581046)
      (xy -10.027476 0.581046)
      (xy -10.015882 0.462308)
      (xy -9.963492 0.416706)
      (xy -9.821711 0.180986)
      (xy -9.794771 -0.009798)
      (xy -9.730431 -0.274306)
      (xy -9.645359 -0.332026)
    ) (layer "F.Mask") (width 0) (fill solid) (tstamp 28e947db-4c27-407c-b890-6c8ef8c19ea5))
  (fp_poly (pts
      (xy -2.04284 0.752271)
      (xy -2.13757 0.874335)
      (xy -2.277153 0.979246)
      (xy -2.242321 0.812898)
      (xy -2.230503 0.781402)
      (xy -2.098988 0.578112)
      (xy -2.024218 0.576653)
    ) (layer "F.Mask") (width 0) (fill solid) (tstamp 38a047d4-46e1-49b9-bf9e-dcb6d0d325e0))
  (fp_poly (pts
      (xy -7.861717 -2.863379)
      (xy -7.63511 -2.672589)
      (xy -7.616931 -2.603519)
      (xy -7.668262 -2.076175)
      (xy -7.901624 -1.750947)
      (xy -8.251334 -1.669081)
      (xy -8.651708 -1.871821)
      (xy -8.703828 -1.921009)
      (xy -8.889756 -2.221281)
      (xy -8.611456 -2.221281)
      (xy -8.516265 -2.097093)
      (xy -8.246452 -2.018797)
      (xy -7.952848 -2.126776)
      (xy -7.850957 -2.261928)
      (xy -7.942382 -2.401866)
      (xy -8.21073 -2.448693)
      (xy -8.562823 -2.389852)
      (xy -8.611456 -2.221281)
      (xy -8.889756 -2.221281)
      (xy -8.942446 -2.306375)
      (xy -8.859479 -2.642711)
      (xy -8.626409 -2.825578)
      (xy -8.236952 -2.924231)
    ) (layer "F.Mask") (width 0) (fill solid) (tstamp 3b83372b-e24a-47d7-bdc4-ed4dfbccc9f6))
  (fp_poly (pts
      (xy -10.306594 2.40689)
      (xy -10.430478 2.690394)
      (xy -10.619936 2.94473)
      (xy -10.821204 3.229819)
      (xy -10.749417 3.375886)
      (xy -10.744446 3.37796)
      (xy -10.718693 3.444377)
      (xy -10.910149 3.473168)
      (xy -11.1794 3.414684)
      (xy -11.187836 3.250091)
      (xy -10.960394 2.977462)
      (xy -10.86102 2.923275)
      (xy -10.64844 2.703468)
      (xy -10.624836 2.58821)
      (xy -10.5257 2.303341)
      (xy -10.458823 2.241176)
      (xy -10.309059 2.226656)
    ) (layer "F.Mask") (width 0) (fill solid) (tstamp 50de9d39-c7c9-4b2e-8cad-fd8bff28e95e))
  (fp_poly (pts
      (xy 15.439216 4.731372)
      (xy 15.356209 4.814379)
      (xy 15.273203 4.731372)
      (xy 15.356209 4.648366)
    ) (layer "F.Mask") (width 0) (fill solid) (tstamp 5221f2bd-fab0-41b7-8b4f-47d3e7ff6da5))
  (fp_poly (pts
      (xy -0.389092 0.267719)
      (xy -0.415032 0.332026)
      (xy -0.564213 0.4904)
      (xy -0.590843 0.498039)
      (xy -0.662149 0.369596)
      (xy -0.664052 0.332026)
      (xy -0.536429 0.172392)
      (xy -0.488241 0.166013)
    ) (layer "F.Mask") (width 0) (fill solid) (tstamp 5e51d126-45d8-4716-ae86-0b862afa7c62))
  (fp_poly (pts
      (xy -1.404995 1.638826)
      (xy -1.420118 1.674704)
      (xy -1.64931 1.809566)
      (xy -1.780603 1.826144)
      (xy -1.952399 1.771815)
      (xy -1.932014 1.710663)
      (xy -1.717201 1.59048)
      (xy -1.494146 1.563206)
    ) (layer "F.Mask") (width 0) (fill solid) (tstamp 61af002a-5ee4-4d64-bd5e-c3178123122d))
  (fp_poly (pts
      (xy -1.053145 -0.23032)
      (xy -1.079085 -0.166013)
      (xy -1.228265 -0.007639)
      (xy -1.254895 0)
      (xy -1.326201 -0.128443)
      (xy -1.328104 -0.166013)
      (xy -1.200481 -0.325647)
      (xy -1.152294 -0.332026)
    ) (layer "F.Mask") (width 0) (fill solid) (tstamp 6737c8ee-99fe-4c76-88a5-c9b97cd7019f))
  (fp_poly (pts
      (xy -0.830065 -0.581046)
      (xy -0.913072 -0.498039)
      (xy -0.996078 -0.581046)
      (xy -0.913072 -0.664052)
    ) (layer "F.Mask") (width 0) (fill solid) (tstamp 77212986-5f37-4dfe-908e-c1af1433d149))
  (fp_poly (pts
      (xy -9.130719 0.415032)
      (xy -9.213725 0.498039)
      (xy -9.296732 0.415032)
      (xy -9.213725 0.332026)
    ) (layer "F.Mask") (width 0) (fill solid) (tstamp 7ddf17dc-6fd1-4144-bfce-89305fdf1b46))
  (fp_poly (pts
      (xy -4.814379 0.249019)
      (xy -4.897385 0.332026)
      (xy -4.980392 0.249019)
      (xy -4.897385 0.166013)
    ) (layer "F.Mask") (width 0) (fill solid) (tstamp 86095b14-ca87-48e0-8138-482f224a1ba4))
  (fp_poly (pts
      (xy -8.552282 -3.490495)
      (xy -8.549884 -3.301739)
      (xy -8.747274 -3.240013)
      (xy -8.945048 -3.308113)
      (xy -9.026877 -3.403268)
      (xy -8.798693 -3.403268)
      (xy -8.715686 -3.320262)
      (xy -8.63268 -3.403268)
      (xy -8.715686 -3.486275)
      (xy -8.798693 -3.403268)
      (xy -9.026877 -3.403268)
      (xy -9.058919 -3.440528)
      (xy -8.900935 -3.538928)
      (xy -8.631367 -3.550366)
    ) (layer "F.Mask") (width 0) (fill solid) (tstamp 8752940a-6989-410a-a8a5-a49c1920631d))
  (fp_poly (pts
      (xy 3.367733 -2.203383)
      (xy 3.403268 -2.15817)
      (xy 3.461701 -2.008857)
      (xy 3.304634 -2.065092)
      (xy 3.154249 -2.15817)
      (xy 3.026621 -2.291442)
      (xy 3.102948 -2.321641)
    ) (layer "F.Mask") (width 0) (fill solid) (tstamp 88c6d81c-66fa-4a3a-b105-12a4e4586b68))
  (fp_poly (pts
      (xy -5.696529 -3.047013)
      (xy -5.727451 -2.988235)
      (xy -5.883871 -2.829693)
      (xy -5.913059 -2.822222)
      (xy -5.924386 -2.929458)
      (xy -5.893464 -2.988235)
      (xy -5.737044 -3.146778)
      (xy -5.707856 -3.154249)
    ) (layer "F.Mask") (width 0) (fill solid) (tstamp 8ad172fc-b044-433e-857a-cf95bbf92f0b))
  (fp_poly (pts
      (xy -8.798693 0.083006)
      (xy -8.881699 0.166013)
      (xy -8.964706 0.083006)
      (xy -8.881699 0)
    ) (layer "F.Mask") (width 0) (fill solid) (tstamp 91c48e4c-a585-464c-bc94-e70888e4fe70))
  (fp_poly (pts
      (xy -7.636601 -1.577124)
      (xy -7.719608 -1.494118)
      (xy -7.802614 -1.577124)
      (xy -7.719608 -1.660131)
    ) (layer "F.Mask") (width 0) (fill solid) (tstamp 9f02fbcf-a468-4c8a-8bf6-3edf554c7296))
  (fp_poly (pts
      (xy -1.546202 2.265406)
      (xy -1.577124 2.324183)
      (xy -1.733544 2.482726)
      (xy -1.762732 2.490196)
      (xy -1.774059 2.38296)
      (xy -1.743137 2.324183)
      (xy -1.586717 2.16564)
      (xy -1.557529 2.15817)
    ) (layer "F.Mask") (width 0) (fill solid) (tstamp c45d22d5-738d-45a4-b6a5-124d55f76785))
  (fp_poly (pts
      (xy -8.637764 -0.913072)
      (xy -8.720423 -0.64025)
      (xy -8.798693 -0.498039)
      (xy -8.930237 -0.365159)
      (xy -8.959621 -0.415033)
      (xy -8.876962 -0.687855)
      (xy -8.798693 -0.830066)
      (xy -8.667149 -0.962946)
    ) (layer "F.Mask") (width 0) (fill solid) (tstamp c5e62361-2eba-4e0d-a151-e1fb88eae2b4))
  (fp_poly (pts
      (xy 17.738634 4.068254)
      (xy 17.690763 4.329837)
      (xy 17.625007 4.443344)
      (xy 17.448063 4.568573)
      (xy 17.37853 4.540185)
      (xy 17.264694 4.273219)
      (xy 17.358931 4.040898)
      (xy 17.514379 3.984314)
    ) (layer "F.Mask") (width 0) (fill solid) (tstamp c90bf4c6-340e-4ed7-9989-23fbf63bd2fc))
  (fp_poly (pts
      (xy -1.660131 0.415032)
      (xy -1.743137 0.498039)
      (xy -1.826144 0.415032)
      (xy -1.743137 0.332026)
    ) (layer "F.Mask") (width 0) (fill solid) (tstamp cb9267bf-ea27-4b56-94c2-f368254f2009))
  (fp_poly (pts
      (xy -9.186056 -0.110676)
      (xy -9.166188 0.086343)
      (xy -9.186056 0.110675)
      (xy -9.284751 0.087887)
      (xy -9.296732 0)
      (xy -9.23599 -0.136648)
    ) (layer "F.Mask") (width 0) (fill solid) (tstamp d1feabe6-71a4-4ded-ae26-cc409eb773a2))
  (fp_poly (pts
      (xy -4.766908 2.27897)
      (xy -4.731372 2.324183)
      (xy -4.67294 2.473496)
      (xy -4.830006 2.417261)
      (xy -4.980392 2.324183)
      (xy -5.10802 2.190911)
      (xy -5.031693 2.160712)
    ) (layer "F.Mask") (width 0) (fill solid) (tstamp da4bfdd9-0c12-4e08-bacb-aeb157cd303d))
  (fp_poly (pts
      (xy 0.498039 2.905229)
      (xy 0.415033 2.988235)
      (xy 0.332026 2.905229)
      (xy 0.415033 2.822222)
    ) (layer "F.Mask") (width 0) (fill solid) (tstamp e054443f-ea04-4571-96f0-e5aa771ae0ba))
  (fp_poly (pts
      (xy -5.944665 -5.436955)
      (xy -5.373279 -5.329333)
      (xy -4.843391 -5.180773)
      (xy -4.438039 -5.016485)
      (xy -4.240262 -4.861678)
      (xy -4.241829 -4.800632)
      (xy -4.197755 -4.725781)
      (xy -4.048709 -4.761486)
      (xy -3.8555 -4.793802)
      (xy -3.899724 -4.650928)
      (xy -3.94603 -4.509823)
      (xy -3.834369 -4.555429)
      (xy -3.579381 -4.54709)
      (xy -3.176898 -4.369932)
      (xy -3.011886 -4.26869)
      (xy -2.086606 -3.69228)
      (xy -1.289104 -3.297984)
      (xy -0.50046 -3.045699)
      (xy 0.398249 -2.895324)
      (xy 1.28065 -2.821183)
      (xy 2.117639 -2.761635)
      (xy 2.700877 -2.694914)
      (xy 3.108462 -2.603086)
      (xy 3.418496 -2.468219)
      (xy 3.709076 -2.272382)
      (xy 3.725641 -2.259795)
      (xy 4.338184 -1.651601)
      (xy 4.848973 -0.822384)
      (xy 5.281325 0.270639)
      (xy 5.486634 0.971502)
      (xy 5.891678 2.144643)
      (xy 6.409365 3.076685)
      (xy 7.018414 3.734172)
      (xy 7.394852 3.97161)
      (xy 7.643872 4.053295)
      (xy 8.035179 4.115968)
      (xy 8.607147 4.161847)
      (xy 9.398154 4.193151)
      (xy 10.446574 4.212098)
      (xy 11.703607 4.22063)
      (xy 12.935212 4.223121)
      (xy 13.883903 4.2188)
      (xy 14.598781 4.203836)
      (xy 15.128945 4.174404)
      (xy 15.523496 4.126675)
      (xy 15.831533 4.056822)
      (xy 16.102156 3.961015)
      (xy 16.331888 3.859804)
      (xy 17.041175 3.581473)
      (xy 17.576237 3.504475)
      (xy 18.023058 3.623909)
      (xy 18.233977 3.751346)
      (xy 18.531557 4.110514)
      (xy 18.561439 4.454936)
      (xy 18.472165 4.754134)
      (xy 18.229765 4.921761)
      (xy 17.846405 5.015233)
      (xy 17.432163 5.066824)
      (xy 16.816063 5.104257)
      (xy 15.97756 5.127665)
      (xy 14.896107 5.137181)
      (xy 13.551159 5.13294)
      (xy 11.92217 5.115075)
      (xy 9.988593 5.083719)
      (xy 9.296732 5.070753)
      (xy 7.31843 5.037867)
      (xy 5.223987 5.012583)
      (xy 3.054411 4.994764)
      (xy 0.850711 4.984275)
      (xy -1.346104 4.980979)
      (xy -3.495024 4.984742)
      (xy -5.55504 4.995427)
      (xy -7.485144 5.0129)
      (xy -9.244326 5.037024)
      (xy -10.791577 5.067663)
      (xy -12.085889 5.104682)
      (xy -13.024178 5.144586)
      (xy -14.600558 5.218002)
      (xy -15.998981 5.262428)
      (xy -17.192215 5.278065)
      (xy -18.153026 5.265113)
      (xy -18.854183 5.223775)
      (xy -19.268454 5.154253)
      (xy -19.368944 5.09763)
      (xy -19.349135 4.858443)
      (xy -19.200688 4.713318)
      (xy -17.177688 4.713318)
      (xy -17.029252 4.759966)
      (xy -16.583646 4.788374)
      (xy -15.964924 4.80011)
      (xy -15.206896 4.795838)
      (xy -14.737757 4.762452)
      (xy -14.515205 4.694418)
      (xy -14.501715 4.651426)
      (xy -14.360131 4.651426)
      (xy -14.157307 4.620824)
      (xy -11.705623 4.620824)
      (xy -11.697977 4.657983)
      (xy -11.476402 4.742526)
      (xy -10.974132 4.786018)
      (xy -10.239927 4.788644)
      (xy -9.322547 4.75059)
      (xy -8.40084 4.681756)
      (xy -5.928129 4.681756)
      (xy -5.723754 4.714535)
      (xy -5.255802 4.743118)
      (xy -4.577871 4.767201)
      (xy -3.743564 4.786479)
      (xy -2.80648 4.800649)
      (xy -1.82022 4.809406)
      (xy -0.838384 4.812445)
      (xy 0.085426 4.809464)
      (xy 0.897612 4.800157)
      (xy 1.544571 4.78422)
      (xy 1.972704 4.76135)
      (xy 2.12841 4.731242)
      (xy 2.126594 4.727465)
      (xy 1.957004 4.703704)
      (xy 3.209586 4.703704)
      (xy 3.232375 4.802398)
      (xy 3.320262 4.814379)
      (xy 3.456909 4.753637)
      (xy 3.45615 4.752178)
      (xy 3.961277 4.752178)
      (xy 4.18178 4.78092)
      (xy 4.233334 4.782015)
      (xy 4.501767 4.765025)
      (xy 4.918034 4.765025)
      (xy 5.146405 4.788166)
      (xy 5.382083 4.762077)
      (xy 5.371638 4.740697)
      (xy 5.844893 4.740697)
      (xy 6.044432 4.768207)
      (xy 6.22549 4.772513)
      (xy 6.567159 4.75915)
      (xy 6.632272 4.731372)
      (xy 8.300654 4.731372)
      (xy 8.38366 4.814379)
      (xy 8.466667 4.731372)
      (xy 8.438999 4.703704)
      (xy 9.35207 4.703704)
      (xy 9.374858 4.802398)
      (xy 9.462745 4.814379)
      (xy 9.599393 4.753637)
      (xy 9.587812 4.731372)
      (xy 11.786928 4.731372)
      (xy 11.869935 4.814379)
      (xy 11.952941 4.731372)
      (xy 11.95271 4.731141)
      (xy 15.106925 4.731141)
      (xy 15.213344 4.85473)
      (xy 15.637428 4.907932)
      (xy 16.382642 4.89179)
      (xy 16.476798 4.88629)
      (xy 17.151546 4.83682)
      (xy 17.72212 4.780059)
      (xy 18.087861 4.726435)
      (xy 18.136928 4.71431)
      (xy 18.41031 4.525538)
      (xy 18.436492 4.260203)
      (xy 18.263829 3.993033)
      (xy 17.940674 3.798757)
      (xy 17.515383 3.752101)
      (xy 17.514379 3.752216)
      (xy 17.149224 3.837481)
      (xy 16.611025 4.008449)
      (xy 16.031171 4.218297)
      (xy 15.541049 4.4202)
      (xy 15.314706 4.536122)
      (xy 15.106925 4.731141)
      (xy 11.95271 4.731141)
      (xy 11.869935 4.648366)
      (xy 11.786928 4.731372)
      (xy 9.587812 4.731372)
      (xy 9.573421 4.703704)
      (xy 9.376402 4.683835)
      (xy 9.35207 4.703704)
      (xy 8.438999 4.703704)
      (xy 8.38366 4.648366)
      (xy 8.300654 4.731372)
      (xy 6.632272 4.731372)
      (xy 6.655345 4.721529)
      (xy 6.600955 4.700315)
      (xy 6.202286 4.669392)
      (xy 5.936903 4.696964)
      (xy 5.844893 4.740697)
      (xy 5.371638 4.740697)
      (xy 5.353922 4.704432)
      (xy 5.014035 4.682505)
      (xy 4.938889 4.704432)
      (xy 4.918034 4.765025)
      (xy 4.501767 4.765025)
      (xy 4.516855 4.76407)
      (xy 4.541817 4.712101)
      (xy 4.527016 4.705485)
      (xy 4.197449 4.672644)
      (xy 4.028977 4.699333)
      (xy 3.961277 4.752178)
      (xy 3.45615 4.752178)
      (xy 3.430937 4.703704)
      (xy 3.233918 4.683835)
      (xy 3.209586 4.703704)
      (xy 1.957004 4.703704)
      (xy 1.943322 4.701787)
      (xy 1.474119 4.675599)
      (xy 0.765074 4.650337)
      (xy -0.137725 4.627438)
      (xy -1.188188 4.608341)
      (xy -2.044564 4.597383)
      (xy -3.155953 4.590454)
      (xy -4.13632 4.593639)
      (xy -4.943754 4.606029)
      (xy -5.536347 4.626714)
      (xy -5.872185 4.654783)
      (xy -5.928129 4.681756)
      (xy -8.40084 4.681756)
      (xy -8.270753 4.672041)
      (xy -7.968627 4.643776)
      (xy -7.478019 4.593155)
      (xy -7.232014 4.558775)
      (xy -7.248055 4.539202)
      (xy -7.543587 4.533004)
      (xy -8.136054 4.538746)
      (xy -9.042901 4.554995)
      (xy -9.047712 4.55509)
      (xy -9.974006 4.567918)
      (xy -10.574512 4.563649)
      (xy -10.847587 4.542362)
      (xy -10.791589 4.504142)
      (xy -10.6596 4.482353)
      (xy 4.482353 4.482353)
      (xy 6.338012 4.482353)
      (xy 5.929098 3.996386)
      (xy 5.633961 3.564609)
      (xy 5.31564 2.978273)
      (xy 5.136733 2.585275)
      (xy 4.913305 2.095998)
      (xy 4.720712 1.76066)
      (xy 4.617818 1.660131)
      (xy 4.556602 1.813404)
      (xy 4.509784 2.22242)
      (xy 4.484679 2.81097)
      (xy 4.482353 3.071242)
      (xy 4.482353 4.482353)
      (xy -10.6596 4.482353)
      (xy -10.624836 4.476614)
      (xy -9.921096 4.397272)
      (xy -9.193193 4.343433)
      (xy -8.914566 4.332758)
      (xy -8.424859 4.304047)
      (xy -8.42078 4.302505)
      (xy -5.146267 4.302505)
      (xy -4.988498 4.331939)
      (xy -4.548409 4.357771)
      (xy -3.875704 4.378552)
      (xy -3.020081 4.392832)
      (xy -2.031243 4.399162)
      (xy -1.825981 4.399346)
      (xy -0.695668 4.397534)
      (xy 0.145121 4.389525)
      (xy 0.738882 4.371461)
      (xy 1.128108 4.339485)
      (xy 1.355296 4.289737)
      (xy 1.462938 4.218361)
      (xy 1.493531 4.121497)
      (xy 1.494143 4.097909)
      (xy 1.571508 3.708433)
      (xy 1.678971 3.451071)
      (xy 1.781005 3.206123)
      (xy 1.654788 3.169287)
      (xy 1.471455 3.214223)
      (xy 0.180613 3.419591)
      (xy -1.217615 3.370378)
      (xy -1.992157 3.234942)
      (xy -2.863779 3.040092)
      (xy -3.463041 2.915644)
      (xy -3.840871 2.856322)
      (xy -4.048194 2.856849)
      (xy -4.135939 2.911951)
      (xy -4.154938 3.010896)
      (xy -4.268648 3.262153)
      (xy -4.546639 3.611898)
      (xy -4.652977 3.72146)
      (xy -4.959783 4.0437)
      (xy -5.132406 4.26608)
      (xy -5.146267 4.302505)
      (xy -8.42078 4.302505)
      (xy -8.156917 4.202747)
      (xy -8.000648 3.966737)
      (xy -7.929287 3.776797)
      (xy -7.744962 3.325178)
      (xy -7.471677 2.739574)
      (xy -7.272343 2.345924)
      (xy -7.019452 1.856505)
      (xy -6.914636 1.600144)
      (xy -6.950672 1.51643)
      (xy -7.120338 1.544953)
      (xy -7.178538 1.561331)
      (xy -7.566547 1.664826)
      (xy -8.10685 1.801119)
      (xy -8.342157 1.858625)
      (xy -8.798245 1.995661)
      (xy -9.082996 2.132836)
      (xy -9.130719 2.193794)
      (xy -9.249134 2.42841)
      (xy -9.556561 2.798701)
      (xy -9.981273 3.234776)
      (xy -10.451541 3.666748)
      (xy -10.895638 4.024726)
      (xy -11.21877 4.228322)
      (xy -11.562237 4.437595)
      (xy -11.705623 4.620824)
      (xy -14.157307 4.620824)
      (xy -13.799836 4.566889)
      (xy -13.354 4.508477)
      (xy -13.039223 4.48244)
      (xy -13.029036 4.482353)
      (xy -12.793664 4.348399)
      (xy -12.72526 4.233333)
      (xy -12.284967 4.233333)
      (xy -12.201961 4.31634)
      (xy -12.118954 4.233333)
      (xy -12.201961 4.150327)
      (xy -12.284967 4.233333)
      (xy -12.72526 4.233333)
      (xy -12.718806 4.222477)
      (xy -12.730723 4.062999)
      (xy -12.965825 4.066723)
      (xy -13.447144 4.237656)
      (xy -13.862091 4.4214)
      (xy -14.360131 4.651426)
      (xy -14.501715 4.651426)
      (xy -14.487733 4.606863)
      (xy -14.680783 4.504589)
      (xy -15.108074 4.453836)
      (xy -15.676068 4.453182)
      (xy -16.291228 4.501208)
      (xy -16.860016 4.596491)
      (xy -17.04774 4.645752)
      (xy -17.177688 4.713318)
      (xy -19.200688 4.713318)
      (xy -19.074738 4.590187)
      (xy -18.611213 4.352166)
      (xy -18.504312 4.314312)
      (xy -18.114885 4.229989)
      (xy -17.485116 4.142066)
      (xy -16.706362 4.061669)
      (xy -15.975692 4.006314)
      (xy -14.832785 3.913337)
      (xy -14.811702 3.909833)
      (xy -12.45098 3.909833)
      (xy -12.322873 3.898128)
      (xy -12.007289 3.762558)
      (xy -11.933866 3.72543)
      (xy -11.509839 3.563293)
      (xy -11.254738 3.621418)
      (xy -11.236611 3.63816)
      (xy -11.156961 3.789791)
      (xy -11.283355 3.8183)
      (xy -11.430238 3.87303)
      (xy -11.409398 3.919142)
      (xy -11.216043 3.900902)
      (xy -10.872317 3.702209)
      (xy -10.455953 3.383874)
      (xy -10.044687 3.006709)
      (xy -9.716255 2.631524)
      (xy -9.659507 2.550232)
      (xy -9.306969 2.01243)
      (xy -9.828608 1.96079)
      (xy -10.278766 1.854498)
      (xy -10.360702 1.76828)
      (xy -9.671385 1.76828)
      (xy -9.468571 1.80202)
      (xy -9.368367 1.806886)
      (xy -8.916461 1.77016)
      (xy -8.318389 1.655146)
      (xy -7.957256 1.560185)
      (xy -7.230723 1.312634)
      (xy -6.81959 1.088407)
      (xy -6.708829 0.878294)
      (xy -6.735155 0.811255)
      (xy -6.96943 0.672113)
      (xy -7.290465 0.84183)
      (xy -7.337991 0.887197)
      (xy -7.625869 1.063468)
      (xy -8.134652 1.279889)
      (xy -8.762563 1.498382)
      (xy -9.407827 1.680866)
      (xy -9.545751 1.713239)
      (xy -9.671385 1.76828)
      (xy -10.360702 1.76828)
      (xy -10.427523 1.697966)
      (xy -10.275771 1.556179)
      (xy -9.824407 1.494118)
      (xy -9.822183 1.494117)
      (xy -9.199368 1.458439)
      (xy -8.787314 1.31246)
      (xy -8.593101 1.120554)
      (xy -8.261259 1.120554)
      (xy -8.206596 1.162091)
      (xy -8.022164 1.080565)
      (xy -7.715192 0.894913)
      (xy -7.451275 0.646864)
      (xy -7.413655 0.458774)
      (xy -7.586346 0.413062)
      (xy -7.793158 0.492978)
      (xy -8.023263 0.682991)
      (xy -8.202347 0.929489)
      (xy -8.261259 1.120554)
      (xy -8.593101 1.120554)
      (xy -8.468837 0.997766)
      (xy -8.290473 0.730586)
      (xy -7.988586 0.341449)
      (xy -7.653125 0.184269)
      (xy -7.399772 0.166013)
      (xy -6.842607 0.291588)
      (xy -6.552667 0.503397)
      (xy -6.415089 0.675656)
      (xy -6.36504 0.851111)
      (xy -6.419018 1.100695)
      (xy -6.593523 1.495336)
      (xy -6.905055 2.105967)
      (xy -6.94197 2.177005)
      (xy -7.332969 2.946873)
      (xy -7.556367 3.47325)
      (xy -7.603296 3.804275)
      (xy -7.464887 3.988081)
      (xy -7.132271 4.072807)
      (xy -6.596579 4.106587)
      (xy -6.58638 4.106973)
      (xy -5.78485 4.081955)
      (xy -5.262561 3.927397)
      (xy -4.988455 3.631898)
      (xy -4.948012 3.505378)
      (xy -4.726991 3.088704)
      (xy -4.329369 2.71298)
      (xy -3.89146 2.500516)
      (xy -3.814902 2.488694)
      (xy -3.301357 2.467961)
      (xy -3.071654 2.527579)
      (xy -3.084966 2.678383)
      (xy -3.087094 2.681859)
      (xy -3.106564 2.795881)
      (xy -3.019564 2.758578)
      (xy -2.766787 2.737595)
      (xy -2.315401 2.80633)
      (xy -1.956332 2.896085)
      (xy -1.312246 3.037056)
      (xy -0.648045 3.11102)
      (xy -0.05043 3.116981)
      (xy 0.3939 3.053943)
      (xy 0.596639 2.925409)
      (xy 0.742399 2.822222)
      (xy 1.992157 2.822222)
      (xy 2.052899 2.95887)
      (xy 2.102832 2.932897)
      (xy 2.122701 2.735879)
      (xy 2.102832 2.711547)
      (xy 2.004138 2.734335)
      (xy 1.992157 2.822222)
      (xy 0.742399 2.822222)
      (xy 0.796368 2.784016)
      (xy 1.17718 2.703352)
      (xy 1.182449 2.702971)
      (xy 1.621257 2.620409)
      (xy 1.916201 2.484345)
      (xy 2.14703 2.458798)
      (xy 2.383721 2.648209)
      (xy 2.552951 2.945091)
      (xy 2.5814 3.241956)
      (xy 2.514875 3.361988)
      (xy 2.356303 3.455219)
      (xy 2.320492 3.311961)
      (xy 2.238355 3.274445)
      (xy 2.0515 3.422382)
      (xy 1.841903 3.666658)
      (xy 1.691538 3.918159)
      (xy 1.663822 4.025817)
      (xy 1.773327 4.161809)
      (xy 2.058553 4.122496)
      (xy 2.433809 3.937275)
      (xy 2.813399 3.635544)
      (xy 2.819668 3.629301)
      (xy 3.177981 3.313322)
      (xy 3.409702 3.234142)
      (xy 3.537994 3.30711)
      (xy 3.633826 3.440336)
      (xy 3.456982 3.399962)
      (xy 3.444771 3.395342)
      (xy 3.192162 3.406615)
      (xy 3.117319 3.693321)
      (xy 3.134589 3.859804)
      (xy 3.04056 3.965898)
      (xy 3.029739 3.964654)
      (xy 2.68815 3.967185)
      (xy 2.551952 4.082454)
      (xy 2.573203 4.150327)
      (xy 2.785355 4.245456)
      (xy 3.214189 4.305518)
      (xy 3.519912 4.31634)
      (xy 4.364019 4.31634)
      (xy 4.257256 3.16761)
      (xy 4.217193 2.550743)
      (xy 4.215228 2.042789)
      (xy 4.251178 1.756499)
      (xy 4.462996 1.52017)
      (xy 4.764415 1.572165)
      (xy 5.069356 1.867647)
      (xy 5.256023 2.106011)
      (xy 5.294452 2.079458)
      (xy 5.254664 1.90915)
      (xy 5.15952 1.545925)
      (xy 5.026113 1.029692)
      (xy 4.974886 0.830065)
      (xy 4.750725 0.166013)
      (xy 4.980392 0.166013)
      (xy 5.041134 0.30266)
      (xy 5.091068 0.276688)
      (xy 5.110936 0.07967)
      (xy 5.091068 0.055337)
      (xy 4.992373 0.078126)
      (xy 4.980392 0.166013)
      (xy 4.750725 0.166013)
      (xy 4.626002 -0.203463)
      (xy 4.155308 -0.95851)
      (xy 3.516119 -1.473243)
      (xy 2.661752 -1.785827)
      (xy 1.59758 -1.931034)
      (xy 0.766045 -2.007306)
      (xy -0.096428 -2.120055)
      (xy -0.91714 -2.255917)
      (xy -1.623393 -2.401531)
      (xy -2.142488 -2.543531)
      (xy -2.398889 -2.665639)
      (xy -2.691007 -2.80319)
      (xy -2.849891 -2.822222)
      (xy -3.133362 -2.933563)
      (xy -3.521668 -3.216368)
      (xy -3.724226 -3.403268)
      (xy -3.870057 -3.533192)
      (xy -2.64245 -3.533192)
      (xy -2.631322 -3.472511)
      (xy -2.453937 -3.28238)
      (xy -2.061181 -3.018424)
      (xy -1.588549 -2.763487)
      (xy -1.041554 -2.525875)
      (xy -0.49022 -2.363217)
      (xy 0.171446 -2.252208)
      (xy 1.049439 -2.169539)
      (xy 1.144202 -2.162584)
      (xy 2.264908 -2.048737)
      (xy 3.107856 -1.8793)
      (xy 3.725223 -1.635863)
      (xy 4.169188 -1.300015)
      (xy 4.394594 -1.015691)
      (xy 4.625274 -0.707235)
      (xy 4.777773 -0.582167)
      (xy 4.792786 -0.587121)
      (xy 4.748244 -0.751219)
      (xy 4.556011 -1.091224)
      (xy 4.399347 -1.328105)
      (xy 4.117821 -1.697237)
      (xy 3.91106 -1.900829)
      (xy 3.851557 -1.914738)
      (xy 3.702909 -1.95938)
      (xy 3.567029 -2.106319)
      (xy 3.406324 -2.23594)
      (xy 3.107798 -2.327005)
      (xy 2.613002 -2.38935)
      (xy 1.863491 -2.432815)
      (xy 1.558457 -2.444407)
      (xy 0.289854 -2.533201)
      (xy -0.724187 -2.71196)
      (xy -1.553039 -2.997808)
      (xy -2.222754 -3.3777)
      (xy -2.541661 -3.565721)
      (xy -2.64245 -3.533192)
      (xy -3.870057 -3.533192)
      (xy -4.088372 -3.727693)
      (xy -4.396639 -3.937076)
      (xy -4.58898 -4.001788)
      (xy -4.605346 -3.8922)
      (xy -4.565359 -3.818301)
      (xy -4.588808 -3.665786)
      (xy -4.65696 -3.652288)
      (xy -4.683972 -3.564925)
      (xy -4.490049 -3.35197)
      (xy -4.459241 -3.325785)
      (xy -4.221149 -3.100079)
      (xy -4.174318 -2.994634)
      (xy -4.180241 -2.993759)
      (xy -4.212045 -2.852434)
      (xy -4.142692 -2.512867)
      (xy -4.123299 -2.448693)
      (xy -3.968243 -1.89519)
      (xy -3.829018 -1.305715)
      (xy -3.825886 -1.290609)
      (xy -3.76876 -0.860589)
      (xy -3.862594 -0.600873)
      (xy -4.131847 -0.382121)
      (xy -4.478203 -0.191504)
      (xy -4.709462 -0.135737)
      (xy -4.711628 -0.136347)
      (xy -4.944048 -0.12917)
      (xy -5.388297 -0.064016)
      (xy -5.768921 0.008609)
      (xy -6.317231 0.10581)
      (xy -6.648984 0.106249)
      (xy -6.867133 0.00348)
      (xy -6.942591 -0.064907)
      (xy -7.129148 -0.462984)
      (xy -7.185502 -1.133165)
      (xy -7.136143 -1.826144)
      (xy -7.149921 -2.155775)
      (xy -7.224479 -2.607641)
      (xy -7.227662 -2.622117)
      (xy -7.278329 -2.97751)
      (xy -6.896171 -2.97751)
      (xy -6.852231 -2.80353)
      (xy -6.667659 -2.711408)
      (xy -6.437099 -2.594976)
      (xy -6.436222 -2.355419)
      (xy -6.48613 -2.210612)
      (xy -6.574109 -1.853699)
      (xy -6.555996 -1.657671)
      (xy -6.587151 -1.458299)
      (xy -6.647618 -1.406726)
      (xy -6.773412 -1.162927)
      (xy -6.757573 -0.790682)
      (xy -6.625181 -0.448682)
      (xy -6.47451 -0.311379)
      (xy -6.123315 -0.293487)
      (xy -5.945881 -0.352883)
      (xy -5.56106 -0.46727)
      (xy -5.240326 -0.498039)
      (xy -4.90304 -0.579659)
      (xy -4.814379 -0.737261)
      (xy -4.723204 -1.013338)
      (xy -4.663848 -1.069517)
      (xy -4.575032 -1.009635)
      (xy -4.585524 -0.788791)
      (xy -4.626534 -0.539638)
      (xy -4.577888 -0.603328)
      (xy -4.514391 -0.747059)
      (xy -4.413252 -1.243432)
      (xy -4.43431 -2.003127)
      (xy -4.460946 -2.259513)
      (xy -4.561771 -2.504393)
      (xy -4.786972 -2.889209)
      (xy -4.870376 -3.015647)
      (xy -5.106709 -3.446443)
      (xy -5.215647 -3.812387)
      (xy -5.214859 -3.884091)
      (xy -5.220728 -4.085828)
      (xy -5.268097 -4.083973)
      (xy -5.458566 -4.086352)
      (xy -5.56564 -4.153814)
      (xy -5.812129 -4.204958)
      (xy -5.977925 -4.065567)
      (xy -6.10234 -3.883139)
      (xy -5.980682 -3.891406)
      (xy -5.933738 -3.908825)
      (xy -5.668874 -3.925172)
      (xy -5.594405 -3.871122)
      (xy -5.674185 -3.764991)
      (xy -5.98166 -3.701336)
      (xy -6.316424 -3.720307)
      (xy -6.406097 -3.878078)
      (xy -6.395379 -3.96419)
      (xy -6.44136 -4.210204)
      (xy -6.549319 -4.261002)
      (xy -6.721608 -4.145425)
      (xy -6.703693 -3.861617)
      (xy -6.508526 -3.503967)
      (xy -6.433006 -3.413468)
      (xy -6.190282 -3.084101)
      (xy -6.174651 -2.913978)
      (xy -6.383211 -2.942876)
      (xy -6.464435 -2.982843)
      (xy -6.775617 -3.067594)
      (xy -6.896171 -2.97751)
      (xy -7.278329 -2.97751)
      (xy -7.280972 -2.99605)
      (xy -7.201502 -3.124789)
      (xy -7.119293 -3.120157)
      (xy -6.922441 -3.193952)
      (xy -6.856645 -3.448422)
      (xy -6.912182 -3.763533)
      (xy -7.079333 -4.019255)
      (xy -7.197518 -4.086032)
      (xy -7.494249 -4.102347)
      (xy -7.59848 -4.015669)
      (xy -7.7758 -3.912126)
      (xy -7.92358 -3.938846)
      (xy -8.101278 -3.959513)
      (xy -8.058833 -3.82995)
      (xy -8.017466 -3.703744)
      (xy -8.195843 -3.763629)
      (xy -8.291752 -3.813537)
      (xy -8.623342 -3.916806)
      (xy -8.962066 -3.802239)
      (xy -9.087626 -3.724408)
      (xy -9.368642 -3.513933)
      (xy -9.390645 -3.369776)
      (xy -9.242506 -3.237771)
      (xy -9.021814 -2.989425)
      (xy -8.97127 -2.756657)
      (xy -9.112273 -2.656209)
      (xy -9.244452 -2.525487)
      (xy -9.252133 -2.448693)
      (xy -9.28118 -1.861608)
      (xy -9.421364 -1.57689)
      (xy -9.512507 -1.549456)
      (xy -9.707078 -1.674295)
      (xy -9.73955 -1.976918)
      (xy -9.617113 -2.349477)
      (xy -9.442856 -2.594373)
      (xy -9.23128 -2.895185)
      (xy -9.296122 -3.070844)
      (xy -9.298712 -3.072466)
      (xy -9.478736 -3.125658)
      (xy -9.626182 -3.009081)
      (xy -9.75724 -2.68249)
      (xy -9.888099 -2.105644)
      (xy -10.033888 -1.245098)
      (xy -10.273159 0.146289)
      (xy -10.516872 1.245531)
      (xy -10.781034 2.092306)
      (xy -11.081652 2.726293)
      (xy -11.434733 3.187171)
      (xy -11.856285 3.514618)
      (xy -11.98219 3.584406)
      (xy -12.306326 3.775201)
      (xy -12.450523 3.90592)
      (xy -12.45098 3.909833)
      (xy -14.811702 3.909833)
      (xy -13.953134 3.767139)
      (xy -13.289036 3.524911)
      (xy -13.098059 3.378259)
      (xy -12.254042 3.378259)
      (xy -12.186317 3.39864)
      (xy -11.928175 3.259836)
      (xy -11.893489 3.237422)
      (xy -11.5781 2.929137)
      (xy -11.234415 2.443329)
      (xy -11.044593 2.09968)
      (xy -10.762686 1.344246)
      (xy -10.514299 0.318341)
      (xy -10.360844 -0.581705)
      (xy -10.221653 -1.409612)
      (xy -10.056724 -2.192463)
      (xy -9.89 -2.824612)
      (xy -9.785769 -3.119217)
      (xy -9.456107 -3.650599)
      (xy -8.965163 -4.046246)
      (xy -8.268498 -4.325927)
      (xy -7.321671 -4.509409)
      (xy -6.474625 -4.592021)
      (xy -5.728133 -4.660945)
      (xy -5.312875 -4.738802)
      (xy -5.228154 -4.826496)
      (xy -5.473275 -4.92493)
      (xy -6.047542 -5.03501)
      (xy -6.124658 -5.046939)
      (xy -6.830574 -5.050471)
      (xy -7.65242 -4.898502)
      (xy -8.485992 -4.627114)
      (xy -9.227083 -4.272388)
      (xy -9.771488 -3.870403)
      (xy -9.88049 -3.746495)
      (xy -10.309938 -3.005233)
      (xy -10.714595 -1.93911)
      (xy -11.095313 -0.545639)
      (xy -11.302427 0.398459)
      (xy -11.527008 1.4031)
      (xy -11.758577 2.20062)
      (xy -12.03652 2.914343)
      (xy -12.254042 3.378259)
      (xy -13.098059 3.378259)
      (xy -12.792792 3.143844)
      (xy -12.416698 2.581131)
      (xy -12.113053 1.793964)
      (xy -11.834156 0.739534)
      (xy -11.705787 0.174446)
      (xy -11.318563 -1.304914)
      (xy -10.866725 -2.555187)
      (xy -10.363776 -3.547551)
      (xy -9.823217 -4.253185)
      (xy -9.510662 -4.511334)
      (xy -8.56276 -5.006994)
      (xy -7.517601 -5.345177)
      (xy -6.525416 -5.478032)
      (xy -6.47451 -5.478432)
    ) (layer "F.Mask") (width 0) (fill solid) (tstamp e87a8e18-60cf-48ad-bd25-79a1dc5f2966))
  (fp_poly (pts
      (xy -5.723058 1.360166)
      (xy -5.772878 1.483659)
      (xy -5.927807 1.566451)
      (xy -6.121758 1.616995)
      (xy -6.04219 1.495382)
      (xy -6.020741 1.473517)
      (xy -5.803078 1.342386)
    ) (layer "F.Mask") (width 0) (fill solid) (tstamp eb4092ac-99dc-4b46-967a-509516e8ed16))
  (fp_poly (pts
      (xy -9.568351 -1.323036)
      (xy -9.592736 -1.147425)
      (xy -9.725338 -0.922584)
      (xy -9.899782 -0.735068)
      (xy -9.958242 -0.756832)
      (xy -9.883549 -1.010323)
      (xy -9.72832 -1.247424)
      (xy -9.585241 -1.333533)
    ) (layer "F.Mask") (width 0) (fill solid) (tstamp edc81be3-0355-4cdd-b39f-29200f4a4f10))
)
