{
	"id": "a0589bb2-c86a-4589-a096-d1f6eb9aa4f0",
	"name": "Production",
	"values": [
		{
			"key": "baseUrl",
			"value": "http://production.eba-fedxkb5v.eu-central-1.elasticbeanstalk.com",
			"enabled": true
		}
	],
	"_postman_variable_scope": "environment",
	"_postman_exported_at": "2021-05-26T11:16:08.799Z",
	"_postman_exported_using": "Postman/8.5.1"
}