{
    "description": "schema for clickhouseinstallation CRD.",
    "properties": {
        "spec": {
            "type": "object",
            "x-kubernetes-preserve-unknown-fields": true,
            "properties": {
                "taskID": {
                    "type": "string"
                },
                "stop": {
                    "type": "string",
                    "enum": [
                        "",
                        "0",
                        "1",
                        "False",
                        "false",
                        "True",
                        "true",
                        "No",
                        "no",
                        "Yes",
                        "yes",
                        "Off",
                        "off",
                        "On",
                        "on",
                        "Disabled",
                        "disabled",
                        "Enabled",
                        "enabled"
                    ]
                },
                "namespaceDomainPattern": {
                    "type": "string"
                },
                "templating": {
                    "type": "object",
                    "nullable": true,
                    "properties": {
                        "policy": {
                            "type": "string"
                        }
                    }
                },
                "reconciling": {
                    "type": "object",
                    "nullable": true,
                    "properties": {
                        "policy": {
                            "type": "string"
                        }
                    }
                },
                "defaults": {
                    "type": "object",
                    "nullable": true,
                    "properties": {
                        "replicasUseFQDN": {
                            "type": "string",
                            "enum": [
                                "",
                                "0",
                                "1",
                                "False",
                                "false",
                                "True",
                                "true",
                                "No",
                                "no",
                                "Yes",
                                "yes",
                                "Off",
                                "off",
                                "On",
                                "on",
                                "Disabled",
                                "disabled",
                                "Enabled",
                                "enabled"
                            ]
                        },
                        "distributedDDL": {
                            "type": "object",
                            "nullable": true,
                            "properties": {
                                "profile": {
                                    "type": "string"
                                }
                            }
                        },
                        "templates": {
                            "type": "object",
                            "nullable": true,
                            "properties": {
                                "hostTemplate": {
                                    "type": "string"
                                },
                                "podTemplate": {
                                    "type": "string"
                                },
                                "dataVolumeClaimTemplate": {
                                    "type": "string"
                                },
                                "logVolumeClaimTemplate": {
                                    "type": "string"
                                },
                                "serviceTemplate": {
                                    "type": "string"
                                },
                                "clusterServiceTemplate": {
                                    "type": "string"
                                },
                                "shardServiceTemplate": {
                                    "type": "string"
                                },
                                "replicaServiceTemplate": {
                                    "type": "string"
                                }
                            }
                        }
                    }
                },
                "configuration": {
                    "type": "object",
                    "nullable": true,
                    "properties": {
                        "zookeeper": {
                            "type": "object",
                            "nullable": true,
                            "properties": {
                                "nodes": {
                                    "type": "array",
                                    "nullable": true,
                                    "items": {
                                        "type": "object",
                                        "properties": {
                                            "host": {
                                                "type": "string"
                                            },
                                            "port": {
                                                "type": "integer",
                                                "minimum": 0,
                                                "maximum": 65535
                                            }
                                        }
                                    }
                                },
                                "session_timeout_ms": {
                                    "type": "integer"
                                },
                                "operation_timeout_ms": {
                                    "type": "integer"
                                },
                                "root": {
                                    "type": "string"
                                },
                                "identity": {
                                    "type": "string"
                                }
                            }
                        },
                        "users": {
                            "type": "object",
                            "nullable": true
                        },
                        "profiles": {
                            "type": "object",
                            "nullable": true
                        },
                        "quotas": {
                            "type": "object",
                            "nullable": true
                        },
                        "settings": {
                            "type": "object",
                            "nullable": true
                        },
                        "files": {
                            "type": "object",
                            "nullable": true
                        },
                        "clusters": {
                            "type": "array",
                            "nullable": true,
                            "items": {
                                "type": "object",
                                "properties": {
                                    "name": {
                                        "type": "string",
                                        "minLength": 1,
                                        "maxLength": 15,
                                        "pattern": "^[a-zA-Z0-9-]{0,15}$"
                                    },
                                    "zookeeper": {
                                        "type": "object",
                                        "nullable": true,
                                        "properties": {
                                            "nodes": {
                                                "type": "array",
                                                "nullable": true,
                                                "items": {
                                                    "type": "object",
                                                    "properties": {
                                                        "host": {
                                                            "type": "string"
                                                        },
                                                        "port": {
                                                            "type": "integer",
                                                            "minimum": 0,
                                                            "maximum": 65535
                                                        }
                                                    }
                                                }
                                            },
                                            "session_timeout_ms": {
                                                "type": "integer"
                                            },
                                            "operation_timeout_ms": {
                                                "type": "integer"
                                            },
                                            "root": {
                                                "type": "string"
                                            },
                                            "identity": {
                                                "type": "string"
                                            }
                                        }
                                    },
                                    "settings": {
                                        "type": "object",
                                        "nullable": true
                                    },
                                    "files": {
                                        "type": "object",
                                        "nullable": true
                                    },
                                    "templates": {
                                        "type": "object",
                                        "nullable": true,
                                        "properties": {
                                            "hostTemplate": {
                                                "type": "string"
                                            },
                                            "podTemplate": {
                                                "type": "string"
                                            },
                                            "dataVolumeClaimTemplate": {
                                                "type": "string"
                                            },
                                            "logVolumeClaimTemplate": {
                                                "type": "string"
                                            },
                                            "serviceTemplate": {
                                                "type": "string"
                                            },
                                            "clusterServiceTemplate": {
                                                "type": "string"
                                            },
                                            "shardServiceTemplate": {
                                                "type": "string"
                                            },
                                            "replicaServiceTemplate": {
                                                "type": "string"
                                            }
                                        }
                                    },
                                    "layout": {
                                        "type": "object",
                                        "nullable": true,
                                        "properties": {
                                            "type": {
                                                "type": "string"
                                            },
                                            "shardsCount": {
                                                "type": "integer"
                                            },
                                            "replicasCount": {
                                                "type": "integer"
                                            },
                                            "shards": {
                                                "type": "array",
                                                "nullable": true,
                                                "items": {
                                                    "type": "object",
                                                    "properties": {
                                                        "name": {
                                                            "type": "string",
                                                            "minLength": 1,
                                                            "maxLength": 15,
                                                            "pattern": "^[a-zA-Z0-9-]{0,15}$"
                                                        },
                                                        "definitionType": {
                                                            "type": "string"
                                                        },
                                                        "weight": {
                                                            "type": "integer"
                                                        },
                                                        "internalReplication": {
                                                            "type": "string",
                                                            "enum": [
                                                                "",
                                                                "0",
                                                                "1",
                                                                "False",
                                                                "false",
                                                                "True",
                                                                "true",
                                                                "No",
                                                                "no",
                                                                "Yes",
                                                                "yes",
                                                                "Off",
                                                                "off",
                                                                "On",
                                                                "on",
                                                                "Disabled",
                                                                "disabled",
                                                                "Enabled",
                                                                "enabled"
                                                            ]
                                                        },
                                                        "settings": {
                                                            "type": "object",
                                                            "nullable": true
                                                        },
                                                        "files": {
                                                            "type": "object",
                                                            "nullable": true
                                                        },
                                                        "templates": {
                                                            "type": "object",
                                                            "nullable": true,
                                                            "properties": {
                                                                "hostTemplate": {
                                                                    "type": "string"
                                                                },
                                                                "podTemplate": {
                                                                    "type": "string"
                                                                },
                                                                "dataVolumeClaimTemplate": {
                                                                    "type": "string"
                                                                },
                                                                "logVolumeClaimTemplate": {
                                                                    "type": "string"
                                                                },
                                                                "serviceTemplate": {
                                                                    "type": "string"
                                                                },
                                                                "clusterServiceTemplate": {
                                                                    "type": "string"
                                                                },
                                                                "shardServiceTemplate": {
                                                                    "type": "string"
                                                                },
                                                                "replicaServiceTemplate": {
                                                                    "type": "string"
                                                                }
                                                            }
                                                        },
                                                        "replicasCount": {
                                                            "type": "integer",
                                                            "minimum": 1
                                                        },
                                                        "replicas": {
                                                            "type": "array",
                                                            "nullable": true,
                                                            "items": {
                                                                "type": "object",
                                                                "properties": {
                                                                    "name": {
                                                                        "type": "string",
                                                                        "minLength": 1,
                                                                        "maxLength": 15,
                                                                        "pattern": "^[a-zA-Z0-9-]{0,15}$"
                                                                    },
                                                                    "tcpPort": {
                                                                        "type": "integer",
                                                                        "minimum": 1,
                                                                        "maximum": 65535
                                                                    },
                                                                    "httpPort": {
                                                                        "type": "integer",
                                                                        "minimum": 1,
                                                                        "maximum": 65535
                                                                    },
                                                                    "interserverHttpPort": {
                                                                        "type": "integer",
                                                                        "minimum": 1,
                                                                        "maximum": 65535
                                                                    },
                                                                    "settings": {
                                                                        "type": "object",
                                                                        "nullable": true
                                                                    },
                                                                    "files": {
                                                                        "type": "object",
                                                                        "nullable": true
                                                                    },
                                                                    "templates": {
                                                                        "type": "object",
                                                                        "nullable": true,
                                                                        "properties": {
                                                                            "hostTemplate": {
                                                                                "type": "string"
                                                                            },
                                                                            "podTemplate": {
                                                                                "type": "string"
                                                                            },
                                                                            "dataVolumeClaimTemplate": {
                                                                                "type": "string"
                                                                            },
                                                                            "logVolumeClaimTemplate": {
                                                                                "type": "string"
                                                                            },
                                                                            "serviceTemplate": {
                                                                                "type": "string"
                                                                            },
                                                                            "clusterServiceTemplate": {
                                                                                "type": "string"
                                                                            },
                                                                            "shardServiceTemplate": {
                                                                                "type": "string"
                                                                            },
                                                                            "replicaServiceTemplate": {
                                                                                "type": "string"
                                                                            }
                                                                        }
                                                                    }
                                                                }
                                                            }
                                                        }
                                                    }
                                                }
                                            },
                                            "replicas": {
                                                "type": "array",
                                                "nullable": true,
                                                "items": {
                                                    "type": "object",
                                                    "properties": {
                                                        "name": {
                                                            "type": "string",
                                                            "minLength": 1,
                                                            "maxLength": 15,
                                                            "pattern": "^[a-zA-Z0-9-]{0,15}$"
                                                        },
                                                        "settings": {
                                                            "type": "object",
                                                            "nullable": true
                                                        },
                                                        "files": {
                                                            "type": "object",
                                                            "nullable": true
                                                        },
                                                        "templates": {
                                                            "type": "object",
                                                            "nullable": true,
                                                            "properties": {
                                                                "hostTeampate": {
                                                                    "type": "string"
                                                                },
                                                                "podTemplate": {
                                                                    "type": "string"
                                                                },
                                                                "dataVolumeClaimTemplate": {
                                                                    "type": "string"
                                                                },
                                                                "logVolumeClaimTemplate": {
                                                                    "type": "string"
                                                                },
                                                                "serviceTemplate": {
                                                                    "type": "string"
                                                                },
                                                                "clusterServiceTemplate": {
                                                                    "type": "string"
                                                                },
                                                                "shardServiceTemplate": {
                                                                    "type": "string"
                                                                },
                                                                "replicaServiceTemplate": {
                                                                    "type": "string"
                                                                }
                                                            }
                                                        },
                                                        "shardsCount": {
                                                            "type": "integer",
                                                            "minimum": 1
                                                        },
                                                        "shards": {
                                                            "type": "array",
                                                            "nullable": true,
                                                            "items": {
                                                                "type": "object",
                                                                "properties": {
                                                                    "name": {
                                                                        "type": "string",
                                                                        "minLength": 1,
                                                                        "maxLength": 15,
                                                                        "pattern": "^[a-zA-Z0-9-]{0,15}$"
                                                                    },
                                                                    "tcpPort": {
                                                                        "type": "integer",
                                                                        "minimum": 1,
                                                                        "maximum": 65535
                                                                    },
                                                                    "httpPort": {
                                                                        "type": "integer",
                                                                        "minimum": 1,
                                                                        "maximum": 65535
                                                                    },
                                                                    "interserverHttpPort": {
                                                                        "type": "integer",
                                                                        "minimum": 1,
                                                                        "maximum": 65535
                                                                    },
                                                                    "settings": {
                                                                        "type": "object",
                                                                        "nullable": true
                                                                    },
                                                                    "files": {
                                                                        "type": "object",
                                                                        "nullable": true
                                                                    },
                                                                    "templates": {
                                                                        "type": "object",
                                                                        "nullable": true,
                                                                        "properties": {
                                                                            "hostTemplate": {
                                                                                "type": "string"
                                                                            },
                                                                            "podTemplate": {
                                                                                "type": "string"
                                                                            },
                                                                            "dataVolumeClaimTemplate": {
                                                                                "type": "string"
                                                                            },
                                                                            "logVolumeClaimTemplate": {
                                                                                "type": "string"
                                                                            },
                                                                            "serviceTemplate": {
                                                                                "type": "string"
                                                                            },
                                                                            "clusterServiceTemplate": {
                                                                                "type": "string"
                                                                            },
                                                                            "shardServiceTemplate": {
                                                                                "type": "string"
                                                                            },
                                                                            "replicaServiceTemplate": {
                                                                                "type": "string"
                                                                            }
                                                                        }
                                                                    }
                                                                }
                                                            }
                                                        }
                                                    }
                                                }
                                            }
                                        }
                                    }
                                }
                            }
                        }
                    }
                },
                "templates": {
                    "type": "object",
                    "nullable": true,
                    "properties": {
                        "hostTemplates": {
                            "type": "array",
                            "nullable": true,
                            "items": {
                                "type": "object",
                                "properties": {
                                    "name": {
                                        "type": "string"
                                    },
                                    "portDistribution": {
                                        "type": "array",
                                        "nullable": true,
                                        "items": {
                                            "type": "object",
                                            "properties": {
                                                "type": {
                                                    "type": "string",
                                                    "enum": [
                                                        "",
                                                        "Unspecified",
                                                        "ClusterScopeIndex"
                                                    ]
                                                }
                                            }
                                        }
                                    },
                                    "spec": {
                                        "type": "object",
                                        "properties": {
                                            "name": {
                                                "type": "string",
                                                "minLength": 1,
                                                "maxLength": 15,
                                                "pattern": "^[a-zA-Z0-9-]{0,15}$"
                                            },
                                            "tcpPort": {
                                                "type": "integer",
                                                "minimum": 1,
                                                "maximum": 65535
                                            },
                                            "httpPort": {
                                                "type": "integer",
                                                "minimum": 1,
                                                "maximum": 65535
                                            },
                                            "interserverHttpPort": {
                                                "type": "integer",
                                                "minimum": 1,
                                                "maximum": 65535
                                            },
                                            "settings": {
                                                "type": "object",
                                                "nullable": true
                                            },
                                            "files": {
                                                "type": "object",
                                                "nullable": true
                                            },
                                            "templates": {
                                                "type": "object",
                                                "nullable": true,
                                                "properties": {
                                                    "hostTemplate": {
                                                        "type": "string"
                                                    },
                                                    "podTemplate": {
                                                        "type": "string"
                                                    },
                                                    "dataVolumeClaimTemplate": {
                                                        "type": "string"
                                                    },
                                                    "logVolumeClaimTemplate": {
                                                        "type": "string"
                                                    },
                                                    "serviceTemplate": {
                                                        "type": "string"
                                                    },
                                                    "clusterServiceTemplate": {
                                                        "type": "string"
                                                    },
                                                    "shardServiceTemplate": {
                                                        "type": "string"
                                                    },
                                                    "replicaServiceTemplate": {
                                                        "type": "string"
                                                    }
                                                }
                                            }
                                        }
                                    }
                                }
                            }
                        },
                        "podTemplates": {
                            "type": "array",
                            "nullable": true,
                            "items": {
                                "type": "object",
                                "properties": {
                                    "name": {
                                        "type": "string"
                                    },
                                    "generateName": {
                                        "type": "string"
                                    },
                                    "zone": {
                                        "type": "object",
                                        "properties": {
                                            "key": {
                                                "type": "string"
                                            },
                                            "values": {
                                                "type": "array",
                                                "nullable": true,
                                                "items": {
                                                    "type": "string"
                                                }
                                            }
                                        }
                                    },
                                    "distribution": {
                                        "type": "string",
                                        "enum": [
                                            "",
                                            "Unspecified",
                                            "OnePerHost"
                                        ]
                                    },
                                    "podDistribution": {
                                        "type": "array",
                                        "nullable": true,
                                        "items": {
                                            "type": "object",
                                            "properties": {
                                                "type": {
                                                    "type": "string",
                                                    "enum": [
                                                        "",
                                                        "Unspecified",
                                                        "ClickHouseAntiAffinity",
                                                        "ShardAntiAffinity",
                                                        "ReplicaAntiAffinity",
                                                        "AnotherNamespaceAntiAffinity",
                                                        "AnotherClickHouseInstallationAntiAffinity",
                                                        "AnotherClusterAntiAffinity",
                                                        "MaxNumberPerNode",
                                                        "NamespaceAffinity",
                                                        "ClickHouseInstallationAffinity",
                                                        "ClusterAffinity",
                                                        "ShardAffinity",
                                                        "ReplicaAffinity",
                                                        "PreviousTailAffinity",
                                                        "CircularReplication"
                                                    ]
                                                },
                                                "scope": {
                                                    "type": "string",
                                                    "enum": [
                                                        "",
                                                        "Unspecified",
                                                        "Shard",
                                                        "Replica",
                                                        "Cluster",
                                                        "ClickHouseInstallation",
                                                        "Namespace"
                                                    ]
                                                },
                                                "number": {
                                                    "type": "integer",
                                                    "minimum": 0,
                                                    "maximum": 65535
                                                }
                                            }
                                        }
                                    },
                                    "spec": {
                                        "type": "object",
                                        "nullable": true
                                    }
                                }
                            }
                        },
                        "volumeClaimTemplates": {
                            "type": "array",
                            "nullable": true,
                            "items": {
                                "type": "object",
                                "properties": {
                                    "name": {
                                        "type": "string"
                                    },
                                    "reclaimPolicy": {
                                        "type": "string",
                                        "enum": [
                                            "",
                                            "Retain",
                                            "Delete"
                                        ]
                                    },
                                    "metadata": {
                                        "type": "object",
                                        "nullable": true
                                    },
                                    "spec": {
                                        "type": "object",
                                        "nullable": true
                                    }
                                }
                            }
                        },
                        "serviceTemplates": {
                            "type": "array",
                            "nullable": true,
                            "items": {
                                "type": "object",
                                "properties": {
                                    "name": {
                                        "type": "string"
                                    },
                                    "generateName": {
                                        "type": "string"
                                    },
                                    "metadata": {
                                        "type": "object",
                                        "nullable": true
                                    },
                                    "spec": {
                                        "type": "object",
                                        "nullable": true
                                    }
                                }
                            }
                        }
                    }
                },
                "useTemplates": {
                    "type": "array",
                    "nullable": true,
                    "items": {
                        "type": "object",
                        "properties": {
                            "name": {
                                "type": "string"
                            },
                            "namespace": {
                                "type": "string"
                            },
                            "useType": {
                                "type": "string",
                                "enum": [
                                    "",
                                    "merge"
                                ]
                            }
                        }
                    }
                }
            }
        }
    }
}