{
  "images" : [
    {
      "idiom" : "universal",
      "filename" : "1ring_icn@0.5x.png",
      "scale" : "1x"
    },
    {
      "idiom" : "universal",
      "filename" : "1ring_icn@2x.png",
      "scale" : "2x"
    },
    {
      "idiom" : "universal",
      "filename" : "1ring_icn@3x.png",
      "scale" : "3x"
    },
    {
      "idiom" : "universal",
      "filename" : "1ring_icn@1.5x.png",
      "unassigned" : true,
      "scale" : "1x"
    }
  ],
  "info" : {
    "version" : 1,
    "author" : "xcode"
  }
}