<mxfile host="app.diagrams.net" modified="2020-11-15T03:46:45.831Z" agent="5.0 (Windows NT 10.0; Win64; x64) AppleWebKit/537.36 (KHTML, like Gecko) Chrome/86.0.4240.193 Safari/537.36" etag="-C_W5SBf9qp8aW4NXjg8" version="13.9.8" type="gitlab">
  <diagram id="KcR0CnJ6EqCjCeUCdqGm" name="Page-1">
    <mxGraphModel dx="868" dy="482" grid="1" gridSize="10" guides="1" tooltips="1" connect="1" arrows="1" fold="1" page="1" pageScale="1" pageWidth="827" pageHeight="1169" math="0" shadow="0">
      <root>
        <mxCell id="0" />
        <mxCell id="1" parent="0" />
        <mxCell id="-iYCCfSTnKUzxSTgQp-h-3" value="Users enters name" style="edgeStyle=orthogonalEdgeStyle;rounded=0;orthogonalLoop=1;jettySize=auto;html=1;" edge="1" parent="1" source="-iYCCfSTnKUzxSTgQp-h-1" target="-iYCCfSTnKUzxSTgQp-h-2">
          <mxGeometry relative="1" as="geometry" />
        </mxCell>
        <mxCell id="-iYCCfSTnKUzxSTgQp-h-1" value="Ask for the users first and last name" style="ellipse;whiteSpace=wrap;html=1;" vertex="1" parent="1">
          <mxGeometry x="340" y="60" width="120" height="80" as="geometry" />
        </mxCell>
        <mxCell id="-iYCCfSTnKUzxSTgQp-h-5" value="User selects a seat" style="edgeStyle=orthogonalEdgeStyle;rounded=0;orthogonalLoop=1;jettySize=auto;html=1;" edge="1" parent="1" source="-iYCCfSTnKUzxSTgQp-h-2" target="-iYCCfSTnKUzxSTgQp-h-4">
          <mxGeometry relative="1" as="geometry" />
        </mxCell>
        <mxCell id="-iYCCfSTnKUzxSTgQp-h-2" value="Display the seats and ask the user to input a seat" style="rounded=0;whiteSpace=wrap;html=1;" vertex="1" parent="1">
          <mxGeometry x="340" y="180" width="120" height="60" as="geometry" />
        </mxCell>
        <mxCell id="-iYCCfSTnKUzxSTgQp-h-8" value="No" style="edgeStyle=orthogonalEdgeStyle;rounded=0;orthogonalLoop=1;jettySize=auto;html=1;exitX=0;exitY=0.5;exitDx=0;exitDy=0;entryX=0.5;entryY=1;entryDx=0;entryDy=0;" edge="1" parent="1" source="-iYCCfSTnKUzxSTgQp-h-4" target="-iYCCfSTnKUzxSTgQp-h-7">
          <mxGeometry relative="1" as="geometry" />
        </mxCell>
        <mxCell id="-iYCCfSTnKUzxSTgQp-h-12" style="edgeStyle=orthogonalEdgeStyle;rounded=0;orthogonalLoop=1;jettySize=auto;html=1;exitX=0.5;exitY=1;exitDx=0;exitDy=0;entryX=0.5;entryY=0;entryDx=0;entryDy=0;" edge="1" parent="1" source="-iYCCfSTnKUzxSTgQp-h-4" target="-iYCCfSTnKUzxSTgQp-h-11">
          <mxGeometry relative="1" as="geometry" />
        </mxCell>
        <mxCell id="-iYCCfSTnKUzxSTgQp-h-4" value="Is the seat available" style="rhombus;whiteSpace=wrap;html=1;" vertex="1" parent="1">
          <mxGeometry x="360" y="290" width="80" height="80" as="geometry" />
        </mxCell>
        <mxCell id="-iYCCfSTnKUzxSTgQp-h-9" style="edgeStyle=orthogonalEdgeStyle;rounded=0;orthogonalLoop=1;jettySize=auto;html=1;exitX=0.5;exitY=0;exitDx=0;exitDy=0;entryX=0;entryY=0.5;entryDx=0;entryDy=0;" edge="1" parent="1" source="-iYCCfSTnKUzxSTgQp-h-7" target="-iYCCfSTnKUzxSTgQp-h-2">
          <mxGeometry relative="1" as="geometry" />
        </mxCell>
        <mxCell id="-iYCCfSTnKUzxSTgQp-h-7" value="Display a message saying the seat is not available" style="rounded=0;whiteSpace=wrap;html=1;" vertex="1" parent="1">
          <mxGeometry x="150" y="230" width="120" height="60" as="geometry" />
        </mxCell>
        <mxCell id="-iYCCfSTnKUzxSTgQp-h-14" value="User order" style="edgeStyle=orthogonalEdgeStyle;rounded=0;orthogonalLoop=1;jettySize=auto;html=1;exitX=0.5;exitY=1;exitDx=0;exitDy=0;entryX=0.5;entryY=0;entryDx=0;entryDy=0;" edge="1" parent="1" source="-iYCCfSTnKUzxSTgQp-h-11" target="-iYCCfSTnKUzxSTgQp-h-13">
          <mxGeometry relative="1" as="geometry" />
        </mxCell>
        <mxCell id="-iYCCfSTnKUzxSTgQp-h-11" value="Display the menu and ask the user to make an order" style="rounded=0;whiteSpace=wrap;html=1;" vertex="1" parent="1">
          <mxGeometry x="340" y="400" width="120" height="60" as="geometry" />
        </mxCell>
        <mxCell id="-iYCCfSTnKUzxSTgQp-h-16" value="" style="edgeStyle=orthogonalEdgeStyle;rounded=0;orthogonalLoop=1;jettySize=auto;html=1;" edge="1" parent="1" source="-iYCCfSTnKUzxSTgQp-h-13" target="-iYCCfSTnKUzxSTgQp-h-15">
          <mxGeometry relative="1" as="geometry" />
        </mxCell>
        <mxCell id="-iYCCfSTnKUzxSTgQp-h-13" value="Ask the user to pay&amp;nbsp;" style="rounded=0;whiteSpace=wrap;html=1;" vertex="1" parent="1">
          <mxGeometry x="340" y="540" width="120" height="60" as="geometry" />
        </mxCell>
        <mxCell id="-iYCCfSTnKUzxSTgQp-h-18" value="Yes" style="edgeStyle=orthogonalEdgeStyle;rounded=0;orthogonalLoop=1;jettySize=auto;html=1;" edge="1" parent="1" source="-iYCCfSTnKUzxSTgQp-h-15" target="-iYCCfSTnKUzxSTgQp-h-17">
          <mxGeometry relative="1" as="geometry" />
        </mxCell>
        <mxCell id="-iYCCfSTnKUzxSTgQp-h-20" value="" style="edgeStyle=orthogonalEdgeStyle;rounded=0;orthogonalLoop=1;jettySize=auto;html=1;" edge="1" parent="1" source="-iYCCfSTnKUzxSTgQp-h-15" target="-iYCCfSTnKUzxSTgQp-h-19">
          <mxGeometry relative="1" as="geometry" />
        </mxCell>
        <mxCell id="-iYCCfSTnKUzxSTgQp-h-15" value="Does the user enter the right amount" style="rhombus;whiteSpace=wrap;html=1;rounded=0;" vertex="1" parent="1">
          <mxGeometry x="332.5" y="650" width="135" height="130" as="geometry" />
        </mxCell>
        <mxCell id="-iYCCfSTnKUzxSTgQp-h-17" value="Display the recite with all the inputted information" style="whiteSpace=wrap;html=1;rounded=0;" vertex="1" parent="1">
          <mxGeometry x="340" y="895" width="120" height="60" as="geometry" />
        </mxCell>
        <mxCell id="-iYCCfSTnKUzxSTgQp-h-21" value="No" style="edgeStyle=orthogonalEdgeStyle;rounded=0;orthogonalLoop=1;jettySize=auto;html=1;exitX=0.5;exitY=0;exitDx=0;exitDy=0;entryX=0;entryY=0.5;entryDx=0;entryDy=0;" edge="1" parent="1" source="-iYCCfSTnKUzxSTgQp-h-19" target="-iYCCfSTnKUzxSTgQp-h-13">
          <mxGeometry relative="1" as="geometry" />
        </mxCell>
        <mxCell id="-iYCCfSTnKUzxSTgQp-h-19" value="Display an error" style="whiteSpace=wrap;html=1;rounded=0;" vertex="1" parent="1">
          <mxGeometry x="125" y="685" width="120" height="60" as="geometry" />
        </mxCell>
      </root>
    </mxGraphModel>
  </diagram>
</mxfile>
