%!PS-Adobe-3.0
%%Creator: inkscape 0.46
%%Pages: 1
%%Orientation: Landscape
%%BoundingBox: 0 0 801 1067
%%HiResBoundingBox: -0.064025879 0 800.93597 1067
%%DocumentMedia: plain 801 1067 0 () ()
%%EndComments
%%Page: 1 1
90 rotate
0.8 -0.8 scale
0 0 0 setrgbcolor
[] 0 setdash
1 setlinewidth
0 setlinejoin
0 setlinecap
gsave [1 0 0 1 0 0] concat
gsave [1 0 0 1 -31.489708 757.0755] concat
gsave
0.29803923 0.29803923 0.72549021 setrgbcolor
newpath
40 -295.90552 moveto
800 -295.90552 lineto
800 164.09448 lineto
40 164.09448 lineto
40 -295.90552 lineto
closepath
fill
grestore
gsave
0 0 0 setrgbcolor
newpath
38.544395 193.39084 moveto
37.122513 193.39086 36.05155 194.09268 35.331505 195.49631 curveto
34.620562 196.89085 34.265094 198.99176 34.265099 201.79904 curveto
34.265094 204.59723 34.620562 206.69814 35.331505 208.10178 curveto
36.05155 209.49631 37.122513 210.19357 38.544395 210.19357 curveto
39.975375 210.19357 41.046337 209.49631 41.757286 208.10178 curveto
42.477325 206.69814 42.837351 204.59723 42.837364 201.79904 curveto
42.837351 198.99176 42.477325 196.89085 41.757286 195.49631 curveto
41.046337 194.09268 39.975375 193.39086 38.544395 193.39084 curveto
38.544395 191.20334 moveto
40.832145 191.20336 42.577586 192.11026 43.780724 193.92404 curveto
44.992948 195.72875 45.599067 198.35374 45.599083 201.79904 curveto
45.599067 205.23525 44.992948 207.86024 43.780724 209.67404 curveto
42.577586 211.47873 40.832145 212.38107 38.544395 212.38107 curveto
36.256628 212.38107 34.50663 211.47873 33.294395 209.67404 curveto
32.091268 207.86024 31.489706 205.23525 31.489708 201.79904 curveto
31.489706 198.35374 32.091268 195.72875 33.294395 193.92404 curveto
34.50663 192.11026 36.256628 191.20336 38.544395 191.20334 curveto
fill
grestore
gsave
0 0 0 setrgbcolor
newpath
50.46627 208.51193 moveto
53.351036 208.51193 lineto
53.351036 211.98459 lineto
50.46627 211.98459 lineto
50.46627 208.51193 lineto
fill
grestore
gsave
0 0 0 setrgbcolor
newpath
59.858849 209.66037 moveto
64.370567 209.66037 lineto
64.370567 194.0881 lineto
59.462364 195.07248 lineto
59.462364 192.55685 lineto
64.343224 191.57248 lineto
67.104942 191.57248 lineto
67.104942 209.66037 lineto
71.616661 209.66037 lineto
71.616661 211.98459 lineto
59.858849 211.98459 lineto
59.858849 209.66037 lineto
fill
grestore
gsave
0 0 0 setrgbcolor
newpath
785.5733 208.22003 moveto
784.2608 208.22004 783.22629 208.57095 782.46979 209.27277 curveto
781.72239 209.9746 781.34869 210.94074 781.34869 212.1712 curveto
781.34869 213.40168 781.72239 214.36782 782.46979 215.06964 curveto
783.22629 215.77147 784.2608 216.12238 785.5733 216.12238 curveto
786.88579 216.12238 787.9203 215.77147 788.67682 215.06964 curveto
789.43332 214.35871 789.81157 213.39256 789.81158 212.1712 curveto
789.81157 210.94074 789.43332 209.9746 788.67682 209.27277 curveto
787.92941 208.57095 786.89491 208.22004 785.5733 208.22003 curveto
782.81158 207.04425 moveto
781.62668 206.75259 780.70155 206.20116 780.03619 205.38995 curveto
779.37994 204.57877 779.05182 203.58984 779.05182 202.42316 curveto
779.05182 200.79166 779.63059 199.50195 780.78815 198.55402 curveto
781.95481 197.60612 783.54986 197.13216 785.5733 197.13214 curveto
787.60584 197.13216 789.20089 197.60612 790.35846 198.55402 curveto
791.516 199.50195 792.09477 200.79166 792.09479 202.42316 curveto
792.09477 203.58984 791.76209 204.57877 791.09674 205.38995 curveto
790.44048 206.20116 789.52446 206.75259 788.34869 207.04425 curveto
789.67941 207.35416 790.71391 207.96028 791.45221 208.86261 curveto
792.19959 209.76496 792.57329 210.86783 792.5733 212.1712 curveto
792.57329 214.14907 791.96717 215.66665 790.75494 216.72394 curveto
789.55181 217.78123 787.82459 218.30988 785.5733 218.30988 curveto
783.32199 218.30988 781.59023 217.78123 780.37799 216.72394 curveto
779.17486 215.66665 778.5733 214.14907 778.5733 212.1712 curveto
778.5733 210.86783 778.947 209.76496 779.6944 208.86261 curveto
780.44179 207.96028 781.48085 207.35416 782.81158 207.04425 curveto
781.79987 202.68292 moveto
781.79986 203.74023 782.12799 204.5651 782.78424 205.15753 curveto
783.4496 205.74999 784.37929 206.04622 785.5733 206.0462 curveto
786.75819 206.04622 787.68332 205.74999 788.34869 205.15753 curveto
789.02316 204.5651 789.3604 203.74023 789.36041 202.68292 curveto
789.3604 201.62565 789.02316 200.80078 788.34869 200.20831 curveto
787.68332 199.61588 786.75819 199.31966 785.5733 199.31964 curveto
784.37929 199.31966 783.4496 199.61588 782.78424 200.20831 curveto
782.12799 200.80078 781.79986 201.62565 781.79987 202.68292 curveto
fill
grestore
gsave
0 0 0 setrgbcolor
newpath
803.40143 199.31964 moveto
801.97955 199.31966 800.90858 200.02148 800.18854 201.42511 curveto
799.4776 202.81966 799.12213 204.92057 799.12213 207.72784 curveto
799.12213 210.52603 799.4776 212.62694 800.18854 214.03058 curveto
800.90858 215.42511 801.97955 216.12238 803.40143 216.12238 curveto
804.83241 216.12238 805.90337 215.42511 806.61432 214.03058 curveto
807.33436 212.62694 807.69438 210.52603 807.6944 207.72784 curveto
807.69438 204.92057 807.33436 202.81966 806.61432 201.42511 curveto
805.90337 200.02148 804.83241 199.31966 803.40143 199.31964 curveto
803.40143 197.13214 moveto
805.68918 197.13216 807.43462 198.03906 808.63776 199.85284 curveto
809.84998 201.65755 810.4561 204.28255 810.45612 207.72784 curveto
810.4561 211.16405 809.84998 213.78905 808.63776 215.60284 curveto
807.43462 217.40753 805.68918 218.30988 803.40143 218.30988 curveto
801.11366 218.30988 799.36366 217.40753 798.15143 215.60284 curveto
796.9483 213.78905 796.34674 211.16405 796.34674 207.72784 curveto
796.34674 204.28255 796.9483 201.65755 798.15143 199.85284 curveto
799.36366 198.03906 801.11366 197.13216 803.40143 197.13214 curveto
fill
grestore
gsave
0 0 0 setrgbcolor
newpath
463.47266 241.77026 moveto
467.98438 241.77026 lineto
467.98438 226.198 lineto
463.07617 227.18237 lineto
463.07617 224.66675 lineto
467.95703 223.68237 lineto
470.71875 223.68237 lineto
470.71875 241.77026 lineto
475.23047 241.77026 lineto
475.23047 244.09448 lineto
463.47266 244.09448 lineto
463.47266 241.77026 lineto
fill
grestore
gsave
0 0 0 setrgbcolor
newpath
423.80408 186.09869 moveto
432.08923 186.09869 lineto
436.84705 213.60651 lineto
452.65173 186.09869 lineto
461.15564 186.09869 lineto
453.19861 226.92291 lineto
447.83923 226.92291 lineto
454.78455 191.12994 lineto
438.76111 219.07526 lineto
433.37439 219.07526 lineto
428.17908 191.02057 lineto
421.23376 226.92291 lineto
415.84705 226.92291 lineto
423.80408 186.09869 lineto
fill
grestore
gsave [1 0 -0.7071046 0.7071089 0 0] concat
gsave
0.50588238 0.49803922 0.72549021 setrgbcolor
newpath
-255.90372 -1069.0085 moveto
504.09628 -1069.0085 lineto
504.09628 -418.47229 lineto
-255.90372 -418.47229 lineto
-255.90372 -1069.0085 lineto
closepath
fill
grestore
grestore
gsave [0.7071089 -0.7071046 0 1 0 0] concat
gsave
0.64705884 0.62352943 0.72549021 setrgbcolor
newpath
1131.3674 504.08963 moveto
1781.9037 504.08963 lineto
1781.9037 964.09152 lineto
1131.3674 964.09152 lineto
1131.3674 504.08963 lineto
closepath
fill
grestore
grestore
gsave
0 0 0 setrgbcolor
newpath
868.6994 148.12814 moveto
867.27752 148.12816 866.20656 148.82998 865.48651 150.23361 curveto
864.77557 151.62816 864.4201 153.72907 864.4201 156.53635 curveto
864.4201 159.33453 864.77557 161.43544 865.48651 162.83908 curveto
866.20656 164.23361 867.27752 164.93088 868.6994 164.93088 curveto
870.13038 164.93088 871.20134 164.23361 871.91229 162.83908 curveto
872.63233 161.43544 872.99236 159.33453 872.99237 156.53635 curveto
872.99236 153.72907 872.63233 151.62816 871.91229 150.23361 curveto
871.20134 148.82998 870.13038 148.12816 868.6994 148.12814 curveto
868.6994 145.94064 moveto
870.98715 145.94066 872.73259 146.84756 873.93573 148.66135 curveto
875.14795 150.46605 875.75407 153.09105 875.75409 156.53635 curveto
875.75407 159.97255 875.14795 162.59755 873.93573 164.41135 curveto
872.73259 166.21603 870.98715 167.11838 868.6994 167.11838 curveto
866.41163 167.11838 864.66164 166.21603 863.4494 164.41135 curveto
862.24627 162.59755 861.64471 159.97255 861.64471 156.53635 curveto
861.64471 153.09105 862.24627 150.46605 863.4494 148.66135 curveto
864.66164 146.84756 866.41163 145.94066 868.6994 145.94064 curveto
fill
grestore
gsave
0 0 0 setrgbcolor
newpath
880.62128 163.24924 moveto
883.50604 163.24924 lineto
883.50604 166.72189 lineto
880.62128 166.72189 lineto
880.62128 163.24924 lineto
fill
grestore
gsave
0 0 0 setrgbcolor
newpath
890.01385 164.39767 moveto
894.52557 164.39767 lineto
894.52557 148.82541 lineto
889.61737 149.80978 lineto
889.61737 147.29416 lineto
894.49823 146.30978 lineto
897.25995 146.30978 lineto
897.25995 164.39767 lineto
901.77167 164.39767 lineto
901.77167 166.72189 lineto
890.01385 166.72189 lineto
890.01385 164.39767 lineto
fill
grestore
gsave
0 0 0 setrgbcolor
newpath
1246.8802 -225.55701 moveto
1245.5677 -225.557 1244.5332 -225.20609 1243.7767 -224.50427 curveto
1243.0293 -223.80244 1242.6556 -222.8363 1242.6556 -221.60583 curveto
1242.6556 -220.37536 1243.0293 -219.40922 1243.7767 -218.7074 curveto
1244.5332 -218.00557 1245.5677 -217.65466 1246.8802 -217.65466 curveto
1248.1927 -217.65466 1249.2272 -218.00557 1249.9838 -218.7074 curveto
1250.7403 -219.41833 1251.1185 -220.38448 1251.1185 -221.60583 curveto
1251.1185 -222.8363 1250.7403 -223.80244 1249.9838 -224.50427 curveto
1249.2364 -225.20609 1248.2019 -225.557 1246.8802 -225.55701 curveto
1244.1185 -226.73279 moveto
1242.9336 -227.02444 1242.0085 -227.57588 1241.3431 -228.38708 curveto
1240.6869 -229.19827 1240.3588 -230.1872 1240.3588 -231.35388 curveto
1240.3588 -232.98538 1240.9375 -234.27509 1242.0951 -235.22302 curveto
1243.2618 -236.17092 1244.8568 -236.64488 1246.8802 -236.6449 curveto
1248.9128 -236.64488 1250.5078 -236.17092 1251.6654 -235.22302 curveto
1252.8229 -234.27509 1253.4017 -232.98538 1253.4017 -231.35388 curveto
1253.4017 -230.1872 1253.069 -229.19827 1252.4037 -228.38708 curveto
1251.7474 -227.57588 1250.8314 -227.02444 1249.6556 -226.73279 curveto
1250.9864 -226.42288 1252.0209 -225.81676 1252.7592 -224.91443 curveto
1253.5065 -224.01208 1253.8802 -222.90921 1253.8802 -221.60583 curveto
1253.8802 -219.62797 1253.2741 -218.11039 1252.0619 -217.0531 curveto
1250.8588 -215.99581 1249.1315 -215.46716 1246.8802 -215.46716 curveto
1244.6289 -215.46716 1242.8972 -215.99581 1241.6849 -217.0531 curveto
1240.4818 -218.11039 1239.8802 -219.62797 1239.8802 -221.60583 curveto
1239.8802 -222.90921 1240.2539 -224.01208 1241.0013 -224.91443 curveto
1241.7487 -225.81676 1242.7878 -226.42288 1244.1185 -226.73279 curveto
1243.1068 -231.09412 moveto
1243.1068 -230.03681 1243.4349 -229.21194 1244.0912 -228.61951 curveto
1244.7565 -228.02705 1245.6862 -227.73082 1246.8802 -227.73083 curveto
1248.0651 -227.73082 1248.9903 -228.02705 1249.6556 -228.61951 curveto
1250.3301 -229.21194 1250.6673 -230.03681 1250.6674 -231.09412 curveto
1250.6673 -232.15139 1250.3301 -232.97626 1249.6556 -233.56873 curveto
1248.9903 -234.16116 1248.0651 -234.45738 1246.8802 -234.4574 curveto
1245.6862 -234.45738 1244.7565 -234.16116 1244.0912 -233.56873 curveto
1243.4349 -232.97626 1243.1068 -232.15139 1243.1068 -231.09412 curveto
fill
grestore
gsave
0 0 0 setrgbcolor
newpath
1264.7084 -234.4574 moveto
1263.2865 -234.45738 1262.2155 -233.75556 1261.4955 -232.35193 curveto
1260.7845 -230.95738 1260.4291 -228.85647 1260.4291 -226.04919 curveto
1260.4291 -223.25101 1260.7845 -221.1501 1261.4955 -219.74646 curveto
1262.2155 -218.35193 1263.2865 -217.65466 1264.7084 -217.65466 curveto
1266.1394 -217.65466 1267.2103 -218.35193 1267.9213 -219.74646 curveto
1268.6413 -221.1501 1269.0013 -223.25101 1269.0013 -226.04919 curveto
1269.0013 -228.85647 1268.6413 -230.95738 1267.9213 -232.35193 curveto
1267.2103 -233.75556 1266.1394 -234.45738 1264.7084 -234.4574 curveto
1264.7084 -236.6449 moveto
1266.9961 -236.64488 1268.7416 -235.73798 1269.9447 -233.92419 curveto
1271.1569 -232.11949 1271.763 -229.49449 1271.7631 -226.04919 curveto
1271.763 -222.61299 1271.1569 -219.98799 1269.9447 -218.17419 curveto
1268.7416 -216.36951 1266.9961 -215.46716 1264.7084 -215.46716 curveto
1262.4206 -215.46716 1260.6706 -216.36951 1259.4584 -218.17419 curveto
1258.2552 -219.98799 1257.6537 -222.61299 1257.6537 -226.04919 curveto
1257.6537 -229.49449 1258.2552 -232.11949 1259.4584 -233.92419 curveto
1260.6706 -235.73798 1262.4206 -236.64488 1264.7084 -236.6449 curveto
fill
grestore
gsave
0 0 0 setrgbcolor
newpath
1111.6072 -49.475708 moveto
1121.2458 -49.475708 lineto
1121.2458 -47.151489 lineto
1108.2849 -47.151489 lineto
1108.2849 -49.475708 lineto
1109.3331 -50.56034 1110.7595 -52.014115 1112.5642 -53.837036 curveto
1114.378 -55.669059 1115.5173 -56.849396 1115.9822 -57.378052 curveto
1116.8663 -58.37153 1117.4815 -59.210071 1117.8279 -59.893677 curveto
1118.1833 -60.586372 1118.3611 -61.265407 1118.3611 -61.930786 curveto
1118.3611 -63.015406 1117.9783 -63.899519 1117.2126 -64.58313 curveto
1116.4561 -65.266706 1115.4672 -65.608502 1114.2458 -65.608521 curveto
1113.38 -65.608502 1112.4639 -65.458112 1111.4978 -65.157349 curveto
1110.5408 -64.85655 1109.5154 -64.400821 1108.4216 -63.790161 curveto
1108.4216 -66.579224 lineto
1109.5336 -67.025818 1110.5727 -67.363058 1111.5388 -67.590942 curveto
1112.505 -67.818786 1113.3891 -67.932718 1114.1912 -67.932739 curveto
1116.3057 -67.932718 1117.9919 -67.404073 1119.2498 -66.346802 curveto
1120.5076 -65.289492 1121.1365 -63.876733 1121.1365 -62.108521 curveto
1121.1365 -61.269965 1120.977 -60.472439 1120.658 -59.715942 curveto
1120.348 -58.968535 1119.7784 -58.084421 1118.949 -57.063599 curveto
1118.7211 -56.799266 1117.9965 -56.033642 1116.7751 -54.766724 curveto
1115.5538 -53.508905 1113.8311 -51.745235 1111.6072 -49.475708 curveto
fill
grestore
gsave
0 0 0 setrgbcolor
newpath
1070.0382 -105.14728 moveto
1078.3234 -105.14728 lineto
1083.0812 -77.639465 lineto
1098.8859 -105.14728 lineto
1107.3898 -105.14728 lineto
1099.4327 -64.323059 lineto
1094.0734 -64.323059 lineto
1101.0187 -100.11603 lineto
1084.9952 -72.170715 lineto
1079.6085 -72.170715 lineto
1074.4132 -100.2254 lineto
1067.4679 -64.323059 lineto
1062.0812 -64.323059 lineto
1070.0382 -105.14728 lineto
fill
grestore
gsave
0 0 0 setrgbcolor
newpath
1312.0231 -555.07935 moveto
1311.066 -550.32153 lineto
1309.7353 -551.05067 1308.3316 -551.59755 1306.8551 -551.96216 curveto
1305.3785 -552.32671 1303.8564 -552.50901 1302.2887 -552.50903 curveto
1299.6455 -552.50901 1297.5582 -552.05328 1296.027 -551.14185 curveto
1294.5139 -550.24859 1293.7574 -549.02724 1293.7574 -547.47778 curveto
1293.7574 -545.67308 1295.5257 -544.28766 1299.0621 -543.32153 curveto
1299.3356 -543.2486 1299.5361 -543.19391 1299.6637 -543.15747 curveto
1301.277 -542.66528 lineto
1304.6311 -541.73558 1306.8642 -540.76032 1307.9762 -539.7395 curveto
1309.1064 -538.71866 1309.6715 -537.32413 1309.6715 -535.55591 curveto
1309.6715 -532.31111 1308.3772 -529.66788 1305.7887 -527.62622 curveto
1303.2184 -525.58455 1299.846 -524.56372 1295.6715 -524.56372 curveto
1294.0491 -524.56372 1292.3447 -524.71867 1290.5582 -525.02856 curveto
1288.7718 -525.33846 1286.803 -525.82153 1284.652 -526.47778 curveto
1285.6364 -531.6731 lineto
1287.4775 -530.72517 1289.2913 -530.00512 1291.0778 -529.51294 curveto
1292.8642 -529.02075 1294.5777 -528.77465 1296.2184 -528.77466 curveto
1298.6793 -528.77465 1300.6754 -529.3033 1302.2067 -530.3606 curveto
1303.7561 -531.41788 1304.5309 -532.75772 1304.5309 -534.38013 curveto
1304.5309 -536.13012 1302.5074 -537.54288 1298.4606 -538.61841 curveto
1297.941 -538.75513 lineto
1296.2184 -539.19263 lineto
1293.6663 -539.86709 1291.7978 -540.75121 1290.6129 -541.84497 curveto
1289.428 -542.95693 1288.8356 -544.36969 1288.8356 -546.08325 curveto
1288.8356 -549.34625 1290.0569 -551.93479 1292.4996 -553.84888 curveto
1294.9606 -555.76291 1298.2965 -556.71994 1302.5074 -556.71997 curveto
1304.1663 -556.71994 1305.7796 -556.58322 1307.3473 -556.30981 curveto
1308.9332 -556.03635 1310.4918 -555.62619 1312.0231 -555.07935 curveto
fill
grestore
gsave
0 0 0 setrgbcolor
newpath
1340.1598 -543.40356 moveto
1340.2145 -543.69521 1340.2509 -543.99599 1340.2692 -544.30591 curveto
1340.3056 -544.61578 1340.3238 -544.92568 1340.3239 -545.2356 curveto
1340.3238 -547.45953 1339.6676 -549.21864 1338.3551 -550.51294 curveto
1337.0608 -551.80718 1335.2926 -552.45432 1333.0504 -552.45435 curveto
1330.553 -552.45432 1328.3473 -551.66135 1326.4332 -550.07544 curveto
1324.5192 -548.50771 1323.0699 -546.27464 1322.0856 -543.37622 curveto
1340.1598 -543.40356 lineto
1344.5348 -539.46606 moveto
1321.1285 -539.46606 lineto
1321.0192 -538.77334 1320.9462 -538.22647 1320.9098 -537.82544 curveto
1320.8733 -537.42439 1320.8551 -537.07803 1320.8551 -536.78638 curveto
1320.8551 -534.25251 1321.6298 -532.29288 1323.1793 -530.90747 curveto
1324.747 -529.52205 1326.9527 -528.82934 1329.7965 -528.82935 curveto
1331.984 -528.82934 1334.053 -529.07544 1336.0035 -529.56763 curveto
1337.954 -530.05981 1339.7678 -530.77986 1341.4449 -531.72778 curveto
1340.4879 -526.75122 lineto
1338.6832 -526.02205 1336.8147 -525.47518 1334.8824 -525.1106 curveto
1332.9684 -524.74601 1331.0178 -524.56372 1329.0309 -524.56372 curveto
1324.7835 -524.56372 1321.5113 -525.57544 1319.2145 -527.59888 curveto
1316.9358 -529.64054 1315.7965 -532.52986 1315.7965 -536.26685 curveto
1315.7965 -539.45694 1316.3616 -542.41917 1317.4918 -545.15356 curveto
1318.6403 -547.90615 1320.3173 -550.35797 1322.5231 -552.50903 curveto
1323.9449 -553.85796 1325.6311 -554.89702 1327.5817 -555.62622 curveto
1329.5504 -556.35536 1331.6376 -556.71994 1333.8434 -556.71997 curveto
1337.3069 -556.71994 1340.0595 -555.68088 1342.1012 -553.60278 curveto
1344.1611 -551.52463 1345.191 -548.73557 1345.191 -545.2356 curveto
1345.191 -544.39703 1345.1363 -543.49469 1345.027 -542.52856 curveto
1344.9176 -541.58063 1344.7535 -540.5598 1344.5348 -539.46606 curveto
fill
grestore
gsave
0 0 0 setrgbcolor
newpath
1375.4606 -544.22388 moveto
1375.4605 -546.90354 1374.8772 -548.95432 1373.7106 -550.37622 curveto
1372.5439 -551.79807 1370.8668 -552.50901 1368.6793 -552.50903 curveto
1367.1845 -552.50901 1365.7535 -552.12619 1364.3864 -551.3606 curveto
1363.0374 -550.59495 1361.8343 -549.48297 1360.777 -548.02466 curveto
1359.7379 -546.58453 1358.9085 -544.84365 1358.2887 -542.802 curveto
1357.6689 -540.76032 1357.359 -538.73688 1357.359 -536.73169 curveto
1357.359 -534.1796 1357.9423 -532.21085 1359.109 -530.82544 curveto
1360.2757 -529.45825 1361.9345 -528.77465 1364.0856 -528.77466 curveto
1365.6715 -528.77465 1367.1389 -529.14835 1368.4879 -529.89575 curveto
1369.8551 -530.64314 1371.0217 -531.72778 1371.9879 -533.14966 curveto
1373.027 -534.64444 1373.8655 -536.40355 1374.5035 -538.427 curveto
1375.1415 -540.45042 1375.4605 -542.38271 1375.4606 -544.22388 curveto
1359.8746 -551.33325 moveto
1361.2236 -553.10145 1362.8095 -554.4413 1364.6324 -555.35278 curveto
1366.4736 -556.26421 1368.5152 -556.71994 1370.7574 -556.71997 curveto
1373.8928 -556.71994 1376.3264 -555.68999 1378.0582 -553.63013 curveto
1379.79 -551.58843 1380.6559 -548.71734 1380.6559 -545.01685 curveto
1380.6559 -541.99079 1380.1181 -539.10147 1379.0426 -536.34888 curveto
1377.9671 -533.61449 1376.4176 -531.16267 1374.3942 -528.99341 curveto
1373.0452 -527.5533 1371.523 -526.45044 1369.8278 -525.68481 curveto
1368.1324 -524.93742 1366.346 -524.56372 1364.4684 -524.56372 curveto
1362.2991 -524.56372 1360.4762 -525.01034 1358.9996 -525.90356 curveto
1357.5231 -526.81502 1356.4202 -528.16398 1355.691 -529.95044 curveto
1352.5465 -513.70825 lineto
1347.5153 -513.70825 lineto
1355.7457 -555.98169 lineto
1360.777 -555.98169 lineto
1359.8746 -551.33325 lineto
fill
grestore
gsave
0 0 0 setrgbcolor
newpath
1303.0813 -320.20758 moveto
1304.4029 -319.92502 1305.4328 -319.33713 1306.1711 -318.44391 curveto
1306.9185 -317.55067 1307.2922 -316.44781 1307.2922 -315.13531 curveto
1307.2922 -313.12099 1306.5995 -311.5624 1305.2141 -310.45953 curveto
1303.8287 -309.35667 1301.8599 -308.80524 1299.3079 -308.80524 curveto
1298.4511 -308.80524 1297.567 -308.89183 1296.6555 -309.065 curveto
1295.7532 -309.22906 1294.8189 -309.47972 1293.8528 -309.81696 curveto
1293.8528 -312.48297 lineto
1294.6184 -312.03635 1295.4569 -311.69911 1296.3684 -311.47125 curveto
1297.2799 -311.24339 1298.2323 -311.12945 1299.2258 -311.12946 curveto
1300.9576 -311.12945 1302.2746 -311.47125 1303.177 -312.15485 curveto
1304.0884 -312.83844 1304.5442 -313.83192 1304.5442 -315.13531 curveto
1304.5442 -316.33843 1304.1203 -317.27723 1303.2727 -317.95172 curveto
1302.4342 -318.63531 1301.2629 -318.9771 1299.759 -318.97711 curveto
1297.3801 -318.97711 lineto
1297.3801 -321.24664 lineto
1299.8684 -321.24664 lineto
1301.2265 -321.24663 1302.2655 -321.51551 1302.9856 -322.05328 curveto
1303.7056 -322.60015 1304.0657 -323.384 1304.0657 -324.40485 curveto
1304.0657 -325.45301 1303.692 -326.25509 1302.9446 -326.8111 curveto
1302.2063 -327.37618 1301.1444 -327.65873 1299.759 -327.65875 curveto
1299.0025 -327.65873 1298.1913 -327.5767 1297.3254 -327.41266 curveto
1296.4595 -327.24858 1295.5071 -326.99337 1294.468 -326.64703 curveto
1294.468 -329.10797 lineto
1295.5162 -329.39962 1296.496 -329.61837 1297.4075 -329.76422 curveto
1298.328 -329.91003 1299.1939 -329.98295 1300.0051 -329.98297 curveto
1302.1015 -329.98295 1303.7603 -329.50444 1304.9817 -328.54742 curveto
1306.203 -327.59949 1306.8137 -326.31433 1306.8137 -324.69196 curveto
1306.8137 -323.56173 1306.4901 -322.6047 1305.843 -321.82086 curveto
1305.1959 -321.04611 1304.2753 -320.50835 1303.0813 -320.20758 curveto
fill
grestore
gsave
0 0 0 setrgbcolor
newpath
1272.5652 -738.61847 moveto
1277.0769 -738.61847 lineto
1277.0769 -754.19073 lineto
1272.1687 -753.20636 lineto
1272.1687 -755.72198 lineto
1277.0496 -756.70636 lineto
1279.8113 -756.70636 lineto
1279.8113 -738.61847 lineto
1284.323 -738.61847 lineto
1284.323 -736.29425 lineto
1272.5652 -736.29425 lineto
1272.5652 -738.61847 lineto
fill
grestore
gsave
0 0 0 setrgbcolor
newpath
1295.7664 -754.888 moveto
1294.3445 -754.88798 1293.2735 -754.18616 1292.5535 -752.78253 curveto
1291.8425 -751.38799 1291.4871 -749.28708 1291.4871 -746.4798 curveto
1291.4871 -743.68161 1291.8425 -741.5807 1292.5535 -740.17706 curveto
1293.2735 -738.78253 1294.3445 -738.08526 1295.7664 -738.08527 curveto
1297.1973 -738.08526 1298.2683 -738.78253 1298.9792 -740.17706 curveto
1299.6993 -741.5807 1300.0593 -743.68161 1300.0593 -746.4798 curveto
1300.0593 -749.28708 1299.6993 -751.38799 1298.9792 -752.78253 curveto
1298.2683 -754.18616 1297.1973 -754.88798 1295.7664 -754.888 curveto
1295.7664 -757.0755 moveto
1298.0541 -757.07548 1299.7995 -756.16858 1301.0027 -754.3548 curveto
1302.2149 -752.55009 1302.821 -749.9251 1302.821 -746.4798 curveto
1302.821 -743.04359 1302.2149 -740.4186 1301.0027 -738.6048 curveto
1299.7995 -736.80011 1298.0541 -735.89777 1295.7664 -735.89777 curveto
1293.4786 -735.89777 1291.7286 -736.80011 1290.5164 -738.6048 curveto
1289.3132 -740.4186 1288.7117 -743.04359 1288.7117 -746.4798 curveto
1288.7117 -749.9251 1289.3132 -752.55009 1290.5164 -754.3548 curveto
1291.7286 -756.16858 1293.4786 -757.07548 1295.7664 -757.0755 curveto
fill
grestore
gsave
0 0 0 setrgbcolor
newpath
1307.9753 -739.76691 moveto
1310.8601 -739.76691 lineto
1310.8601 -737.41534 lineto
1308.6179 -733.04034 lineto
1306.8542 -733.04034 lineto
1307.9753 -737.41534 lineto
1307.9753 -739.76691 lineto
fill
grestore
gsave
0 0 0 setrgbcolor
newpath
1322.5085 -754.888 moveto
1321.0867 -754.88798 1320.0157 -754.18616 1319.2957 -752.78253 curveto
1318.5847 -751.38799 1318.2292 -749.28708 1318.2292 -746.4798 curveto
1318.2292 -743.68161 1318.5847 -741.5807 1319.2957 -740.17706 curveto
1320.0157 -738.78253 1321.0867 -738.08526 1322.5085 -738.08527 curveto
1323.9395 -738.08526 1325.0105 -738.78253 1325.7214 -740.17706 curveto
1326.4415 -741.5807 1326.8015 -743.68161 1326.8015 -746.4798 curveto
1326.8015 -749.28708 1326.4415 -751.38799 1325.7214 -752.78253 curveto
1325.0105 -754.18616 1323.9395 -754.88798 1322.5085 -754.888 curveto
1322.5085 -757.0755 moveto
1324.7963 -757.07548 1326.5417 -756.16858 1327.7449 -754.3548 curveto
1328.9571 -752.55009 1329.5632 -749.9251 1329.5632 -746.4798 curveto
1329.5632 -743.04359 1328.9571 -740.4186 1327.7449 -738.6048 curveto
1326.5417 -736.80011 1324.7963 -735.89777 1322.5085 -735.89777 curveto
1320.2208 -735.89777 1318.4708 -736.80011 1317.2585 -738.6048 curveto
1316.0554 -740.4186 1315.4539 -743.04359 1315.4539 -746.4798 curveto
1315.4539 -749.9251 1316.0554 -752.55009 1317.2585 -754.3548 curveto
1318.4708 -756.16858 1320.2208 -757.07548 1322.5085 -757.0755 curveto
fill
grestore
gsave
0 0 0 setrgbcolor
newpath
1340.3367 -754.888 moveto
1338.9148 -754.88798 1337.8438 -754.18616 1337.1238 -752.78253 curveto
1336.4128 -751.38799 1336.0574 -749.28708 1336.0574 -746.4798 curveto
1336.0574 -743.68161 1336.4128 -741.5807 1337.1238 -740.17706 curveto
1337.8438 -738.78253 1338.9148 -738.08526 1340.3367 -738.08527 curveto
1341.7676 -738.08526 1342.8386 -738.78253 1343.5496 -740.17706 curveto
1344.2696 -741.5807 1344.6296 -743.68161 1344.6296 -746.4798 curveto
1344.6296 -749.28708 1344.2696 -751.38799 1343.5496 -752.78253 curveto
1342.8386 -754.18616 1341.7676 -754.88798 1340.3367 -754.888 curveto
1340.3367 -757.0755 moveto
1342.6244 -757.07548 1344.3699 -756.16858 1345.573 -754.3548 curveto
1346.7852 -752.55009 1347.3913 -749.9251 1347.3914 -746.4798 curveto
1347.3913 -743.04359 1346.7852 -740.4186 1345.573 -738.6048 curveto
1344.3699 -736.80011 1342.6244 -735.89777 1340.3367 -735.89777 curveto
1338.0489 -735.89777 1336.2989 -736.80011 1335.0867 -738.6048 curveto
1333.8835 -740.4186 1333.282 -743.04359 1333.282 -746.4798 curveto
1333.282 -749.9251 1333.8835 -752.55009 1335.0867 -754.3548 curveto
1336.2989 -756.16858 1338.0489 -757.07548 1340.3367 -757.0755 curveto
fill
grestore
gsave
0 0 0 setrgbcolor
newpath
1358.1648 -754.888 moveto
1356.7429 -754.88798 1355.6719 -754.18616 1354.9519 -752.78253 curveto
1354.241 -751.38799 1353.8855 -749.28708 1353.8855 -746.4798 curveto
1353.8855 -743.68161 1354.241 -741.5807 1354.9519 -740.17706 curveto
1355.6719 -738.78253 1356.7429 -738.08526 1358.1648 -738.08527 curveto
1359.5958 -738.08526 1360.6667 -738.78253 1361.3777 -740.17706 curveto
1362.0977 -741.5807 1362.4578 -743.68161 1362.4578 -746.4798 curveto
1362.4578 -749.28708 1362.0977 -751.38799 1361.3777 -752.78253 curveto
1360.6667 -754.18616 1359.5958 -754.88798 1358.1648 -754.888 curveto
1358.1648 -757.0755 moveto
1360.4525 -757.07548 1362.198 -756.16858 1363.4011 -754.3548 curveto
1364.6133 -752.55009 1365.2195 -749.9251 1365.2195 -746.4798 curveto
1365.2195 -743.04359 1364.6133 -740.4186 1363.4011 -738.6048 curveto
1362.198 -736.80011 1360.4525 -735.89777 1358.1648 -735.89777 curveto
1355.877 -735.89777 1354.127 -736.80011 1352.9148 -738.6048 curveto
1351.7117 -740.4186 1351.1101 -743.04359 1351.1101 -746.4798 curveto
1351.1101 -749.9251 1351.7117 -752.55009 1352.9148 -754.3548 curveto
1354.127 -756.16858 1355.877 -757.07548 1358.1648 -757.0755 curveto
fill
grestore
grestore
gsave [1 0 0 1 -31.489708 757.0755] concat
gsave
0 0 0 setrgbcolor
newpath
297.85938 -267.85864 moveto
321.0625 -267.85864 lineto
321.0625 -347.94458 lineto
295.82031 -342.88208 lineto
295.82031 -355.81958 lineto
320.92188 -360.88208 lineto
335.125 -360.88208 lineto
335.125 -267.85864 lineto
358.32812 -267.85864 lineto
358.32812 -255.90552 lineto
297.85938 -255.90552 lineto
297.85938 -267.85864 lineto
fill
grestore
gsave
0 0 0 setrgbcolor
newpath
388.28125 -273.76489 moveto
403.11719 -273.76489 lineto
403.11719 -261.67114 lineto
391.58594 -239.17114 lineto
382.51562 -239.17114 lineto
388.28125 -261.67114 lineto
388.28125 -273.76489 lineto
fill
grestore
gsave
0 0 0 setrgbcolor
newpath
463.02344 -351.53052 moveto
455.7109 -351.53042 450.20309 -347.92105 446.5 -340.70239 curveto
442.84372 -333.53044 441.0156 -322.72576 441.01562 -308.28833 curveto
441.0156 -293.89767 442.84372 -283.09299 446.5 -275.87427 curveto
450.20309 -268.70238 455.7109 -265.11645 463.02344 -265.11646 curveto
470.38276 -265.11645 475.89057 -268.70238 479.54688 -275.87427 curveto
483.24993 -283.09299 485.10149 -293.89767 485.10156 -308.28833 curveto
485.10149 -322.72576 483.24993 -333.53044 479.54688 -340.70239 curveto
475.89057 -347.92105 470.38276 -351.53042 463.02344 -351.53052 curveto
463.02344 -362.78052 moveto
474.789 -362.78041 483.76556 -358.11635 489.95312 -348.78833 curveto
496.18742 -339.507 499.30461 -326.00701 499.30469 -308.28833 curveto
499.30461 -290.61642 496.18742 -277.11643 489.95312 -267.78833 curveto
483.76556 -258.50708 474.789 -253.86646 463.02344 -253.86646 curveto
451.25778 -253.86646 442.25779 -258.50708 436.02344 -267.78833 curveto
429.83592 -277.11643 426.74218 -290.61642 426.74219 -308.28833 curveto
426.74218 -326.00701 429.83592 -339.507 436.02344 -348.78833 curveto
442.25779 -358.11635 451.25778 -362.78041 463.02344 -362.78052 curveto
fill
grestore
gsave
0 0 0 setrgbcolor
newpath
554.71094 -351.53052 moveto
547.3984 -351.53042 541.89059 -347.92105 538.1875 -340.70239 curveto
534.53122 -333.53044 532.7031 -322.72576 532.70312 -308.28833 curveto
532.7031 -293.89767 534.53122 -283.09299 538.1875 -275.87427 curveto
541.89059 -268.70238 547.3984 -265.11645 554.71094 -265.11646 curveto
562.07026 -265.11645 567.57807 -268.70238 571.23438 -275.87427 curveto
574.93743 -283.09299 576.78899 -293.89767 576.78906 -308.28833 curveto
576.78899 -322.72576 574.93743 -333.53044 571.23438 -340.70239 curveto
567.57807 -347.92105 562.07026 -351.53042 554.71094 -351.53052 curveto
554.71094 -362.78052 moveto
566.4765 -362.78041 575.45306 -358.11635 581.64062 -348.78833 curveto
587.87492 -339.507 590.99211 -326.00701 590.99219 -308.28833 curveto
590.99211 -290.61642 587.87492 -277.11643 581.64062 -267.78833 curveto
575.45306 -258.50708 566.4765 -253.86646 554.71094 -253.86646 curveto
542.94528 -253.86646 533.94529 -258.50708 527.71094 -267.78833 curveto
521.52342 -277.11643 518.42968 -290.61642 518.42969 -308.28833 curveto
518.42968 -326.00701 521.52342 -339.507 527.71094 -348.78833 curveto
533.94529 -358.11635 542.94528 -362.78041 554.71094 -362.78052 curveto
fill
grestore
gsave
0 0 0 setrgbcolor
newpath
646.39844 -351.53052 moveto
639.0859 -351.53042 633.57809 -347.92105 629.875 -340.70239 curveto
626.21872 -333.53044 624.3906 -322.72576 624.39062 -308.28833 curveto
624.3906 -293.89767 626.21872 -283.09299 629.875 -275.87427 curveto
633.57809 -268.70238 639.0859 -265.11645 646.39844 -265.11646 curveto
653.75776 -265.11645 659.26557 -268.70238 662.92188 -275.87427 curveto
666.62493 -283.09299 668.47649 -293.89767 668.47656 -308.28833 curveto
668.47649 -322.72576 666.62493 -333.53044 662.92188 -340.70239 curveto
659.26557 -347.92105 653.75776 -351.53042 646.39844 -351.53052 curveto
646.39844 -362.78052 moveto
658.164 -362.78041 667.14056 -358.11635 673.32812 -348.78833 curveto
679.56242 -339.507 682.67961 -326.00701 682.67969 -308.28833 curveto
682.67961 -290.61642 679.56242 -277.11643 673.32812 -267.78833 curveto
667.14056 -258.50708 658.164 -253.86646 646.39844 -253.86646 curveto
634.63278 -253.86646 625.63279 -258.50708 619.39844 -267.78833 curveto
613.21092 -277.11643 610.11718 -290.61642 610.11719 -308.28833 curveto
610.11718 -326.00701 613.21092 -339.507 619.39844 -348.78833 curveto
625.63279 -358.11635 634.63278 -362.78041 646.39844 -362.78052 curveto
fill
grestore
gsave
0 0 0 setrgbcolor
newpath
709.1875 -273.76489 moveto
724.02344 -273.76489 lineto
724.02344 -261.67114 lineto
712.49219 -239.17114 lineto
703.42188 -239.17114 lineto
709.1875 -261.67114 lineto
709.1875 -273.76489 lineto
fill
grestore
gsave
0 0 0 setrgbcolor
newpath
783.92969 -351.53052 moveto
776.61715 -351.53042 771.10934 -347.92105 767.40625 -340.70239 curveto
763.74997 -333.53044 761.92185 -322.72576 761.92188 -308.28833 curveto
761.92185 -293.89767 763.74997 -283.09299 767.40625 -275.87427 curveto
771.10934 -268.70238 776.61715 -265.11645 783.92969 -265.11646 curveto
791.28901 -265.11645 796.79682 -268.70238 800.45312 -275.87427 curveto
804.15618 -283.09299 806.00774 -293.89767 806.00781 -308.28833 curveto
806.00774 -322.72576 804.15618 -333.53044 800.45312 -340.70239 curveto
796.79682 -347.92105 791.28901 -351.53042 783.92969 -351.53052 curveto
783.92969 -362.78052 moveto
795.69525 -362.78041 804.67181 -358.11635 810.85938 -348.78833 curveto
817.09367 -339.507 820.21086 -326.00701 820.21094 -308.28833 curveto
820.21086 -290.61642 817.09367 -277.11643 810.85938 -267.78833 curveto
804.67181 -258.50708 795.69525 -253.86646 783.92969 -253.86646 curveto
772.16403 -253.86646 763.16404 -258.50708 756.92969 -267.78833 curveto
750.74217 -277.11643 747.64843 -290.61642 747.64844 -308.28833 curveto
747.64843 -326.00701 750.74217 -339.507 756.92969 -348.78833 curveto
763.16404 -358.11635 772.16403 -362.78041 783.92969 -362.78052 curveto
fill
grestore
gsave
0 0 0 setrgbcolor
newpath
875.61719 -351.53052 moveto
868.30465 -351.53042 862.79684 -347.92105 859.09375 -340.70239 curveto
855.43747 -333.53044 853.60935 -322.72576 853.60938 -308.28833 curveto
853.60935 -293.89767 855.43747 -283.09299 859.09375 -275.87427 curveto
862.79684 -268.70238 868.30465 -265.11645 875.61719 -265.11646 curveto
882.97651 -265.11645 888.48432 -268.70238 892.14062 -275.87427 curveto
895.84368 -283.09299 897.69524 -293.89767 897.69531 -308.28833 curveto
897.69524 -322.72576 895.84368 -333.53044 892.14062 -340.70239 curveto
888.48432 -347.92105 882.97651 -351.53042 875.61719 -351.53052 curveto
875.61719 -362.78052 moveto
887.38275 -362.78041 896.35931 -358.11635 902.54688 -348.78833 curveto
908.78117 -339.507 911.89836 -326.00701 911.89844 -308.28833 curveto
911.89836 -290.61642 908.78117 -277.11643 902.54688 -267.78833 curveto
896.35931 -258.50708 887.38275 -253.86646 875.61719 -253.86646 curveto
863.85153 -253.86646 854.85154 -258.50708 848.61719 -267.78833 curveto
842.42967 -277.11643 839.33593 -290.61642 839.33594 -308.28833 curveto
839.33593 -326.00701 842.42967 -339.507 848.61719 -348.78833 curveto
854.85154 -358.11635 863.85153 -362.78041 875.61719 -362.78052 curveto
fill
grestore
gsave
0 0 0 setrgbcolor
newpath
967.30469 -351.53052 moveto
959.99215 -351.53042 954.48434 -347.92105 950.78125 -340.70239 curveto
947.12497 -333.53044 945.29685 -322.72576 945.29688 -308.28833 curveto
945.29685 -293.89767 947.12497 -283.09299 950.78125 -275.87427 curveto
954.48434 -268.70238 959.99215 -265.11645 967.30469 -265.11646 curveto
974.66401 -265.11645 980.17182 -268.70238 983.82812 -275.87427 curveto
987.53118 -283.09299 989.38274 -293.89767 989.38281 -308.28833 curveto
989.38274 -322.72576 987.53118 -333.53044 983.82812 -340.70239 curveto
980.17182 -347.92105 974.66401 -351.53042 967.30469 -351.53052 curveto
967.30469 -362.78052 moveto
979.07025 -362.78041 988.04681 -358.11635 994.23438 -348.78833 curveto
1000.4687 -339.507 1003.5859 -326.00701 1003.5859 -308.28833 curveto
1003.5859 -290.61642 1000.4687 -277.11643 994.23438 -267.78833 curveto
988.04681 -258.50708 979.07025 -253.86646 967.30469 -253.86646 curveto
955.53903 -253.86646 946.53904 -258.50708 940.30469 -267.78833 curveto
934.11717 -277.11643 931.02343 -290.61642 931.02344 -308.28833 curveto
931.02343 -326.00701 934.11717 -339.507 940.30469 -348.78833 curveto
946.53904 -358.11635 955.53903 -362.78041 967.30469 -362.78052 curveto
fill
grestore
grestore
grestore
showpage
%%EOF
