<?xml version="1.0" encoding="UTF-8" standalone="no"?>
<!-- Created with Inkscape (http://www.inkscape.org/) -->

<svg
   xmlns:dc="http://purl.org/dc/elements/1.1/"
   xmlns:cc="http://creativecommons.org/ns#"
   xmlns:rdf="http://www.w3.org/1999/02/22-rdf-syntax-ns#"
   xmlns:svg="http://www.w3.org/2000/svg"
   xmlns="http://www.w3.org/2000/svg"
   xmlns:xlink="http://www.w3.org/1999/xlink"
   xmlns:sodipodi="http://sodipodi.sourceforge.net/DTD/sodipodi-0.dtd"
   xmlns:inkscape="http://www.inkscape.org/namespaces/inkscape"
   version="1.1"
   width="458.03674"
   height="411.8757"
   viewBox="0 0 458.03674 411.87569"
   id="svg2"
   inkscape:version="0.91 r13725"
   sodipodi:docname="logo3.svg">
  <sodipodi:namedview
     pagecolor="#ffffff"
     bordercolor="#666666"
     borderopacity="1"
     objecttolerance="10"
     gridtolerance="10"
     guidetolerance="10"
     inkscape:pageopacity="0"
     inkscape:pageshadow="2"
     inkscape:window-width="1920"
     inkscape:window-height="1009"
     id="namedview118"
     showgrid="false"
     inkscape:zoom="1.2523617"
     inkscape:cx="252.50101"
     inkscape:cy="178.58319"
     inkscape:window-x="0"
     inkscape:window-y="0"
     inkscape:window-maximized="1"
     inkscape:current-layer="g3975"
     fit-margin-top="0"
     fit-margin-left="0"
     fit-margin-right="0"
     fit-margin-bottom="0"
     showguides="false"
     inkscape:guide-bbox="true"
     inkscape:snap-global="false">
    <sodipodi:guide
       position="-105.30425,-47.809272"
       orientation="0,634.73083"
       id="guide3029" />
    <sodipodi:guide
       position="529.42657,-47.809272"
       orientation="-476.64896,0"
       id="guide3031" />
    <sodipodi:guide
       position="529.42657,428.83968"
       orientation="0,-634.73083"
       id="guide3033" />
    <sodipodi:guide
       position="-105.30425,428.83968"
       orientation="476.64896,0"
       id="guide3035" />
    <sodipodi:guide
       position="-105.30425,-47.809272"
       orientation="0,634.73083"
       id="guide3037" />
    <sodipodi:guide
       position="529.42657,-47.809272"
       orientation="-476.64896,0"
       id="guide3039" />
    <sodipodi:guide
       position="529.42657,428.83968"
       orientation="0,-634.73083"
       id="guide3041" />
    <sodipodi:guide
       position="-105.30425,428.83968"
       orientation="476.64896,0"
       id="guide3043" />
  </sodipodi:namedview>
  <title
     id="title4">Gnuplot</title>
  <desc
     id="desc6">Produced by GNUPLOT 4.6 patchlevel 0 </desc>
  <metadata
     id="metadata190227">
    <rdf:RDF>
      <cc:Work
         rdf:about="">
        <dc:format>image/svg+xml</dc:format>
        <dc:type
           rdf:resource="http://purl.org/dc/dcmitype/StillImage" />
        <dc:title>Gnuplot</dc:title>
      </cc:Work>
    </rdf:RDF>
  </metadata>
  <defs
     id="defs190225">
    <linearGradient
       id="linearGradient4058">
      <stop
         style="stop-color:#fb9549;stop-opacity:1;"
         offset="0"
         id="stop4060" />
      <stop
         style="stop-color:#d54521;stop-opacity:0;"
         offset="1"
         id="stop4062" />
    </linearGradient>
    <linearGradient
       id="linearGradient3964">
      <stop
         style="stop-color:#ff9600;stop-opacity:1;"
         offset="0"
         id="stop3966" />
      <stop
         style="stop-color:#ff0000;stop-opacity:0.69911504;"
         offset="1"
         id="stop3968" />
    </linearGradient>
    <defs
       id="defs11">
      <circle
         cx="0"
         cy="0"
         r="0.5"
         id="gpDot"
         style="stroke-width:0.5"
         sodipodi:cx="0"
         sodipodi:cy="0"
         sodipodi:rx="0.5"
         sodipodi:ry="0.5" />
      <path
         d="M -1,0 H 1 M 0,-1 v 2"
         id="gpPt0"
         style="stroke:currentColor;stroke-width:0.167"
         inkscape:connector-curvature="0" />
      <path
         d="M -1,-1 1,1 M 1,-1 -1,1"
         id="gpPt1"
         style="stroke:currentColor;stroke-width:0.167"
         inkscape:connector-curvature="0" />
      <path
         d="M -1,0 1,0 M 0,-1 0,1 m -1,-2 2,2 m -2,0 2,-2"
         id="gpPt2"
         style="stroke:currentColor;stroke-width:0.167"
         inkscape:connector-curvature="0" />
      <rect
         width="2"
         height="2"
         x="-1"
         y="-1"
         id="gpPt3"
         style="stroke:currentColor;stroke-width:0.167" />
      <rect
         width="2"
         height="2"
         x="-1"
         y="-1"
         id="gpPt4"
         style="fill:currentColor;stroke:currentColor;stroke-width:0.167" />
      <circle
         cx="0"
         cy="0"
         r="1"
         id="gpPt5"
         style="stroke:currentColor;stroke-width:0.167"
         sodipodi:cx="0"
         sodipodi:cy="0"
         sodipodi:rx="1"
         sodipodi:ry="1" />
      <use
         id="gpPt6"
         style="fill:currentColor;stroke:none"
         x="0"
         y="0"
         width="600"
         height="1066"
         xlink:href="#gpPt5" />
      <path
         d="m 0,-1.33 -1.33,2 2.66,0 z"
         id="gpPt7"
         style="stroke:currentColor;stroke-width:0.167"
         inkscape:connector-curvature="0" />
      <use
         id="gpPt8"
         style="fill:currentColor;stroke:none"
         x="0"
         y="0"
         width="600"
         height="1066"
         xlink:href="#gpPt7" />
      <use
         transform="scale(-1,-1)"
         id="gpPt9"
         style="stroke:currentColor"
         x="0"
         y="0"
         width="600"
         height="1066"
         xlink:href="#gpPt7" />
      <use
         id="gpPt10"
         style="fill:currentColor;stroke:none"
         x="0"
         y="0"
         width="600"
         height="1066"
         xlink:href="#gpPt9" />
      <use
         transform="matrix(0.70710678,0.70710678,-0.70710678,0.70710678,0,0)"
         id="gpPt11"
         style="stroke:currentColor"
         x="0"
         y="0"
         width="600"
         height="1066"
         xlink:href="#gpPt3" />
      <use
         id="gpPt12"
         style="fill:currentColor;stroke:none"
         x="0"
         y="0"
         width="600"
         height="1066"
         xlink:href="#gpPt11" />
    </defs>
    <radialGradient
       inkscape:collect="always"
       xlink:href="#linearGradient3964-1"
       id="radialGradient3972-3"
       cx="93.30323"
       cy="338.73746"
       fx="93.30323"
       fy="338.73746"
       r="31.477489"
       gradientTransform="matrix(1,0,0,0.15246637,0,287.09139)"
       gradientUnits="userSpaceOnUse" />
    <linearGradient
       id="linearGradient3964-1">
      <stop
         style="stop-color:#1aefef;stop-opacity:1;"
         offset="0"
         id="stop3966-4" />
      <stop
         style="stop-color:#ffd300;stop-opacity:0.63716817;"
         offset="1"
         id="stop3968-2" />
    </linearGradient>
    <radialGradient
       r="31.477489"
       fy="338.73746"
       fx="93.30323"
       cy="338.73746"
       cx="93.30323"
       gradientTransform="matrix(1,0,0,0.15246637,0,287.09139)"
       gradientUnits="userSpaceOnUse"
       id="radialGradient3989"
       xlink:href="#linearGradient3964-1"
       inkscape:collect="always" />
    <radialGradient
       inkscape:collect="always"
       xlink:href="#linearGradient4058"
       id="radialGradient4066"
       cx="430.55353"
       cy="513.87213"
       fx="430.55353"
       fy="513.87213"
       r="60.977879"
       gradientTransform="matrix(1.6824661,0,0,1.1002504,-300.41473,-79.322822)"
       gradientUnits="userSpaceOnUse" />
    <radialGradient
       inkscape:collect="always"
       xlink:href="#linearGradient3964-0"
       id="radialGradient3972-30"
       cx="93.30323"
       cy="338.73746"
       fx="93.30323"
       fy="338.73746"
       r="31.477489"
       gradientTransform="matrix(-0.59774485,1.0522428,-0.42854953,-0.4193955,294.24054,382.62477)"
       gradientUnits="userSpaceOnUse" />
    <linearGradient
       id="linearGradient3964-0">
      <stop
         style="stop-color:#ff9600;stop-opacity:1;"
         offset="0"
         id="stop3966-48" />
      <stop
         style="stop-color:#ff0000;stop-opacity:0.69911504;"
         offset="1"
         id="stop3968-22" />
    </linearGradient>
    <radialGradient
       inkscape:collect="always"
       xlink:href="#linearGradient4058-5"
       id="radialGradient4066-4"
       cx="430.55353"
       cy="513.87213"
       fx="430.55353"
       fy="513.87213"
       r="60.977879"
       gradientTransform="matrix(1.6824661,0,0,1.1002504,-300.41473,-79.322822)"
       gradientUnits="userSpaceOnUse" />
    <linearGradient
       id="linearGradient4058-5">
      <stop
         style="stop-color:#fb9549;stop-opacity:1;"
         offset="0"
         id="stop4060-8" />
      <stop
         style="stop-color:#d54521;stop-opacity:0;"
         offset="1"
         id="stop4062-4" />
    </linearGradient>
    <radialGradient
       r="60.977879"
       fy="513.87213"
       fx="430.55353"
       cy="513.87213"
       cx="430.55353"
       gradientTransform="matrix(0.76525957,0,0,0.50044227,-124.94075,227.43863)"
       gradientUnits="userSpaceOnUse"
       id="radialGradient4153"
       xlink:href="#linearGradient4058-5"
       inkscape:collect="always" />
    <radialGradient
       r="60.977879"
       fy="513.87213"
       fx="430.55353"
       cy="513.87213"
       cx="430.55353"
       gradientTransform="matrix(0.76525957,0,0,0.50044227,-124.94075,227.43863)"
       gradientUnits="userSpaceOnUse"
       id="radialGradient4153-8"
       xlink:href="#linearGradient4058-5-4"
       inkscape:collect="always" />
    <linearGradient
       id="linearGradient4058-5-4">
      <stop
         style="stop-color:#fb9549;stop-opacity:1;"
         offset="0"
         id="stop4060-8-2" />
      <stop
         style="stop-color:#d54521;stop-opacity:0;"
         offset="1"
         id="stop4062-4-5" />
    </linearGradient>
    <radialGradient
       inkscape:collect="always"
       xlink:href="#linearGradient3964"
       id="radialGradient4242"
       gradientUnits="userSpaceOnUse"
       gradientTransform="matrix(-0.59774485,1.0522428,-0.42854953,-0.4193955,294.24054,382.62477)"
       cx="93.30323"
       cy="338.73746"
       fx="93.30323"
       fy="338.73746"
       r="31.477489" />
    <filter
       style="color-interpolation-filters:sRGB;"
       inkscape:label="Blur"
       id="filter4239">
      <feGaussianBlur
         stdDeviation="2 2"
         result="fbSourceGraphic"
         id="feGaussianBlur4241" />
      <feColorMatrix
         result="fbSourceGraphicAlpha"
         in="fbSourceGraphic"
         values="0 0 0 -1 0 0 0 0 -1 0 0 0 0 -1 0 0 0 0 1 0"
         id="feColorMatrix4243" />
      <feGaussianBlur
         id="feGaussianBlur4245"
         stdDeviation="2 2"
         result="blur"
         in="fbSourceGraphic" />
    </filter>
    <filter
       style="color-interpolation-filters:sRGB;"
       inkscape:label="Blur"
       id="filter4287">
      <feGaussianBlur
         stdDeviation="2 2"
         result="fbSourceGraphic"
         id="feGaussianBlur4289" />
      <feColorMatrix
         result="fbSourceGraphicAlpha"
         in="fbSourceGraphic"
         values="0 0 0 -1 0 0 0 0 -1 0 0 0 0 -1 0 0 0 0 1 0"
         id="feColorMatrix4291" />
      <feGaussianBlur
         id="feGaussianBlur4293"
         stdDeviation="2 2"
         result="fbSourceGraphic"
         in="fbSourceGraphic" />
      <feColorMatrix
         result="fbSourceGraphicAlpha"
         in="fbSourceGraphic"
         values="0 0 0 -1 0 0 0 0 -1 0 0 0 0 -1 0 0 0 0 1 0"
         id="feColorMatrix4295" />
      <feGaussianBlur
         id="feGaussianBlur4297"
         stdDeviation="2 2"
         result="blur"
         in="fbSourceGraphic" />
    </filter>
  </defs>
  <g
     id="g3025"
     transform="matrix(0.99942677,0,0,1.2448237,-146.0064,-2.6837937)">
    <path
       d="m 352.30591,94.43972 c -47.06159,-81.513073 -157.63135,-59.566103 -157.63135,0 0,59.56607 113.00602,77.2933 157.63135,0 z"
       id="path582979"
       style="color:#000000;fill:#d40000;fill-opacity:0.79215686;stroke:#2e3436;stroke-width:3;stroke-linecap:butt;stroke-linejoin:miter;stroke-miterlimit:4;stroke-opacity:1;stroke-dashoffset:0;marker:none;visibility:visible;display:inline;overflow:visible;enable-background:accumulate"
       inkscape:connector-curvature="0" />
    <path
       d="m 352.57146,95.04649 c 74.23844,-140.212243 248.65936,-102.4608326 248.65936,0 0,102.46082 -178.26406,132.95377 -248.65936,0 z"
       id="path582981"
       style="color:#000000;fill:#d40000;fill-opacity:0.79166667;stroke:#2e3436;stroke-width:3;stroke-linecap:butt;stroke-linejoin:miter;stroke-miterlimit:4;stroke-opacity:1;stroke-dashoffset:0;marker:none;visibility:visible;display:inline;overflow:visible;enable-background:accumulate"
       inkscape:connector-curvature="0" />
  </g>
  <g
     id="g3986"
     transform="matrix(0.99942677,0,0,1.2448237,-86.737152,-305.11035)">
    <path
       d="m 251.20836,484.61434 a 46.663903,30.515909 0 1 0 -93.3278,0 46.663903,30.515909 0 0 0 93.3278,0 z"
       id="path289104-1-0"
       style="color:#000000;display:inline;overflow:visible;visibility:visible;fill:url(#radialGradient4153);fill-opacity:1;stroke:none;stroke-width:3;marker:none;enable-background:accumulate"
       inkscape:connector-curvature="0" />
    <path
       d="m 290.89213,485.69618 c -47.06159,-81.51307 -157.63135,-59.5661 -157.63135,0 0,59.56607 113.00602,77.2933 157.63135,0 z"
       id="path289094"
       style="color:#000000;display:inline;overflow:visible;visibility:visible;fill:none;stroke:#2e3436;stroke-width:3;stroke-linecap:butt;stroke-linejoin:miter;stroke-miterlimit:4;stroke-dashoffset:0;stroke-opacity:1;marker:none;enable-background:accumulate"
       inkscape:connector-curvature="0" />
    <path
       d="m 487.25634,484.85358 a 60.97788,39.876548 0 1 0 -121.95576,0 60.97788,39.876548 0 0 0 121.95576,0 z"
       id="path289104"
       style="color:#000000;display:inline;overflow:visible;visibility:visible;fill:#d47c23;fill-opacity:1;stroke:none;stroke-width:3;marker:none;enable-background:accumulate"
       inkscape:connector-curvature="0" />
    <path
       d="m 291.15768,486.30295 c 74.23844,-140.21224 248.65936,-102.46083 248.65936,0 0,102.46082 -178.26406,132.95377 -248.65936,0 z"
       id="path289097"
       style="color:#000000;display:inline;overflow:visible;visibility:visible;fill:none;stroke:#2e3436;stroke-width:3;stroke-linecap:butt;stroke-linejoin:miter;stroke-miterlimit:4;stroke-dashoffset:0;stroke-opacity:1;marker:none;enable-background:accumulate"
       inkscape:connector-curvature="0" />
    <path
       d="m 216.13894,484.85356 a 11.463623,9.6449533 0 1 0 -22.92724,0 11.463623,9.6449533 0 1 0 22.92724,0 z"
       id="path289102"
       style="color:#000000;display:inline;overflow:visible;visibility:visible;fill:#00ffff;fill-opacity:1;stroke:none;stroke-width:3;marker:none;enable-background:accumulate"
       inkscape:connector-curvature="0" />
    <path
       d="m 526.57019,486.09241 a 102.59321,67.090939 0 1 0 -205.18641,0 102.59321,67.090939 0 0 0 205.18641,0 z"
       id="path289104-1"
       style="color:#000000;display:inline;overflow:visible;visibility:visible;fill:url(#radialGradient4066);fill-opacity:1;stroke:none;stroke-width:3;marker:none;enable-background:accumulate"
       inkscape:connector-curvature="0" />
  </g>
  <g
     id="g3975"
     transform="matrix(0.99942677,0,0,1.2448237,-46.919731,263.90831)">
    <path
       d="m 206.5176,-45.85868 c 74.23844,-140.21224 248.65936,-102.46083 248.65936,0 0,102.460817 -178.26406,132.953767 -248.65936,0 z"
       id="path582949"
       style="color:#000000;fill:#ffec52;fill-opacity:1;stroke:#2e3436;stroke-width:3;stroke-linecap:butt;stroke-linejoin:miter;stroke-miterlimit:4;stroke-opacity:1;stroke-dashoffset:0;marker:none;visibility:visible;display:inline;overflow:visible;enable-background:accumulate"
       inkscape:connector-curvature="0" />
    <path
       d="m 206.25205,-46.46545 c -47.06159,-81.51307 -157.631353,-59.5661 -157.631353,0 0,59.566067 113.006023,77.293297 157.631353,0 z"
       id="path582945"
       style="color:#000000;fill:none;stroke:#2e3436;stroke-width:3;stroke-linecap:butt;stroke-linejoin:miter;stroke-miterlimit:4;stroke-opacity:1;stroke-dashoffset:0;marker:none;visibility:visible;display:inline;overflow:visible;enable-background:accumulate"
       inkscape:connector-curvature="0" />
    <use
       x="0"
       y="0"
       xlink:href="#path3942"
       id="use4136"
       transform="matrix(1,0,0,-1.0652173,0,-96.059009)"
       width="700.15826"
       height="601.00281" />
    <ellipse
       style="fill:url(#radialGradient3989);fill-opacity:1"
       id="path3942-0"
       transform="matrix(0.21740595,-1.5664295,1.1945278,0.20361841,-305.03957,30.213388)"
       sodipodi:type="arc"
       sodipodi:ry="4.7992587"
       sodipodi:rx="31.477489"
       sodipodi:cy="338.73746"
       sodipodi:cx="93.30323" />
    <path
       d="m 131.49886,-47.30807 a 11.463623,9.6449533 0 1 0 -22.92724,0 11.463623,9.6449533 0 1 0 22.92724,0 z"
       id="path582951"
       style="color:#000000;fill:#000000;fill-opacity:1;stroke:none;stroke-width:3;marker:none;visibility:visible;display:inline;overflow:visible;enable-background:accumulate"
       inkscape:connector-curvature="0" />
    <text
       xml:space="preserve"
       style="font-style:normal;font-variant:normal;font-weight:bold;font-stretch:normal;font-size:65.58688354px;line-height:125%;font-family:GillSans;-inkscape-font-specification:'GillSans Bold';letter-spacing:0px;word-spacing:0px;fill:#ffffff;fill-opacity:1;stroke:none;filter:url(#filter4239);"
       x="226.94966"
       y="-48.669777"
       id="text3166-4"
       sodipodi:linespacing="125%"
       transform="matrix(1.1160366,0,0,0.89602797,-0.13707802,-1.0594501)"><tspan
         sodipodi:role="line"
         id="tspan3168-5"
         x="226.94966"
         y="-48.669777">binary</tspan></text>
    <text
       xml:space="preserve"
       style="font-style:normal;font-variant:normal;font-weight:bold;font-stretch:normal;font-size:65.58688354px;line-height:125%;font-family:GillSans;-inkscape-font-specification:'GillSans Bold';letter-spacing:0px;word-spacing:0px;fill:#000000;fill-opacity:1;stroke:none"
       x="224.50041"
       y="-47.834259"
       id="text3166"
       sodipodi:linespacing="125%"
       transform="scale(1.1160366,0.89602796)"><tspan
         sodipodi:role="line"
         id="tspan3168"
         x="224.50041"
         y="-47.834259">binary</tspan></text>
    <text
       xml:space="preserve"
       style="font-style:normal;font-weight:normal;font-size:96.19528198px;line-height:125%;font-family:Sans;letter-spacing:0px;word-spacing:0px;fill:#ffffff;fill-opacity:1;stroke:none;filter:url(#filter4287)"
       x="318.89365"
       y="4.1862102"
       id="text3170-8"
       sodipodi:linespacing="125%"
       transform="matrix(1.1160366,0,0,0.89602797,7.0617812,-5.4428782)"><tspan
         sodipodi:role="line"
         id="tspan3172-9"
         x="318.89365"
         y="4.1862102"
         style="font-style:normal;font-variant:normal;font-weight:500;font-stretch:normal;font-size:84.01673889px;font-family:GillSans;-inkscape-font-specification:'GillSans Medium';fill:#ffffff">c</tspan></text>
    <text
       xml:space="preserve"
       style="font-style:normal;font-weight:normal;font-size:96.19528198px;line-height:125%;font-family:Sans;letter-spacing:0px;word-spacing:0px;fill:#000000;fill-opacity:1;stroke:none"
       x="322.49957"
       y="0.74934143"
       id="text3170"
       sodipodi:linespacing="125%"
       transform="scale(1.1160366,0.89602796)"><tspan
         sodipodi:role="line"
         id="tspan3172"
         x="322.49957"
         y="0.74934143"
         style="font-style:normal;font-variant:normal;font-weight:500;font-stretch:normal;font-size:84.01673889px;font-family:GillSans;-inkscape-font-specification:'GillSans Medium'">c</tspan></text>
    <path
       sodipodi:type="arc"
       style="fill:url(#radialGradient4242);fill-opacity:1"
       id="path3942"
       sodipodi:cx="93.30323"
       sodipodi:cy="338.73746"
       sodipodi:rx="35.974045"
       sodipodi:ry="4.7992587"
       d="m 129.27728,338.73746 a 35.974045,4.7992587 0 0 1 -17.98703,4.15628 35.974045,4.7992587 0 0 1 -35.974043,0 35.974045,4.7992587 0 0 1 -17.987022,-4.15628"
       transform="matrix(1.7768033,0,0,1.0868536,-45.211425,-414.67081)"
       sodipodi:start="0"
       sodipodi:end="3.1415927"
       sodipodi:open="true" />
  </g>
  <path
     style="fill:none;stroke:#000000;stroke-width:1px;stroke-linecap:butt;stroke-linejoin:miter;stroke-opacity:1;display:none"
     d="M -33.59768,377.8153 199.0252,19.847076 l 0,0"
     id="path3045"
     inkscape:connector-curvature="0" />
  <path
     style="fill:none;stroke:#000000;stroke-width:1px;stroke-linecap:butt;stroke-linejoin:miter;stroke-opacity:1;display:none"
     d="M 55.047448,377.25068 287.67033,19.282466 l 0,0"
     id="path3045-8"
     inkscape:connector-curvature="0" />
  <path
     style="fill:none;stroke:#000000;stroke-width:1px;stroke-linecap:butt;stroke-linejoin:miter;stroke-opacity:1;display:none"
     d="m 303.47965,380.6384 232.62288,-357.968234 0,0"
     id="path3045-9"
     inkscape:connector-curvature="0" />
</svg>
