#ifndef ENSEMBLE_1D_H
#define ENSEMBLE_1D_H
/*
 * 1D Population ensemble types.
 *
 * See ensemble_log.c for details
 */

#include "ensemble_1D.def"

#undef X
#define X(CODE,STRING,...) ENSEMBLE_##CODE,
enum { ENSEMBLE_1D_LIST };
#undef X
#define X(CODE,STRING,...) STRING,
static const char * const ensemble_1D_strings[] Maybe_unused = { ENSEMBLE_1D_LIST };
#undef X


#define ENSEMBLE_MERGER_MATRIX {                                 \
        {196,197,198,199,200,201,202,203,204,205,206,207,208,209,210},  \
        {197,211,212,213,214,215,216,217,218,219,220,221,222,223,224},  \
        {198,212,225,226,227,228,229,230,231,232,233,234,235,236,237},  \
        {199,213,226,238,239,240,241,242,243,244,245,246,247,248,249},  \
        {200,214,227,239,250,251,252,253,254,255,256,257,258,259,260},  \
        {201,215,228,240,251,261,262,263,264,265,266,267,268,269,270},  \
        {202,216,229,241,252,262,271,272,273,274,275,276,277,278,279},  \
        {203,217,230,242,253,263,272,280,281,282,283,284,285,286,287},  \
        {204,218,231,243,254,264,273,281,288,289,290,291,292,293,294},  \
        {205,219,232,244,255,265,274,282,289,295,296,297,298,299,300},  \
        {206,220,233,245,256,266,275,283,290,296,301,302,303,304,305},  \
        {207,221,234,246,257,267,276,284,291,297,302,306,307,308,309},  \
        {208,222,235,247,258,268,277,285,292,298,303,307,310,311,312},  \
        {209,223,236,248,259,269,278,286,293,299,304,308,311,313,314},  \
        {210,224,237,249,260,270,279,287,294,300,305,309,312,314,315}   \
    }



#endif // ENSEMBLE_1D_H
