module ddos/hashcashserver

go 1.21

require (
	github.com/joho/godotenv v1.5.1 // indirect
	golang.org/x/lint v0.0.0-20210508222113-6edffad5e616 // indirect
	golang.org/x/tools v0.16.1 // indirect
)
