{
  "name": "organ-network-patient",
  "version": "1.0.0",
  "client": {
    "organization": "Patient",
    "connection": {
      "timeout": {
        "peer": {
          "endorser": "300"
        }
      }
    }
  },
  "organizations": {
    "Patient": {
      "mspid": "PatientMSP",
      "peers": ["peer0.patient.organ.com"],
      "organAuthorities": ["ca.patient.organ.com"]
    }
  },
  "peers": {
    "peer0.patient.organ.com": {
      "url": "grpc://peer0.patient.organ.com:8051",
      "tlsCACerts": {
        "path": "network/crypto-config/peerOrganizations/patient.organ.com/tlsca/tlsca.patient.organ.com-cert.pem"
      },
      "grpcOptions": {
        "ssl-target-name-override": "peer0.patient.organ.com"
      }
    }
  },
  "organAuthorities": {
    "ca.patient.organ.com": {
      "url": "http://peer0.patient.organ.com:8054",
      "caName": "ca.patient.organ.com",
      "tlsCACerts": {
        "path": "network/crypto-config/peerOrganizations/patient.organ.com/tlsca/tlsca.patient.organ.com-cert.pem"
      },
      "httpOptions": {
        "verify": false
      }
    }
  }
}
