@startuml
'https://plantuml.com/class-diagram
hide empty members

class Attendance {
    - id: Long
    - status: Enum
    - startDateTime: LocalDateTime
    - endDateTime: LocalDateTime
    - createDate: Date
    - modifyDate: Date
    - amount: BigDecimal
    - employee: Employee
}

enum AttendanceType {
    ABSENT
    BUSINESS TRIP
    SICK LEAVE
    VACATION
    UNPAID VACATION
}

Attendance - AttendanceType


'class AuthDetails {
'    - username: String
'    - password: String
'    - employee: Employee
'}

'AuthDetails "1" - "1" Employee


class Company {
    - id: Long
    - companyName: String
    - corporateEmail: String
    - legalForm: Enum
}

enum LegalForm {
    IEE
    LLP
}

Company -- LegalForm

class DebitingHistory {
    - id: Long
    - createdAt: LocalDateTime
    - company: Company
    - employee: Employee
    - reportStartDate: LocalDate
    - reportEndDate: LocalDate
    - netSalary: BigDecimal
    - employeeTaxesAmount: BigDecimal
    - employeeFirstName: String
    - employeeLastName: String
    - employeePatronymic: String
    - employeeWeekdaysCount: Integer
    - grossSalary: BigDecimal
    - actualGrossSalary: BigDecimal
    - taxDeductions: Set<TaxDeduction>
    - employeeTaxesTotal: BigDecimal
    - netSalary: BigDecimal
}

DebitingHistory -  TaxDeduction
Company -- DebitingHistory


enum ResidentStatus {
    RESIDENT
    NON_RESIDENT
}

class Employee {
    - id: Long
    - hiredAt: LocalDate
    - firstName: String
    - lastName: String
    - patronymic: String
    - email: String
    - grossSalary: BigDecimal
    - residentStatus: Enum
    - company: Company
'    - socialStatuses: Set<SocialStatus>
'    - attendances: Set<Attendance>
'    - debitingHistories: Set<DebitingHistory>
}

Company - Employee
'Employee -- SocialStatus
Employee  -  Attendance
Employee - ResidentStatus
Employee -- DebitingHistory


'class SocialStatus {
'    - id: Long
'    - statusName: String
'    - taxDeductions: Set<TaxDeduction>
'    - socialStatusHasTaxTypes: Set<SocialStatusHasTaxType>
'}
'
'SocialStatus -- SocialStatusHasTaxType
'SocialStatus -- TaxDeduction
'
'
'class SocialStatusHasTaxType {
'    - id: SocialStatusHasTaxTypeId
'    - socialStatus: SocialStatus
'    - tax: Tax
'    - isTaxIncluded: Boolean
'}

'SocialStatusHasTaxType -- SocialStatusHasTaxTypeId
'SocialStatusHasTaxType -- Tax


'class SocialStatusHasTaxTypeId {
'    - socialStatusId: Long
'    - taxTypeId: Long
'}


enum TaxName {
    VOSMS
    OPV
    IPN
}

class Tax {
    - id: Long
    - taxName: Enum
    - interestRate: BigDecimal
    - isEmployeeTaxPayer: Boolean
    - maxAmountToWithdraw: BigDecimal
}

Tax - TaxName


class TaxDeduction {
    - id: Long
    - amount: Long
    - tax: Tax
}

TaxDeduction - Tax

@enduml