module github.com/heroiclabs/nakama/v3

go 1.17

require (
	github.com/blugelabs/bluge v0.1.8
	github.com/blugelabs/bluge_segment_api v0.2.0
	github.com/blugelabs/query_string v0.3.0
	github.com/dop251/goja v0.0.0-20211022113120-dc8c55024d06
	github.com/gofrs/uuid v4.0.0+incompatible
	github.com/golang-jwt/jwt/v4 v4.1.0
	github.com/gorilla/handlers v1.5.1
	github.com/gorilla/mux v1.8.0
	github.com/gorilla/websocket v1.4.2
	github.com/grpc-ecosystem/grpc-gateway/v2 v2.7.0
	github.com/heroiclabs/nakama-common v1.21.1-0.20220117102903-bc0471af4fe1
	github.com/jackc/pgconn v1.10.0
	github.com/jackc/pgerrcode v0.0.0-20201024163028-a0d42d470451
	github.com/jackc/pgtype v1.8.1
	github.com/jackc/pgx/v4 v4.13.0
	github.com/rubenv/sql-migrate v0.0.0-20210408115534-a32ed26c37ea
	github.com/stretchr/testify v1.7.0
	github.com/uber-go/tally/v4 v4.1.1
	go.uber.org/atomic v1.9.0
	go.uber.org/zap v1.19.1
	golang.org/x/crypto v0.0.0-20210921155107-089bfa567519
	google.golang.org/genproto v0.0.0-20211118181313-81c1377c94b1
	google.golang.org/grpc v1.42.0
	google.golang.org/grpc/cmd/protoc-gen-go-grpc v1.1.0
	google.golang.org/protobuf v1.27.1
	gopkg.in/natefinch/lumberjack.v2 v2.0.0-20190411184413-94d9e492cc53
	gopkg.in/yaml.v2 v2.4.0
)

require (
	github.com/RoaringBitmap/roaring v0.9.4 // indirect
	github.com/axiomhq/hyperloglog v0.0.0-20191112132149-a4c4c47bc57f // indirect
	github.com/beorn7/perks v1.0.1 // indirect
	github.com/bits-and-blooms/bitset v1.2.0 // indirect
	github.com/blevesearch/go-porterstemmer v1.0.3 // indirect
	github.com/blevesearch/mmap-go v1.0.3 // indirect
	github.com/blevesearch/segment v0.9.0 // indirect
	github.com/blevesearch/snowballstem v0.9.0 // indirect
	github.com/blevesearch/vellum v1.0.7 // indirect
	github.com/blugelabs/ice v0.2.0 // indirect
	github.com/caio/go-tdigest v3.1.0+incompatible // indirect
	github.com/cespare/xxhash/v2 v2.1.2 // indirect
	github.com/davecgh/go-spew v1.1.1 // indirect
	github.com/dgryski/go-metro v0.0.0-20180109044635-280f6062b5bc // indirect
	github.com/dlclark/regexp2 v1.4.1-0.20201116162257-a2a8dda75c91 // indirect
	github.com/felixge/httpsnoop v1.0.1 // indirect
	github.com/ghodss/yaml v1.0.0 // indirect
	github.com/go-sourcemap/sourcemap v2.1.3+incompatible // indirect
	github.com/golang/glog v1.0.0 // indirect
	github.com/golang/protobuf v1.5.2 // indirect
	github.com/golang/snappy v0.0.1 // indirect
	github.com/jackc/chunkreader/v2 v2.0.1 // indirect
	github.com/jackc/pgio v1.0.0 // indirect
	github.com/jackc/pgpassfile v1.0.0 // indirect
	github.com/jackc/pgproto3/v2 v2.1.1 // indirect
	github.com/jackc/pgservicefile v0.0.0-20200714003250-2b9c44734f2b // indirect
	github.com/matttproud/golang_protobuf_extensions v1.0.1 // indirect
	github.com/mschoch/smat v0.2.0 // indirect
	github.com/pkg/errors v0.9.1 // indirect
	github.com/pmezard/go-difflib v1.0.0 // indirect
	github.com/prometheus/client_golang v1.11.1-0.20211129121811-6d5cf25fcc34 // indirect
	github.com/prometheus/client_model v0.2.0 // indirect
	github.com/prometheus/common v0.29.0 // indirect
	github.com/prometheus/procfs v0.6.0 // indirect
	github.com/twmb/murmur3 v1.1.6 // indirect
	github.com/ziutek/mymysql v1.5.4 // indirect
	go.uber.org/multierr v1.6.0 // indirect
	golang.org/x/net v0.0.0-20210525063256-abc453219eb5 // indirect
	golang.org/x/sys v0.0.0-20210615035016-665e8c7367d1 // indirect
	golang.org/x/text v0.3.7 // indirect
	gopkg.in/gorp.v1 v1.7.2 // indirect
	gopkg.in/yaml.v3 v3.0.0-20210107192922-496545a6307b // indirect
)

replace github.com/heroiclabe/nakama-common => ../nakama-common
