<svg width="17" height="17" viewBox="0 0 17 17" fill="none" xmlns="http://www.w3.org/2000/svg">
<g clip-path="url(#clip0)">
<path d="M8.1 6.44269V8.57082C8.91562 8.75519 9.64062 9.05832 10.4 9.26769V7.13644C9.5875 6.95519 8.85625 6.65207 8.1 6.44269ZM15.0781 2.59894C14.0063 3.09582 12.6875 3.59582 11.4219 3.59582C9.75 3.59582 8.36563 2.50832 6.25938 2.50832C5.47813 2.50832 4.78125 2.64582 4.13438 2.88332C4.22188 2.65519 4.2625 2.40832 4.24688 2.14582C4.19062 1.25832 3.4625 0.545818 2.57188 0.508318C1.57188 0.467693 0.75 1.26769 0.75 2.25832C0.75 2.85207 1.04688 3.37707 1.5 3.69269V15.7583C1.5 16.1739 1.83438 16.5083 2.25 16.5083H2.75C3.16563 16.5083 3.5 16.1739 3.5 15.7583V12.8083C4.38438 12.4302 5.4875 12.1177 7.075 12.1177C8.75 12.1177 10.1313 13.2052 12.2375 13.2052C13.7438 13.2052 14.9469 12.6958 16.0656 11.9271C16.3375 11.7396 16.4969 11.4333 16.4969 11.1021V3.50519C16.5 2.77707 15.7406 2.29269 15.0781 2.59894ZM5.8 10.6802C4.99375 10.7646 4.2375 10.9364 3.5 11.1989V8.99582C4.31875 8.70519 4.98438 8.52707 5.8 8.45207V10.6802ZM15 6.47707C14.2625 6.78332 13.5531 7.08644 12.7 7.22394V9.44582C13.475 9.33957 14.3062 9.07707 15 8.63332V10.8364C14.2156 11.3396 13.4844 11.6083 12.7 11.6833V9.44582C11.8562 9.56144 11.2031 9.49269 10.4 9.27082V11.3771C9.65312 11.1458 8.92188 10.8552 8.1 10.7114V8.57082C7.48438 8.43332 6.825 8.35832 5.8 8.45207V6.26457C5.1 6.36144 4.40625 6.58332 3.5 6.91769V4.71457C4.5375 4.33332 5.06563 4.09582 5.8 4.02707V6.26457C6.64375 6.14894 7.3125 6.22394 8.1 6.44269V4.33644C8.84062 4.56769 9.575 4.85832 10.4 5.00207V7.13957C11.1406 7.30519 11.8875 7.35519 12.7 7.22394V4.97707C13.5437 4.82707 14.3344 4.55207 15 4.27394V6.47707Z" fill="#424B54"/>
</g>
<defs>
<clipPath id="clip0">
<rect width="16" height="16" fill="white" transform="translate(0.5 0.508301)"/>
</clipPath>
</defs>
</svg>
