<svg width="33" height="32" viewBox="0 0 33 32" fill="none" xmlns="http://www.w3.org/2000/svg">
<path d="M16.5 0C7.73013 0 0.5 7.13356 0.5 16C0.5 24.8216 7.69075 32 16.5 32C25.334 32 32.5 24.7941 32.5 16C32.5 7.12181 25.2559 0 16.5 0ZM17.5435 5.749L21.3563 2.97881C23.7413 3.8715 25.8177 5.39213 27.378 7.35038L25.9208 11.8355L21.6394 13.2267L17.5435 10.2509V5.749ZM11.6438 2.97887L15.4566 5.74906V10.251L11.3606 13.2268L7.07925 11.8356L5.62206 7.35044C7.18237 5.39213 9.25881 3.8715 11.6438 2.97887ZM4.90269 23.6688C3.54588 21.6239 2.72787 19.1998 2.61706 16.5939L6.43419 13.8204L10.7077 15.209L12.2752 20.0334L9.634 23.6688H4.90269V23.6688ZM20.2159 29.3939C19.0309 29.7232 17.7884 29.9131 16.5 29.9131C15.2116 29.9131 13.9691 29.7232 12.7841 29.3939L11.3226 24.8954L13.9604 21.2646H19.0397L21.6776 24.8954L20.2159 29.3939ZM23.3659 23.6688L20.7248 20.0335L22.2923 15.2091L26.5659 13.8205L30.3831 16.5937C30.2723 19.1996 29.4542 21.6237 28.0974 23.6688H23.3659Z" fill="#2F3840"/>
</svg>
