<svg width="17" height="16" viewBox="0 0 17 16" fill="none" xmlns="http://www.w3.org/2000/svg">
<g clip-path="url(#clip0)">
<path d="M8.1 5.93439V8.06252C8.91562 8.24689 9.64062 8.55002 10.4 8.75939V6.62814C9.5875 6.44689 8.85625 6.14377 8.1 5.93439ZM15.0781 2.09064C14.0063 2.58752 12.6875 3.08752 11.4219 3.08752C9.75 3.08752 8.36563 2.00002 6.25938 2.00002C5.47813 2.00002 4.78125 2.13752 4.13438 2.37502C4.22188 2.14689 4.2625 1.90002 4.24688 1.63752C4.19062 0.750017 3.4625 0.0375169 2.57188 1.69252e-05C1.57188 -0.0406081 0.75 0.759392 0.75 1.75002C0.75 2.34377 1.04688 2.86877 1.5 3.18439V15.25C1.5 15.6656 1.83438 16 2.25 16H2.75C3.16563 16 3.5 15.6656 3.5 15.25V12.3C4.38438 11.9219 5.4875 11.6094 7.075 11.6094C8.75 11.6094 10.1313 12.6969 12.2375 12.6969C13.7438 12.6969 14.9469 12.1875 16.0656 11.4188C16.3375 11.2313 16.4969 10.925 16.4969 10.5938V2.99689C16.5 2.26877 15.7406 1.78439 15.0781 2.09064ZM5.8 10.1719C4.99375 10.2563 4.2375 10.4281 3.5 10.6906V8.48752C4.31875 8.19689 4.98438 8.01877 5.8 7.94377V10.1719ZM15 5.96877C14.2625 6.27502 13.5531 6.57814 12.7 6.71564V8.93752C13.475 8.83127 14.3062 8.56877 15 8.12502V10.3281C14.2156 10.8313 13.4844 11.1 12.7 11.175V8.93752C11.8562 9.05314 11.2031 8.98439 10.4 8.76252V10.8688C9.65312 10.6375 8.92188 10.3469 8.1 10.2031V8.06252C7.48438 7.92502 6.825 7.85002 5.8 7.94377V5.75627C5.1 5.85314 4.40625 6.07502 3.5 6.40939V4.20627C4.5375 3.82502 5.06563 3.58752 5.8 3.51877V5.75627C6.64375 5.64064 7.3125 5.71564 8.1 5.93439V3.82814C8.84062 4.05939 9.575 4.35002 10.4 4.49377V6.63127C11.1406 6.79689 11.8875 6.84689 12.7 6.71564V4.46877C13.5437 4.31877 14.3344 4.04377 15 3.76564V5.96877Z" fill="#7B858E"/>
</g>
<defs>
<clipPath id="clip0">
<rect width="16" height="16" fill="white" transform="translate(0.5)"/>
</clipPath>
</defs>
</svg>
