<svg width="10" height="8" viewBox="0 0 10 8" fill="none" xmlns="http://www.w3.org/2000/svg">
<path d="M0.057169 7.482C0.0150986 7.40112 -0.00415133 7.3103 0.0014868 7.21931C0.00712493 7.12831 0.0374356 7.04057 0.0891686 6.9655L4.58917 0.4655C4.63519 0.399081 4.69661 0.344803 4.76819 0.307315C4.83977 0.269826 4.91937 0.250244 5.00017 0.250244C5.08097 0.250244 5.16057 0.269826 5.23215 0.307315C5.30373 0.344803 5.36515 0.399081 5.41117 0.4655L9.91117 6.9655C9.96307 7.04051 9.99347 7.1283 9.99906 7.21934C10.0047 7.31039 9.98523 7.40123 9.9429 7.48204C9.90057 7.56284 9.83694 7.63052 9.7589 7.67775C9.68086 7.72498 9.59139 7.74997 9.50017 7.75L0.500169 7.75C0.4089 7.75001 0.319368 7.72505 0.241278 7.67781C0.163187 7.63056 0.0995178 7.56285 0.057169 7.482Z" fill="#00B607"/>
</svg>
