<svg width="17" height="16" viewBox="0 0 17 16" fill="none" xmlns="http://www.w3.org/2000/svg">
<path d="M8.5 1C7.11553 1 5.76216 1.41054 4.61101 2.17971C3.45987 2.94888 2.56266 4.04213 2.03285 5.32122C1.50303 6.6003 1.36441 8.00776 1.63451 9.36563C1.9046 10.7235 2.57129 11.9708 3.55026 12.9497C4.52922 13.9287 5.7765 14.5954 7.13437 14.8655C8.49224 15.1356 9.8997 14.997 11.1788 14.4672C12.4579 13.9373 13.5511 13.0401 14.3203 11.889C15.0895 10.7378 15.5 9.38447 15.5 8C15.5 6.14348 14.7625 4.36301 13.4497 3.05025C12.137 1.7375 10.3565 1 8.5 1ZM12.24 8.44L6.74 11.44C6.66399 11.4839 6.57777 11.507 6.49 11.507C6.40223 11.507 6.31601 11.4839 6.24 11.44C6.16482 11.3943 6.10303 11.3295 6.06089 11.2522C6.01875 11.175 5.99775 11.088 6 11V5C6.00002 4.91323 6.02261 4.82795 6.06557 4.75256C6.10853 4.67717 6.17036 4.61425 6.245 4.57C6.32101 4.52612 6.40723 4.50301 6.495 4.50301C6.58277 4.50301 6.66899 4.52612 6.745 4.57L12.245 7.57C12.3244 7.61284 12.3907 7.67636 12.4369 7.75382C12.4831 7.83128 12.5075 7.9198 12.5075 8.01C12.5075 8.1002 12.4831 8.18872 12.4369 8.26618C12.3907 8.34364 12.3244 8.40716 12.245 8.45L12.24 8.44Z" fill="url(#paint0_linear)"/>
<defs>
<linearGradient id="paint0_linear" x1="1.5" y1="2.3962" x2="14.0473" y2="12.6057" gradientUnits="userSpaceOnUse">
<stop stop-color="#368EF5"/>
<stop offset="1" stop-color="#5CC0FF"/>
</linearGradient>
</defs>
</svg>
