<svg width="24" height="25" viewBox="0 0 24 25" fill="none" xmlns="http://www.w3.org/2000/svg">
<path fill-rule="evenodd" clip-rule="evenodd" d="M17.6377 6.11063V10.9425V20.5L12.0005 16.7424L6.36328 20.5V6.11063C6.36328 5.22237 7.08565 4.5 7.97391 4.5H16.0271C16.9153 4.5 17.6377 5.22237 17.6377 6.11063ZM12.6045 7.29943V9.91671H15.2217V11.1247H12.6045V13.742H11.3965L11.3965 11.1247H8.77923V9.91671H11.3965V7.29943H12.6045Z" fill="white"/>
</svg>
