<svg width="20" height="21" viewBox="0 0 20 21" fill="none" xmlns="http://www.w3.org/2000/svg">
<path d="M10.9996 3.02734C10.7344 3.02734 10.48 3.1327 10.2925 3.32024C10.1049 3.50777 9.99959 3.76213 9.99959 4.02734C9.99959 4.29256 10.1049 4.54691 10.2925 4.73445C10.48 4.92199 10.7344 5.02734 10.9996 5.02734H13.5856L7.29259 11.3203C7.19708 11.4126 7.1209 11.5229 7.06849 11.6449C7.01608 11.7669 6.9885 11.8982 6.98734 12.0309C6.98619 12.1637 7.01149 12.2954 7.06177 12.4183C7.11205 12.5412 7.18631 12.6528 7.2802 12.7467C7.37409 12.8406 7.48574 12.9149 7.60864 12.9652C7.73154 13.0154 7.86321 13.0407 7.99599 13.0396C8.12877 13.0384 8.25999 13.0109 8.382 12.9584C8.504 12.906 8.61435 12.8299 8.70659 12.7343L14.9996 6.44134V9.02734C14.9996 9.29256 15.1049 9.54691 15.2925 9.73445C15.48 9.92199 15.7344 10.0273 15.9996 10.0273C16.2648 10.0273 16.5192 9.92199 16.7067 9.73445C16.8942 9.54691 16.9996 9.29256 16.9996 9.02734V4.02734C16.9996 3.76213 16.8942 3.50777 16.7067 3.32024C16.5192 3.1327 16.2648 3.02734 15.9996 3.02734H10.9996Z" fill="#DE343A"/>
<path d="M5 5.02734C4.46957 5.02734 3.96086 5.23806 3.58579 5.61313C3.21071 5.9882 3 6.49691 3 7.02734V15.0273C3 15.5578 3.21071 16.0665 3.58579 16.4416C3.96086 16.8166 4.46957 17.0273 5 17.0273H13C13.5304 17.0273 14.0391 16.8166 14.4142 16.4416C14.7893 16.0665 15 15.5578 15 15.0273V12.0273C15 11.7621 14.8946 11.5078 14.7071 11.3202C14.5196 11.1327 14.2652 11.0273 14 11.0273C13.7348 11.0273 13.4804 11.1327 13.2929 11.3202C13.1054 11.5078 13 11.7621 13 12.0273V15.0273H5V7.02734H8C8.26522 7.02734 8.51957 6.92199 8.70711 6.73445C8.89464 6.54691 9 6.29256 9 6.02734C9 5.76213 8.89464 5.50777 8.70711 5.32024C8.51957 5.1327 8.26522 5.02734 8 5.02734H5Z" fill="#DE343A"/>
</svg>
