<svg width="17" height="17" viewBox="0 0 17 17" fill="none" xmlns="http://www.w3.org/2000/svg">
<path d="M2.7353 2.93451C3.65004 1.35013 7.42733 1.81856 11.1719 3.98048C14.9165 6.1424 17.2108 9.17942 16.296 10.7638C15.3814 12.3479 11.6041 11.8795 7.85958 9.71757C4.11502 7.55564 1.82071 4.51863 2.7353 2.93451Z" fill="#C9D2D9"/>
<path d="M7.40083 10.5121C9.31575 11.6177 11.3135 12.3438 13.0262 12.5561C13.9004 12.6646 14.6698 12.6331 15.3114 12.4692L14.3113 14.2014C13.7968 15.0926 12.5801 15.4677 10.8856 15.2574C9.32594 15.0639 7.49953 14.399 5.74246 13.3845C3.98539 12.3701 2.49631 11.1208 1.54888 9.86685C0.51957 8.50449 0.236038 7.26335 0.750599 6.37211L1.75067 4.63993C1.92957 5.27753 2.28695 5.95955 2.81804 6.6624C3.85825 8.03953 5.48591 9.40656 7.40083 10.5121Z" fill="#C9D2D9"/>
</svg>
