<svg width="112" height="112" viewBox="0 0 112 112" fill="none" xmlns="http://www.w3.org/2000/svg">
<ellipse cx="55.9998" cy="53" rx="47.9998" ry="48" fill="#386C6A"/>
<path d="M22.0592 86.9411C26.5164 91.3983 31.8079 94.934 37.6315 97.3462C43.4551 99.7584 49.6968 101 56.0002 101C62.3036 101 68.5453 99.7584 74.3689 97.3462C80.1925 94.934 85.484 91.3983 89.9412 86.9411C94.3984 82.4839 97.934 77.1924 100.346 71.3688C102.758 65.5452 104 59.3034 104 53C104 46.6965 102.758 40.4548 100.346 34.6312C97.934 28.8076 94.3984 23.5161 89.9412 19.0589L56.0002 53L22.0592 86.9411Z" fill="#255855"/>
<g filter="url(#filter0_d_483_17494)">
<ellipse cx="56.0008" cy="53" rx="33.9999" ry="34" fill="white" fill-opacity="0.1" shape-rendering="crispEdges"/>
</g>
<mask id="mask0_483_17494" style="mask-type:alpha" maskUnits="userSpaceOnUse" x="39" y="36" width="34" height="35">
<rect x="39" y="36.002" width="33.9999" height="34" fill="#D9D9D9"/>
</mask>
<g mask="url(#mask0_483_17494)">
<path d="M51.2683 55.2261C51.4808 55.2261 51.6791 55.212 51.8775 55.1836C52.5433 56.8128 54.1441 57.9603 55.9999 57.9603C57.8558 57.9603 59.4566 56.8128 60.1224 55.1836C60.3208 55.212 60.5333 55.2261 60.7316 55.2261C63.1824 55.2261 65.1799 53.2286 65.1799 50.7778C65.1799 49.772 64.8257 48.8086 64.2307 48.0436C64.8399 47.2786 65.1799 46.3153 65.1799 45.3095C65.1799 42.8586 63.1824 40.8611 60.7316 40.8611C60.5191 40.8611 60.3208 40.8753 60.1224 40.9036C59.4566 39.2745 57.8558 38.127 55.9999 38.127C54.1441 38.127 52.5433 39.2745 51.8775 40.9036C51.6791 40.8753 51.4666 40.8611 51.2683 40.8611C48.8175 40.8611 46.82 42.8586 46.82 45.3095C46.82 46.3153 47.1741 47.2786 47.7691 48.0436C47.16 48.8086 46.8058 49.772 46.8058 50.7778C46.8058 53.2286 48.8033 55.2261 51.2683 55.2261ZM60.7316 52.3928C60.3916 52.3928 60.0799 52.2936 59.8249 52.1095L58.6774 51.302C59.4566 50.6645 60.0091 49.7578 60.1791 48.7095L61.4258 49.3045C61.9924 49.5736 62.3607 50.1403 62.3607 50.7636C62.3607 51.6703 61.6241 52.3928 60.7316 52.3928ZM59.8108 43.9778C60.0941 43.7936 60.4058 43.6945 60.7316 43.6945C61.6241 43.6945 62.3466 44.417 62.3466 45.3095C62.3466 45.9328 61.9924 46.4853 61.4116 46.7686L60.1649 47.3636C59.9949 46.3153 59.4424 45.4086 58.6491 44.7711L59.8108 43.9778ZM55.9999 40.9603C56.8783 40.9603 57.5866 41.6545 57.6149 42.5186L57.4591 44.0628C57.0058 43.8928 56.5099 43.7936 55.9999 43.7936C55.4899 43.7936 55.0083 43.8928 54.5549 44.0628L54.385 42.5186C54.4133 41.6545 55.1216 40.9603 55.9999 40.9603ZM57.4166 48.0436C57.4166 48.8228 56.7791 49.4603 55.9999 49.4603C55.2208 49.4603 54.5833 48.8228 54.5833 48.0436C54.5833 47.2645 55.2208 46.627 55.9999 46.627C56.7791 46.627 57.4166 47.2645 57.4166 48.0436ZM54.5549 52.0245C55.0083 52.1945 55.4899 52.2936 55.9999 52.2936C56.5099 52.2936 57.0058 52.1945 57.4591 52.0245L57.6149 53.5686C57.5866 54.4328 56.8783 55.127 55.9999 55.127C55.1216 55.127 54.4133 54.4328 54.385 53.5686L54.5549 52.0245ZM51.2683 43.6945C51.6083 43.6945 51.92 43.7936 52.175 43.9778L53.3225 44.7711C52.5433 45.4086 51.9908 46.3153 51.8208 47.3636L50.5741 46.7686C50.0075 46.4853 49.6391 45.9328 49.6391 45.3095C49.6391 44.417 50.3758 43.6945 51.2683 43.6945ZM50.5741 49.3186L51.8208 48.7236C51.9908 49.772 52.5433 50.6786 53.3366 51.3161L52.1891 52.0953C51.9058 52.2795 51.5941 52.3786 51.2683 52.3786C50.3758 52.3786 49.6533 51.6561 49.6533 50.7636C49.6391 50.1545 50.0075 49.602 50.5741 49.3186ZM55.9999 67.877C63.0407 67.877 68.7499 62.1678 68.7499 55.127C61.7091 55.127 55.9999 60.8361 55.9999 67.877ZM65.2932 58.5836C64.2874 61.2753 62.1482 63.4286 59.4566 64.4203C60.4624 61.7286 62.6016 59.5895 65.2932 58.5836ZM43.25 55.127C43.25 62.1678 48.9591 67.877 55.9999 67.877C55.9999 60.8361 50.2908 55.127 43.25 55.127ZM46.7067 58.5836C49.3983 59.5895 51.5516 61.7286 52.5433 64.4203C49.8516 63.4145 47.7125 61.2753 46.7067 58.5836Z" fill="white"/>
</g>
<defs>
<filter id="filter0_d_483_17494" x="0.000976562" y="0" width="112" height="112" filterUnits="userSpaceOnUse" color-interpolation-filters="sRGB">
<feFlood flood-opacity="0" result="BackgroundImageFix"/>
<feColorMatrix in="SourceAlpha" type="matrix" values="0 0 0 0 0 0 0 0 0 0 0 0 0 0 0 0 0 0 127 0" result="hardAlpha"/>
<feOffset dy="3"/>
<feGaussianBlur stdDeviation="11"/>
<feComposite in2="hardAlpha" operator="out"/>
<feColorMatrix type="matrix" values="0 0 0 0 0.584375 0 0 0 0 0.685667 0 0 0 0 0.779167 0 0 0 0.2 0"/>
<feBlend mode="normal" in2="BackgroundImageFix" result="effect1_dropShadow_483_17494"/>
<feBlend mode="normal" in="SourceGraphic" in2="effect1_dropShadow_483_17494" result="shape"/>
</filter>
</defs>
</svg>
