<svg width="113" height="113" viewBox="0 0 113 113" fill="none" xmlns="http://www.w3.org/2000/svg">
<ellipse cx="56.9938" cy="53.7676" rx="47.9998" ry="48" fill="#386C6A"/>
<path d="M23.0531 87.7087C27.5103 92.1659 32.8017 95.7016 38.6253 98.1138C44.4489 100.526 50.6906 101.768 56.9941 101.768C63.2975 101.768 69.5392 100.526 75.3628 98.1138C81.1864 95.7016 86.4779 92.1659 90.9351 87.7087C95.3923 83.2515 98.9279 77.96 101.34 72.1364C103.752 66.3128 104.994 60.071 104.994 53.7676C104.994 47.4641 103.752 41.2224 101.34 35.3988C98.9279 29.5752 95.3923 24.2837 90.9351 19.8265L56.9941 53.7676L23.0531 87.7087Z" fill="#255855"/>
<g filter="url(#filter0_d_2151_11276)">
<ellipse cx="56.9949" cy="53.7683" rx="33.9999" ry="34" fill="white" fill-opacity="0.1" shape-rendering="crispEdges"/>
</g>
<mask id="mask0_2151_11276" style="mask-type:alpha" maskUnits="userSpaceOnUse" x="39" y="36" width="35" height="35">
<rect x="39.994" y="36.7698" width="33.9999" height="34" fill="#323232"/>
</mask>
<g mask="url(#mask0_2151_11276)">
<path d="M65.2809 62.0582L60.1809 56.9582M48.7059 45.4832L53.8059 50.5832L48.7059 45.4832Z" stroke="white" stroke-width="2.21" stroke-linecap="round" stroke-linejoin="round"/>
<path d="M48.7059 62.0582L53.8059 56.9582M65.2809 45.4832L60.1809 50.5832L65.2809 45.4832Z" stroke="white" stroke-width="2.21" stroke-linecap="round" stroke-linejoin="round"/>
<path d="M60.1815 50.5828H53.8065V56.9578H60.1815V50.5828Z" stroke="white" stroke-width="2.21" stroke-linecap="round" stroke-linejoin="round"/>
<path d="M48.7065 57.5952C47.8239 57.5952 46.9611 57.8569 46.2273 58.3473C45.4934 58.8377 44.9215 59.5346 44.5837 60.35C44.2459 61.1654 44.1576 62.0627 44.3298 62.9283C44.5019 63.794 44.927 64.5891 45.5511 65.2132C46.1751 65.8373 46.9703 66.2623 47.8359 66.4345C48.7015 66.6067 49.5988 66.5183 50.4142 66.1806C51.2297 65.8428 51.9266 65.2708 52.4169 64.537C52.9073 63.8031 53.169 62.9404 53.169 62.0577M65.2814 49.9453C66.1641 49.9453 67.0268 49.6836 67.7607 49.1932C68.4945 48.7028 69.0665 48.0059 69.4043 47.1905C69.742 46.3751 69.8304 45.4778 69.6582 44.6122C69.486 43.7465 69.061 42.9514 68.4369 42.3273C67.8128 41.7032 67.0177 41.2782 66.152 41.106C65.2864 40.9338 64.3891 41.0222 63.5737 41.36C62.7583 41.6977 62.0614 42.2697 61.571 43.0035C61.0806 43.7374 60.819 44.6002 60.819 45.4828L65.2814 49.9453ZM65.2814 57.5952C66.1641 57.5952 67.0268 57.8569 67.7607 58.3473C68.4945 58.8377 69.0665 59.5346 69.4043 60.35C69.742 61.1654 69.8304 62.0627 69.6582 62.9283C69.486 63.794 69.061 64.5891 68.4369 65.2132C67.8128 65.8373 67.0177 66.2623 66.152 66.4345C65.2864 66.6067 64.3891 66.5183 63.5737 66.1806C62.7583 65.8428 62.0614 65.2708 61.571 64.537C61.0806 63.8031 60.819 62.9404 60.819 62.0577L65.2814 57.5952ZM48.7065 49.9453C47.8239 49.9453 46.9611 49.6836 46.2273 49.1932C45.4934 48.7028 44.9215 48.0059 44.5837 47.1905C44.2459 46.3751 44.1576 45.4778 44.3298 44.6122C44.5019 43.7465 44.927 42.9514 45.5511 42.3273C46.1751 41.7032 46.9703 41.2782 47.8359 41.106C48.7015 40.9338 49.5988 41.0222 50.4142 41.36C51.2297 41.6977 51.9266 42.2697 52.4169 43.0035C52.9073 43.7374 53.169 44.6002 53.169 45.4828L48.7065 49.9453Z" stroke="white" stroke-width="2.21" stroke-linecap="round" stroke-linejoin="round"/>
</g>
<defs>
<filter id="filter0_d_2151_11276" x="0.994995" y="0.768311" width="112" height="112" filterUnits="userSpaceOnUse" color-interpolation-filters="sRGB">
<feFlood flood-opacity="0" result="BackgroundImageFix"/>
<feColorMatrix in="SourceAlpha" type="matrix" values="0 0 0 0 0 0 0 0 0 0 0 0 0 0 0 0 0 0 127 0" result="hardAlpha"/>
<feOffset dy="3"/>
<feGaussianBlur stdDeviation="11"/>
<feComposite in2="hardAlpha" operator="out"/>
<feColorMatrix type="matrix" values="0 0 0 0 0.584375 0 0 0 0 0.685667 0 0 0 0 0.779167 0 0 0 0.2 0"/>
<feBlend mode="normal" in2="BackgroundImageFix" result="effect1_dropShadow_2151_11276"/>
<feBlend mode="normal" in="SourceGraphic" in2="effect1_dropShadow_2151_11276" result="shape"/>
</filter>
</defs>
</svg>
