<svg width="58" height="58" viewBox="0 0 58 58" fill="none" xmlns="http://www.w3.org/2000/svg">
<circle cx="29" cy="29" r="20" fill="white" fill-opacity="0.08"/>
<circle cx="29" cy="29" r="28.5" stroke="white" stroke-opacity="0.45"/>
<mask id="mask0_514_18747" style="mask-type:alpha" maskUnits="userSpaceOnUse" x="20" y="20" width="17" height="17">
<rect x="20" y="20" width="17" height="17" fill="#C4C4C4"/>
</mask>
<g mask="url(#mask0_514_18747)">
<path d="M28.5 20.709L22.125 23.5423V27.7923C22.125 31.7236 24.845 35.3998 28.5 36.2923C32.155 35.3998 34.875 31.7236 34.875 27.7923V23.5423L28.5 20.709ZM33.4583 27.7923C33.4583 30.994 31.3475 33.9477 28.5 34.8261C25.6525 33.9477 23.5417 30.994 23.5417 27.7923V24.4632L28.5 22.2602L33.4583 24.4632V27.7923ZM25.2487 28.2102L24.25 29.209L27.0833 32.0423L32.75 26.3757L31.7513 25.3698L27.0833 30.0377L25.2487 28.2102Z" fill="white"/>
</g>
</svg>
