<svg width="58" height="58" viewBox="0 0 58 58" fill="none" xmlns="http://www.w3.org/2000/svg">
<circle cx="29" cy="29" r="20" fill="white" fill-opacity="0.08"/>
<circle cx="29" cy="29" r="28.5" stroke="white" stroke-opacity="0.45"/>
<mask id="mask0_403_9602" style="mask-type:alpha" maskUnits="userSpaceOnUse" x="20" y="20" width="18" height="18">
<rect x="20" y="20" width="18" height="18" fill="#D9D9D9"/>
</mask>
<g mask="url(#mask0_403_9602)">
<path d="M35 24.5H32V23C32 22.175 31.325 21.5 30.5 21.5H27.5C26.675 21.5 26 22.175 26 23V24.5H23C22.175 24.5 21.5 25.175 21.5 26V35C21.5 35.825 22.175 36.5 23 36.5H35C35.825 36.5 36.5 35.825 36.5 35V26C36.5 25.175 35.825 24.5 35 24.5ZM27.5 23H30.5V24.5H27.5V23ZM35 35H23V26H35V35Z" fill="white"/>
<path d="M28.25 33.5H29.75V31.25H32V29.75H29.75V27.5H28.25V29.75H26V31.25H28.25V33.5Z" fill="white"/>
</g>
</svg>
