<svg width="112" height="112" viewBox="0 0 112 112" fill="none" xmlns="http://www.w3.org/2000/svg">
<circle cx="56" cy="53" r="48" fill="#386C6A"/>
<path d="M22.0589 86.9411C26.5161 91.3983 31.8076 94.934 37.6312 97.3462C43.4548 99.7584 49.6966 101 56 101C62.3035 101 68.5452 99.7584 74.3688 97.3462C80.1924 94.934 85.4839 91.3983 89.9411 86.9411C94.3983 82.4839 97.934 77.1924 100.346 71.3688C102.758 65.5452 104 59.3034 104 53C104 46.6965 102.758 40.4548 100.346 34.6312C97.934 28.8076 94.3983 23.5161 89.9411 19.0589L56 53L22.0589 86.9411Z" fill="#255855"/>
<g filter="url(#filter0_d_465_16370)">
<circle cx="56" cy="53" r="34" fill="white" fill-opacity="0.1" shape-rendering="crispEdges"/>
</g>
<mask id="mask0_465_16370" style="mask-type:alpha" maskUnits="userSpaceOnUse" x="39" y="36" width="34" height="34">
<rect x="39" y="36" width="34" height="34" fill="#C4C4C4"/>
</mask>
<g mask="url(#mask0_465_16370)">
<path d="M67.332 43.0833H62.8412L60.2487 40.25H51.7487L49.1562 43.0833H44.6654C43.107 43.0833 41.832 44.3583 41.832 45.9167V62.9167C41.832 64.475 43.107 65.75 44.6654 65.75H67.332C68.8904 65.75 70.1654 64.475 70.1654 62.9167V45.9167C70.1654 44.3583 68.8904 43.0833 67.332 43.0833ZM67.332 62.9167H44.6654V45.9167H50.4029L52.9954 43.0833H59.002L61.5945 45.9167H67.332V62.9167ZM55.9987 47.3333C52.0887 47.3333 48.9154 50.5067 48.9154 54.4167C48.9154 58.3267 52.0887 61.5 55.9987 61.5C59.9087 61.5 63.082 58.3267 63.082 54.4167C63.082 50.5067 59.9087 47.3333 55.9987 47.3333ZM55.9987 58.6667C53.6612 58.6667 51.7487 56.7542 51.7487 54.4167C51.7487 52.0792 53.6612 50.1667 55.9987 50.1667C58.3362 50.1667 60.2487 52.0792 60.2487 54.4167C60.2487 56.7542 58.3362 58.6667 55.9987 58.6667Z" fill="white"/>
</g>
<defs>
<filter id="filter0_d_465_16370" x="0" y="0" width="112" height="112" filterUnits="userSpaceOnUse" color-interpolation-filters="sRGB">
<feFlood flood-opacity="0" result="BackgroundImageFix"/>
<feColorMatrix in="SourceAlpha" type="matrix" values="0 0 0 0 0 0 0 0 0 0 0 0 0 0 0 0 0 0 127 0" result="hardAlpha"/>
<feOffset dy="3"/>
<feGaussianBlur stdDeviation="11"/>
<feComposite in2="hardAlpha" operator="out"/>
<feColorMatrix type="matrix" values="0 0 0 0 0.584375 0 0 0 0 0.685667 0 0 0 0 0.779167 0 0 0 0.2 0"/>
<feBlend mode="normal" in2="BackgroundImageFix" result="effect1_dropShadow_465_16370"/>
<feBlend mode="normal" in="SourceGraphic" in2="effect1_dropShadow_465_16370" result="shape"/>
</filter>
</defs>
</svg>
