<svg width="112" height="112" viewBox="0 0 112 112" fill="none" xmlns="http://www.w3.org/2000/svg">
<circle cx="56" cy="53" r="48" fill="#386C6A"/>
<path d="M22.0589 86.9411C26.5161 91.3983 31.8076 94.934 37.6312 97.3462C43.4548 99.7584 49.6966 101 56 101C62.3035 101 68.5452 99.7584 74.3688 97.3462C80.1924 94.934 85.4839 91.3983 89.9411 86.9411C94.3983 82.4839 97.934 77.1924 100.346 71.3688C102.758 65.5452 104 59.3034 104 53C104 46.6965 102.758 40.4548 100.346 34.6312C97.934 28.8076 94.3983 23.5161 89.9411 19.0589L56 53L22.0589 86.9411Z" fill="#255855"/>
<g filter="url(#filter0_d_465_16371)">
<circle cx="56" cy="53" r="34" fill="white" fill-opacity="0.1" shape-rendering="crispEdges"/>
</g>
<path d="M57.5 46.6818H59.75M57.5 51.2273H59.75M48.5 55.7727H59.75M48.5 60.3182H59.75M64.25 46.6818H69.3125C70.244 46.6818 71 47.4455 71 48.3864V62.5909C71 63.4951 70.6444 64.3622 70.0115 65.0015C69.3786 65.6408 68.5201 66 67.625 66M64.25 46.6818V62.5909C64.25 63.4951 64.6056 64.3622 65.2385 65.0015C65.8714 65.6408 66.7299 66 67.625 66M64.25 46.6818V42.7045C64.25 41.7636 63.494 41 62.5625 41H45.6875C44.756 41 44 41.7636 44 42.7045V62.5909C44 63.4951 44.3556 64.3622 44.9885 65.0015C45.6214 65.6408 46.4799 66 47.375 66H67.625M48.5 46.6818H53V51.2273H48.5V46.6818Z" stroke="white" stroke-width="2" stroke-linecap="round" stroke-linejoin="round"/>
<defs>
<filter id="filter0_d_465_16371" x="0" y="0" width="112" height="112" filterUnits="userSpaceOnUse" color-interpolation-filters="sRGB">
<feFlood flood-opacity="0" result="BackgroundImageFix"/>
<feColorMatrix in="SourceAlpha" type="matrix" values="0 0 0 0 0 0 0 0 0 0 0 0 0 0 0 0 0 0 127 0" result="hardAlpha"/>
<feOffset dy="3"/>
<feGaussianBlur stdDeviation="11"/>
<feComposite in2="hardAlpha" operator="out"/>
<feColorMatrix type="matrix" values="0 0 0 0 0.584375 0 0 0 0 0.685667 0 0 0 0 0.779167 0 0 0 0.2 0"/>
<feBlend mode="normal" in2="BackgroundImageFix" result="effect1_dropShadow_465_16371"/>
<feBlend mode="normal" in="SourceGraphic" in2="effect1_dropShadow_465_16371" result="shape"/>
</filter>
</defs>
</svg>
