<svg width="112" height="112" viewBox="0 0 112 112" fill="none" xmlns="http://www.w3.org/2000/svg">
<circle cx="56" cy="53" r="48" fill="#386C6A"/>
<path d="M22.0589 86.9411C26.5161 91.3983 31.8076 94.934 37.6312 97.3462C43.4548 99.7584 49.6966 101 56 101C62.3035 101 68.5452 99.7584 74.3688 97.3462C80.1924 94.934 85.4839 91.3983 89.9411 86.9411C94.3983 82.4839 97.934 77.1924 100.346 71.3688C102.758 65.5452 104 59.3034 104 53C104 46.6965 102.758 40.4548 100.346 34.6312C97.934 28.8076 94.3983 23.5161 89.9411 19.0589L56 53L22.0589 86.9411Z" fill="#255855"/>
<g filter="url(#filter0_d_483_17309)">
<circle cx="56" cy="53" r="34" fill="white" fill-opacity="0.1" shape-rendering="crispEdges"/>
</g>
<mask id="mask0_483_17309" style="mask-type:alpha" maskUnits="userSpaceOnUse" x="39" y="36" width="34" height="34">
<rect x="39" y="36" width="34" height="34" fill="#D9D9D9"/>
</mask>
<g mask="url(#mask0_483_17309)">
<mask id="mask1_483_17309" style="mask-type:alpha" maskUnits="userSpaceOnUse" x="39" y="36" width="35" height="34">
<rect x="39.001" y="36" width="34" height="34" fill="#C4C4C4"/>
</mask>
<g mask="url(#mask1_483_17309)">
<path d="M54.3343 63.0833L51.501 65.2083V67.3333L56.4593 65.9167L61.4176 67.3333V65.2083L58.5843 63.0833V55.2917L69.9176 58.8333V56L58.5843 48.9167V41.125C58.5843 39.9492 57.6351 39 56.4593 39C55.2835 39 54.3343 39.9492 54.3343 41.125V48.9167L43.001 56V58.8333L54.3343 55.2917V63.0833Z" fill="white"/>
</g>
</g>
<defs>
<filter id="filter0_d_483_17309" x="0" y="0" width="112" height="112" filterUnits="userSpaceOnUse" color-interpolation-filters="sRGB">
<feFlood flood-opacity="0" result="BackgroundImageFix"/>
<feColorMatrix in="SourceAlpha" type="matrix" values="0 0 0 0 0 0 0 0 0 0 0 0 0 0 0 0 0 0 127 0" result="hardAlpha"/>
<feOffset dy="3"/>
<feGaussianBlur stdDeviation="11"/>
<feComposite in2="hardAlpha" operator="out"/>
<feColorMatrix type="matrix" values="0 0 0 0 0.584375 0 0 0 0 0.685667 0 0 0 0 0.779167 0 0 0 0.2 0"/>
<feBlend mode="normal" in2="BackgroundImageFix" result="effect1_dropShadow_483_17309"/>
<feBlend mode="normal" in="SourceGraphic" in2="effect1_dropShadow_483_17309" result="shape"/>
</filter>
</defs>
</svg>
