<svg width="58" height="58" viewBox="0 0 58 58" fill="none" xmlns="http://www.w3.org/2000/svg">
<circle cx="29" cy="29" r="28.5" stroke="white" stroke-opacity="0.45"/>
<circle cx="29" cy="29" r="20" fill="white" fill-opacity="0.08"/>
<mask id="path-3-inside-1_465_17568" fill="white">
<path d="M22.7007 35.3239H35.3207V22.7041H22.7007V35.3239ZM35.5354 35.7747H22.4646C22.4002 35.7747 22.3573 35.7532 22.3144 35.7103C22.2715 35.6673 22.25 35.603 22.25 35.56V22.468C22.25 22.4037 22.2715 22.3607 22.3144 22.3178C22.3573 22.2749 22.4217 22.2534 22.4646 22.2534H35.5354C35.5998 22.2534 35.6427 22.2749 35.6856 22.3178C35.7285 22.3607 35.75 22.4251 35.75 22.468V35.5386C35.75 35.603 35.7285 35.6459 35.6856 35.6888C35.6427 35.7532 35.5998 35.7747 35.5354 35.7747Z"/>
</mask>
<path d="M22.7007 35.3239H35.3207V22.7041H22.7007V35.3239ZM35.5354 35.7747H22.4646C22.4002 35.7747 22.3573 35.7532 22.3144 35.7103C22.2715 35.6673 22.25 35.603 22.25 35.56V22.468C22.25 22.4037 22.2715 22.3607 22.3144 22.3178C22.3573 22.2749 22.4217 22.2534 22.4646 22.2534H35.5354C35.5998 22.2534 35.6427 22.2749 35.6856 22.3178C35.7285 22.3607 35.75 22.4251 35.75 22.468V35.5386C35.75 35.603 35.7285 35.6459 35.6856 35.6888C35.6427 35.7532 35.5998 35.7747 35.5354 35.7747Z" fill="white"/>
<path d="M22.7007 35.3239H18.9507V39.0739H22.7007V35.3239ZM35.3207 35.3239V39.0739H39.0707V35.3239H35.3207ZM35.3207 22.7041H39.0707V18.9541H35.3207V22.7041ZM22.7007 22.7041V18.9541H18.9507V22.7041H22.7007ZM35.6856 35.6888L33.034 33.0372L32.7714 33.2997L32.5655 33.6087L35.6856 35.6888ZM22.7007 39.0739H35.3207V31.574H22.7007V39.0739ZM39.0707 35.3239V22.7041H31.5708V35.3239H39.0707ZM35.3207 18.9541H22.7007V26.4541H35.3207V18.9541ZM18.9507 22.7041V35.3239H26.4507V22.7041H18.9507ZM35.5354 32.0247H22.4646V39.5246H35.5354V32.0247ZM22.4646 32.0247C22.8699 32.0247 23.3753 32.0966 23.9043 32.3317C24.4171 32.5596 24.766 32.8586 24.966 33.0586L19.6628 38.3619C19.9057 38.6048 20.2976 38.9361 20.8586 39.1854C21.4359 39.4419 21.9949 39.5246 22.4646 39.5246V32.0247ZM24.966 33.0586C25.3712 33.4638 25.609 33.8953 25.7479 34.2425C25.8803 34.5735 26 35.0206 26 35.56H18.5C18.5 36.5304 18.8705 37.5697 19.6628 38.3619L24.966 33.0586ZM26 35.56V22.468H18.5V35.56H26ZM26 22.468C26 22.8734 25.928 23.3788 25.6929 23.9078C25.465 24.4205 25.166 24.7695 24.966 24.9695L19.6628 19.6661C19.4199 19.909 19.0886 20.3009 18.8393 20.862C18.5827 21.4392 18.5 21.9983 18.5 22.468H26ZM24.966 24.9695C24.5608 25.3746 24.1293 25.6125 23.7821 25.7513C23.4511 25.8837 23.004 26.0034 22.4646 26.0034V18.5034C21.4943 18.5034 20.455 18.8739 19.6628 19.6661L24.966 24.9695ZM22.4646 26.0034H35.5354V18.5034H22.4646V26.0034ZM35.5354 26.0034C35.1301 26.0034 34.6247 25.9314 34.0957 25.6963C33.5829 25.4685 33.234 25.1694 33.034 24.9695L38.3372 19.6661C38.0943 19.4232 37.7024 19.092 37.1414 18.8427C36.5641 18.5861 36.0051 18.5034 35.5354 18.5034V26.0034ZM33.034 24.9695C32.6288 24.5643 32.391 24.1327 32.2521 23.7855C32.1197 23.4546 32 23.0074 32 22.468H39.5C39.5 21.4977 39.1295 20.4584 38.3372 19.6661L33.034 24.9695ZM32 22.468V35.5386H39.5V22.468H32ZM32 35.5386C32 35.1333 32.072 34.6278 32.3071 34.0988C32.535 33.5861 32.834 33.2371 33.034 33.0372L38.3372 38.3405C38.5801 38.0976 38.9114 37.7057 39.1607 37.1447C39.4173 36.5674 39.5 36.0083 39.5 35.5386H32ZM32.5655 33.6087C32.7504 33.3313 33.1327 32.8471 33.7975 32.4778C34.4873 32.0946 35.1378 32.0247 35.5354 32.0247V39.5246C35.9974 39.5246 36.7015 39.444 37.4396 39.034C38.1527 38.6379 38.5779 38.1107 38.8058 37.7689L32.5655 33.6087Z" fill="white" mask="url(#path-3-inside-1_465_17568)"/>
<path d="M32.5214 34.7612L32.5214 34.7612L34.6556 33.2635L34.6564 33.226C34.6562 33.226 34.6561 33.226 34.656 33.226C34.1574 33.2152 33.61 33.3127 33.1349 33.5299C32.6616 33.7462 32.2575 34.0828 32.0482 34.5521C32.0331 34.5703 32.0271 34.5926 32.0243 34.6095C32.0211 34.6286 32.0211 34.6473 32.0211 34.6579L32.0211 34.6585C32.0211 34.6691 32.0236 34.6798 32.0258 34.6879C32.0281 34.6963 32.031 34.7051 32.0336 34.7128L32.0337 34.7133C32.0365 34.7216 32.0388 34.7286 32.0405 34.7348C32.0413 34.7378 32.0419 34.7402 32.0422 34.7421C32.0425 34.7437 32.0425 34.7445 32.0426 34.7445C32.0426 34.7445 32.0426 34.7444 32.0426 34.7444C32.0426 34.7674 32.0538 34.7862 32.0635 34.7991C32.0731 34.812 32.0855 34.8243 32.0955 34.8344L32.0965 34.8353C32.1115 34.8504 32.1268 34.858 32.1376 34.8634L32.1384 34.8638C32.1491 34.8691 32.1548 34.8722 32.1608 34.8782C32.1799 34.8973 32.2054 34.9044 32.2241 34.9075C32.2433 34.9107 32.262 34.9107 32.2726 34.9107H32.2732L32.2758 34.9107C32.3173 34.9107 32.3679 34.9107 32.4188 34.8853C32.473 34.8581 32.4994 34.8051 32.5195 34.765C32.5201 34.7637 32.5208 34.7624 32.5214 34.7612Z" fill="white" stroke="white" stroke-width="0.0749996"/>
<path d="M24.3451 32.428C24.3451 32.4279 24.3451 32.4279 24.3451 32.4279L24.3747 32.405C24.0743 32.0187 24.203 31.4177 24.3318 30.8168C24.4391 30.3231 24.5464 29.7651 24.3318 29.6793C24.203 29.6149 24.0743 29.5934 23.924 29.6149M24.3451 32.428C24.1871 32.2248 24.1439 31.9676 24.1548 31.6899C24.1657 31.413 24.2306 31.1099 24.2947 30.8109L24.2951 30.8089L24.2952 30.8088C24.3489 30.5616 24.4019 30.3014 24.4151 30.0927C24.4217 29.9882 24.4181 29.8996 24.4011 29.8331C24.3841 29.7665 24.3557 29.7292 24.3179 29.7141L24.315 29.7129L24.315 29.7128C24.1933 29.652 24.0724 29.6316 23.9297 29.6519M24.3451 32.428C24.7066 32.8958 25.2732 33.0539 25.7925 33.1989C25.8103 33.2039 25.8279 33.2088 25.8455 33.2137C26.1144 33.289 26.3741 33.3633 26.5933 33.469C26.8102 33.5735 26.9838 33.707 27.0863 33.8986C27.1074 34.0053 27.1261 34.1246 27.1066 34.2219C27.0851 34.3295 27.0647 34.4304 27.0044 34.5312C26.9811 34.5663 26.9674 34.5987 26.9639 34.6333C26.9605 34.6678 26.9676 34.7005 26.9791 34.7348C27.0037 34.8088 27.0536 34.8594 27.1052 34.8852C27.1291 34.8972 27.1488 34.904 27.1694 34.9075C27.1886 34.9106 27.2075 34.9106 27.2275 34.9106H27.2293H27.231C27.2511 34.9106 27.2699 34.9106 27.2891 34.9075C27.3098 34.904 27.3294 34.8972 27.3534 34.8852C27.3771 34.8734 27.3969 34.8605 27.4141 34.8433C27.4308 34.8266 27.4435 34.8072 27.4552 34.7842C27.5658 34.6067 27.6096 34.4294 27.6314 34.2334C27.6535 34.0349 27.6315 33.8358 27.5649 33.6581L27.5651 33.658L27.563 33.654C27.255 33.06 26.6183 32.8843 26.002 32.7143L25.9944 32.7122L25.9944 32.7122L25.9935 32.712C25.7357 32.6475 25.4916 32.5838 25.2801 32.4939C25.0689 32.4041 24.893 32.2894 24.7696 32.1249L24.7696 32.1249L24.7689 32.124C24.7318 32.0776 24.7078 32.0112 24.6959 31.9269C24.684 31.8429 24.6845 31.744 24.6938 31.6355C24.7123 31.4185 24.7654 31.1686 24.8191 30.9324L24.8192 30.9321C24.8941 30.5895 24.9652 30.2358 24.9487 29.9348C24.9322 29.6319 24.8264 29.3746 24.5412 29.2377L24.5412 29.2377L24.5402 29.2372C24.3404 29.1484 24.0816 29.1102 23.8344 29.1349C23.5876 29.1596 23.3469 29.2477 23.1883 29.4176L23.2158 29.4432M24.3451 32.428L23.2158 29.7437C23.2801 29.7866 23.3231 29.8081 23.3875 29.8081C23.4518 29.8081 23.4948 29.7866 23.5377 29.7437M23.9297 29.6519C23.9299 29.6519 23.93 29.6519 23.9302 29.6519L23.924 29.6149M23.9297 29.6519C23.9296 29.652 23.9295 29.652 23.9293 29.652L23.924 29.6149M23.9297 29.6519C23.8049 29.6728 23.6621 29.7139 23.5608 29.7736M23.924 29.6149C23.7952 29.6363 23.645 29.6793 23.5377 29.7437M23.5377 29.7437L23.5642 29.7702C23.5631 29.7713 23.5619 29.7724 23.5608 29.7736M23.5377 29.7437L23.557 29.7758C23.5582 29.7751 23.5595 29.7743 23.5608 29.7736M23.5608 29.7736C23.5381 29.7957 23.5139 29.8137 23.4859 29.8262C23.4562 29.8394 23.424 29.8455 23.3875 29.8455C23.3118 29.8455 23.2612 29.819 23.195 29.7749L23.1887 29.7707L23.1892 29.7702L23.1883 29.7693C23.1782 29.7592 23.1659 29.7469 23.1562 29.734C23.1466 29.7211 23.1353 29.7022 23.1353 29.6793C23.1353 29.6793 23.1353 29.6793 23.1353 29.6793C23.1353 29.6793 23.1353 29.6786 23.135 29.6769C23.1347 29.6751 23.1341 29.6727 23.1333 29.6697C23.1316 29.6635 23.1293 29.6565 23.1265 29.6482L23.1264 29.6477C23.1238 29.64 23.1208 29.6311 23.1185 29.6227C23.1163 29.6147 23.1139 29.604 23.1139 29.5934L23.1139 29.5928C23.1139 29.5822 23.1139 29.5635 23.1171 29.5443C23.1196 29.5291 23.1248 29.5092 23.137 29.492C23.1405 29.4761 23.1489 29.4627 23.1562 29.4529C23.1659 29.44 23.1782 29.4277 23.1883 29.4176C23.1886 29.4173 23.1889 29.417 23.1892 29.4167L23.2158 29.4432M23.2158 29.4432C23.5162 29.1213 24.1387 29.0998 24.525 29.2715C25.0615 29.529 24.9328 30.2373 24.7825 30.9241L23.2158 29.4432Z" fill="white" stroke="white" stroke-width="0.0749996"/>
<path d="M28.5387 33.0275C28.1953 32.7699 27.7875 32.6197 27.3583 32.5768C26.7573 32.448 26.1778 32.3192 25.8344 31.8041C25.5187 31.3306 25.6202 30.8389 25.722 30.3457C25.731 30.3025 25.7399 30.2592 25.7486 30.2159C25.8559 29.851 25.8773 29.4647 25.813 29.0784M28.5387 33.0275L28.5135 33.0553C28.514 33.0557 28.5144 33.056 28.5148 33.0564M28.5387 33.0275L28.5162 33.0575C28.5157 33.0571 28.5153 33.0568 28.5148 33.0564M28.5387 33.0275C28.9894 33.4352 29.0967 33.886 29.1397 34.6586M28.5148 33.0564C28.1776 32.8039 27.7769 32.6563 27.3545 32.6141L27.3504 32.6137L27.3504 32.6134C26.7524 32.4853 26.1564 32.3547 25.8032 31.8249C25.4784 31.3377 25.5834 30.8304 25.685 30.3396C25.694 30.2958 25.7031 30.2521 25.7118 30.2086L25.7124 30.2053L25.7126 30.2053C25.818 29.8469 25.8394 29.4671 25.7764 29.087M28.5148 33.0564C28.9529 33.4535 29.0594 33.891 29.1022 34.6597M25.7764 29.087C25.7766 29.0878 25.7769 29.0885 25.7771 29.0893L25.813 29.0784M25.7764 29.087C25.7762 29.0862 25.7761 29.0854 25.776 29.0846L25.813 29.0784M25.7764 29.087C25.6297 28.6087 25.1914 28.2728 24.7178 27.9283L24.7164 27.9273L24.7164 27.9273C24.7031 27.9166 24.6898 27.906 24.6764 27.8952C24.044 27.3899 23.3073 26.8011 23.3717 25.7495L23.3717 25.7491H23.3717C23.426 24.9678 23.7196 24.3513 24.2573 23.9118C24.794 23.4733 25.5698 23.2143 26.5828 23.1389L26.5856 23.1387V23.1388H26.5857H26.5859H26.586H26.5861H26.5862H26.5864H26.5865H26.5866H26.5868H26.5869H26.587H26.5872H26.5873H26.5874H26.5876H26.5877H26.5878H26.588H26.5881H26.5882H26.5884H26.5885H26.5886H26.5888H26.5889H26.589H26.5892H26.5893H26.5895H26.5896H26.5897H26.5899H26.59H26.5902H26.5903H26.5904H26.5906H26.5907H26.5909H26.591H26.5912H26.5913H26.5914H26.5916H26.5917H26.5919H26.592H26.5922H26.5923H26.5925H26.5926H26.5928H26.5929H26.5931H26.5932H26.5934H26.5935H26.5937H26.5938H26.594H26.5941H26.5943H26.5944H26.5946H26.5947H26.5949H26.595H26.5952H26.5954H26.5955H26.5957H26.5958H26.596H26.5961H26.5963H26.5964H26.5966H26.5968H26.5969H26.5971H26.5972H26.5974H26.5976H26.5977H26.5979H26.598H26.5982H26.5984H26.5985H26.5987H26.5988H26.599H26.5992H26.5993H26.5995H26.5997H26.5998H26.6H26.6002H26.6003H26.6005H26.6007H26.6008H26.601H26.6012H26.6013H26.6015H26.6017H26.6018H26.602H26.6022H26.6023H26.6025H26.6027H26.6028H26.603H26.6032H26.6033H26.6035H26.6037H26.6039H26.604H26.6042H26.6044H26.6045H26.6047H26.6049H26.6051H26.6052H26.6054H26.6056H26.6058H26.6059H26.6061H26.6063H26.6065H26.6066H26.6068H26.607H26.6072H26.6073H26.6075H26.6077H26.6079H26.608H26.6082H26.6084H26.6086H26.6087H26.6089H26.6091H26.6093H26.6095H26.6096H26.6098H26.61H26.6102H26.6104H26.6105H26.6107H26.6109H26.6111H26.6113H26.6114H26.6116H26.6118H26.612H26.6122H26.6123H26.6125H26.6127H26.6129H26.6131H26.6132H26.6134H26.6136H26.6138H26.614H26.6142H26.6143H26.6145H26.6147H26.6149H26.6151H26.6153H26.6154H26.6156H26.6158H26.616H26.6162H26.6164H26.6165H26.6167H26.6169H26.6171H26.6173H26.6175H26.6177H26.6178H26.618H26.6182H26.6184H26.6186H26.6188H26.619H26.6191H26.6193H26.6195H26.6197H26.6199H26.6201H26.6203H26.6205H26.6206H26.6208H26.621H26.6212H26.6214H26.6216H26.6218H26.6219H26.6221H26.6223H26.6225H26.6227H26.6229H26.6231H26.6233H26.6235H26.6236H26.6238H26.624H26.6242H26.6244H26.6246H26.6248H26.625H26.6251H26.6253H26.6255H26.6257H26.6259H26.6261H26.6263H26.6265H26.6267H26.6268H26.627H26.6272H26.6274H26.6276H26.6278H26.628H26.6282H26.6284H26.6285H26.6287H26.6289H26.6291H26.6293H26.6295H26.6297H26.6299H26.63H26.6302H26.6304H26.6306H26.6308H26.631H26.6312H26.6314H26.6316H26.6317H26.6319H26.6321H26.6323H26.6325H26.6327H26.6329H26.6331H26.6333H26.6334H26.6336H26.6338H26.634H26.6342H26.6344H26.6346H26.6348H26.6349H26.6351H26.6353H26.6355H26.6357H26.6359H26.6361H26.6363H26.6364H26.6366H26.6368H26.637H26.6372H26.6374H26.6376H26.6377H26.6379H26.6381H26.6383H26.6385H26.6387H26.6389H26.639H26.6392H26.6394H26.6396H26.6398H26.64H26.6402H26.6403H26.6405H26.6407H26.6409H26.6411H26.6413H26.6415H26.6416H26.6418H26.642H26.6422H26.6424H26.6426H26.6427H26.6429H26.6431H26.6433H26.6435H26.6436H26.6438H26.644H26.6442H26.6444H26.6446H26.6447H26.6449H26.6451H26.6453H26.6455H26.6456H26.6458H26.646H26.6462H26.6464H26.6465H26.6467H26.6469H26.6471H26.6473H26.6474H26.6476H26.6478H26.648H26.6482H26.6483H26.6485H26.6487H26.6489H26.649H26.6492H26.6494H26.6496H26.6497H26.6499H26.6501H26.6503H26.6504H26.6506H26.6508H26.651H26.6511H26.6513H26.6515H26.6517H26.6518H26.652H26.6522H26.6524H26.6525H26.6527H26.6529H26.653H26.6532H26.6534H26.6536H26.6537H26.6539H26.6541H26.6542H26.6544H26.6546H26.6547H26.6549H26.6551H26.6553H26.6554H26.6556H26.6558H26.6559H26.6561H26.6563H26.6564H26.6566H26.6568H26.6569H26.6571H26.6572H26.6574H26.6576H26.6577H26.6579H26.6581H26.6582H26.6584H26.6586H26.6587H26.6589H26.659H26.6592H26.6594H26.6595H26.6597H26.6598H26.66H26.6602H26.6603H26.6605H26.6606H26.6608H26.6609H26.6611H26.6613H26.6614H26.6616H26.6617H26.6619H26.662H26.6622H26.6623H26.6625H26.6626H26.6628H26.663H26.6631H26.6633H26.6634H26.6636H26.6637H26.6639H26.664H26.6642H26.6643H26.6645H26.6646H26.6648H26.6649H26.665H26.6652H26.6653H26.6655H26.6656H26.6658H26.6659H26.6661H26.6662H26.6664H26.6665H26.6666H26.6668H26.6669H26.6671H26.6672H26.6673H26.6675H26.6676H26.6678H26.6679H26.668H26.6682H26.6683H26.6684H26.6686H26.6687H26.6689H26.669H26.6691H26.6693H26.6694H26.6695H26.6697H26.6698H26.6699H26.6701H26.6702H26.6703H26.6704H26.6706H26.6707H26.6708H26.671H26.6711H26.6712H26.6713H26.6715C26.6913 23.1388 26.7139 23.1475 26.7312 23.1561C26.7496 23.1654 26.7694 23.1782 26.7838 23.1927L26.816 23.2249L26.8482 23.2571C26.8673 23.2761 26.8743 23.3016 26.8775 23.3203C26.8807 23.3395 26.8807 23.3582 26.8807 23.3688V23.3694V23.37C26.8807 23.3807 26.8807 23.3993 26.8775 23.4185C26.8749 23.4337 26.8698 23.4534 26.8577 23.4705M25.813 29.0784C25.6627 28.5848 25.212 28.2414 24.7398 27.898C24.7278 27.8884 24.7157 27.8787 24.7036 27.869C24.0682 27.3611 23.346 26.7838 23.4091 25.7517C23.5165 24.2065 24.5681 23.3265 26.5856 23.1763H26.6715C26.6929 23.1763 26.7358 23.1977 26.7573 23.2192L26.8217 23.2836C26.8432 23.305 26.8432 23.348 26.8432 23.3694C26.8432 23.3909 26.8432 23.4338 26.8217 23.4553M26.8577 23.4705C26.8587 23.4653 26.8592 23.4602 26.8592 23.4553H26.8217M26.8577 23.4705C26.8549 23.4744 26.8518 23.4782 26.8482 23.4818L26.8217 23.4553M26.8577 23.4705C26.8548 23.4861 26.8483 23.502 26.8418 23.515C26.8326 23.5334 26.8197 23.5532 26.8053 23.5676L26.8044 23.5685C26.7943 23.5786 26.782 23.591 26.7691 23.6006C26.7592 23.608 26.7459 23.6163 26.7299 23.6199M26.8217 23.4553C26.8217 23.4767 26.8002 23.5197 26.7788 23.5411C26.7573 23.5626 26.7358 23.5841 26.7144 23.5841M26.7144 23.5841L26.7409 23.6106C26.7374 23.614 26.7337 23.6171 26.7299 23.6199M26.7144 23.5841C26.6929 23.6055 26.65 23.6055 26.6286 23.6055H26.6285M26.7144 23.5841V23.6216C26.7198 23.6216 26.725 23.6209 26.7299 23.6199M26.7299 23.6199C26.7128 23.6321 26.6929 23.6373 26.6776 23.6398C26.659 23.6429 26.6409 23.643 26.6301 23.643M26.6285 23.6055L26.6317 23.6429C26.6312 23.6429 26.6306 23.643 26.6301 23.643M26.6285 23.6055C24.8471 23.7558 23.9457 24.464 23.8599 25.7732M26.6285 23.6055V23.643L26.6292 23.643C26.6295 23.643 26.6298 23.643 26.6301 23.643M26.6301 23.643C25.7438 23.7179 25.0819 23.9313 24.6315 24.2843C24.1824 24.6362 23.9397 25.13 23.8973 25.7754M23.8599 25.7732L23.8973 25.7752C23.8973 25.7753 23.8973 25.7753 23.8973 25.7754M23.8599 25.7732C23.8169 26.5888 24.3964 27.0609 25.0188 27.5546M23.8599 25.7732L23.8973 25.7757C23.8973 25.7756 23.8973 25.7755 23.8973 25.7754M23.8973 25.7754C23.8557 26.5686 24.4167 27.0292 25.0421 27.5251M25.0188 27.5546L25.042 27.5251C25.042 27.5251 25.042 27.5251 25.0421 27.5251M25.0188 27.5546C25.5125 27.9409 26.0276 28.3487 26.2207 28.9496C26.3281 29.4003 26.3066 29.8725 26.1778 30.3232M25.0188 27.5546L25.0421 27.5252C25.0421 27.5252 25.0421 27.5252 25.0421 27.5251M25.0421 27.5251C25.5338 27.91 26.0592 28.3244 26.2564 28.9382L26.2573 28.9409L26.2572 28.9409C26.3661 29.3982 26.3443 29.8766 26.2142 30.3325M26.2142 30.3325C26.2142 30.3322 26.2143 30.3319 26.2144 30.3315L26.1778 30.3232M26.2142 30.3325C26.2141 30.3329 26.214 30.3332 26.2139 30.3335L26.1778 30.3232M26.2142 30.3325C26.1605 30.5685 26.1132 30.7957 26.1053 31.006C26.0974 31.2161 26.1291 31.4061 26.2308 31.5691M26.1778 30.3232C26.0705 30.7954 25.9847 31.2461 26.1993 31.5895M26.1993 31.5895L26.2305 31.5687C26.2306 31.5688 26.2307 31.569 26.2308 31.5691M26.1993 31.5895C26.4139 31.9114 26.929 32.0617 27.4441 32.169M26.1993 31.5895L26.2311 31.5696C26.231 31.5695 26.2309 31.5693 26.2308 31.5691M26.2308 31.5691C26.3322 31.7209 26.5065 31.8351 26.7234 31.9251C26.9396 32.0147 27.1938 32.0785 27.4503 32.132M27.4441 32.169L27.4488 32.1318C27.4493 32.1318 27.4498 32.1319 27.4503 32.132M27.4441 32.169C27.9592 32.2334 28.4314 32.4265 28.8392 32.7485L29.3543 34.8732C29.2899 34.8732 29.247 34.8518 29.2041 34.8088C29.1611 34.7659 29.1397 34.723 29.1397 34.6586M27.4441 32.169L27.4518 32.1323C27.4513 32.1322 27.4508 32.1321 27.4503 32.132M27.4503 32.132C27.9714 32.1974 28.4495 32.393 28.8624 32.719L28.8653 32.7213L28.8652 32.7214C29.412 33.2463 29.5417 33.8161 29.6063 34.6773L29.6065 34.6801H29.6064V34.6807C29.6064 34.6913 29.6064 34.71 29.6032 34.7292C29.6007 34.7444 29.5955 34.7643 29.5832 34.7814C29.5797 34.7974 29.5714 34.8108 29.564 34.8206C29.5544 34.8335 29.542 34.8458 29.5319 34.8559L29.531 34.8568C29.5208 34.8671 29.5081 34.8798 29.4948 34.8898C29.4819 34.8995 29.4631 34.9107 29.4401 34.9107C29.4404 34.9107 29.4403 34.9107 29.4395 34.9109C29.4386 34.911 29.4371 34.9114 29.4343 34.9122C29.4302 34.9134 29.4215 34.9163 29.4126 34.918C29.3937 34.9218 29.3717 34.9216 29.3458 34.9106C29.3127 34.9097 29.2833 34.9036 29.2559 34.8914C29.2264 34.8783 29.2012 34.859 29.1775 34.8354C29.1539 34.8117 29.1346 34.7865 29.1215 34.757C29.1084 34.7276 29.1023 34.6958 29.1022 34.6597M29.1022 34.6597C29.1022 34.6593 29.1022 34.659 29.1022 34.6586H29.1397M29.1022 34.6597C29.1022 34.66 29.1022 34.6603 29.1022 34.6607L29.1397 34.6586" fill="white" stroke="white" stroke-width="0.0749996"/>
<path d="M30.737 34.9088L30.7363 34.9107H30.7488H30.7917C30.8189 34.9107 30.8461 34.9041 30.8675 34.8933C30.8782 34.888 30.889 34.8809 30.8976 34.8716C30.9029 34.866 30.9085 34.8583 30.9119 34.8489C30.954 34.8042 30.9763 34.7597 30.9964 34.7194L30.997 34.7183L30.9982 34.7189L31.0002 34.7089C31.0848 34.2859 31.2538 33.8836 31.4864 33.5233C31.8474 33.1631 32.2497 32.8884 32.7147 32.7193C33.2572 32.524 33.7346 32.1985 34.1249 31.7648L34.1249 31.7648L34.1262 31.7632C34.3292 31.5108 34.4772 31.1633 34.5854 30.7853C34.6938 30.4067 34.7632 29.9947 34.8076 29.6112C34.8911 28.8903 34.8866 28.2669 34.8858 28.1501C34.8857 28.1427 34.8857 28.1373 34.8857 28.1341V28.1334C34.8857 28.1228 34.8857 28.1041 34.8825 28.085C34.88 28.0697 34.8747 28.0498 34.8625 28.0327C34.859 28.0167 34.8507 28.0034 34.8433 27.9935C34.8337 27.9806 34.8213 27.9683 34.8112 27.9582L34.8103 27.9573L34.7838 27.9838L34.8103 27.9573L34.8094 27.9564C34.7993 27.9463 34.787 27.934 34.7741 27.9243C34.7643 27.9169 34.7509 27.9086 34.7349 27.9051C34.7178 27.8929 34.6979 27.8877 34.6827 27.8851C34.6635 27.8819 34.6448 27.8819 34.6342 27.8819L34.6336 27.8819C34.623 27.8819 34.6123 27.8844 34.6042 27.8866C34.5959 27.8889 34.587 27.8919 34.5793 27.8944L34.5788 27.8946C34.5705 27.8974 34.5635 27.8997 34.5573 27.9014C34.5543 27.9022 34.5519 27.9027 34.5501 27.9031C34.5484 27.9034 34.5477 27.9034 34.5477 27.9034L34.5477 27.9034C34.5247 27.9034 34.5059 27.9146 34.493 27.9243C34.4801 27.934 34.4678 27.9463 34.4577 27.9564L34.4568 27.9573L34.4559 27.9582C34.4458 27.9683 34.4335 27.9806 34.4238 27.9935C34.4164 28.0034 34.4081 28.0167 34.4046 28.0327C34.3924 28.0498 34.3872 28.0697 34.3846 28.085C34.3814 28.1041 34.3814 28.1228 34.3814 28.1334V28.1341C34.3814 28.1345 34.3815 28.1358 34.3815 28.1379C34.3821 28.1919 34.3893 28.7821 34.3173 29.4689C34.2798 29.8259 34.221 30.2081 34.1292 30.554C34.0373 30.9 33.9131 31.2061 33.7467 31.4146C33.4076 31.7746 32.9838 32.05 32.5174 32.2196L32.5174 32.2196L32.5163 32.22C31.9747 32.4366 31.498 32.7616 31.1079 33.1734L31.1075 33.1729L31.1037 33.1787C30.8225 33.6113 30.6056 34.1097 30.5187 34.6092L30.5182 34.6091V34.6157L30.5182 34.6173C30.5182 34.6484 30.5182 34.6834 30.5241 34.7163C30.5304 34.7505 30.5435 34.7853 30.5721 34.8139C30.6206 34.8624 30.6696 34.8863 30.737 34.9088Z" fill="white" stroke="white" stroke-width="0.0749996"/>
<path d="M23.6209 33.8287L23.6208 33.8288L23.6232 33.8305C23.9307 34.0502 24.3049 34.1389 24.6583 34.0734C24.8396 34.0628 24.9738 34.0633 25.0699 34.0835C25.1625 34.103 25.2136 34.1393 25.2399 34.1971C25.2585 34.3148 25.2395 34.4535 25.2 34.5752C25.1859 34.593 25.1802 34.6145 25.1775 34.6309C25.1743 34.65 25.1743 34.6687 25.1743 34.6793V34.6799V34.6805C25.1743 34.6912 25.1743 34.7098 25.1775 34.729C25.1806 34.7477 25.1877 34.7733 25.2067 34.7923L25.2711 34.8567C25.2856 34.8711 25.3054 34.884 25.3238 34.8932C25.341 34.9019 25.3637 34.9106 25.3835 34.9106H25.3836H25.3837H25.3839H25.384H25.3841H25.3842H25.3844H25.3845H25.3846H25.3847H25.3849H25.385H25.3851H25.3852H25.3854H25.3855H25.3856H25.3857H25.3859H25.386H25.3861H25.3863H25.3864H25.3865H25.3866H25.3868H25.3869H25.387H25.3871H25.3873H25.3874H25.3875H25.3876H25.3878H25.3879H25.388H25.3881H25.3883H25.3884H25.3885H25.3886H25.3888H25.3889H25.389H25.3891H25.3893H25.3894H25.3895H25.3896H25.3898H25.3899H25.39H25.3902H25.3903H25.3904H25.3905H25.3907H25.3908H25.3909H25.391H25.3912H25.3913H25.3914H25.3915H25.3917H25.3918H25.3919H25.392H25.3922H25.3923H25.3924H25.3925H25.3927H25.3928H25.3929H25.393H25.3932H25.3933H25.3934H25.3935H25.3937H25.3938H25.3939H25.394H25.3942H25.3943H25.3944H25.3946H25.3947H25.3948H25.3949H25.3951H25.3952H25.3953H25.3954H25.3956H25.3957H25.3958H25.3959H25.3961H25.3962H25.3963H25.3964H25.3966H25.3967H25.3968H25.3969H25.3971H25.3972H25.3973H25.3974H25.3976H25.3977H25.3978H25.3979H25.3981H25.3982H25.3983H25.3985H25.3986H25.3987H25.3988H25.399H25.3991H25.3992H25.3993H25.3995H25.3996H25.3997H25.3998H25.4H25.4001H25.4002H25.4003H25.4005H25.4006H25.4007H25.4008H25.401H25.4011H25.4012H25.4013H25.4015H25.4016H25.4017H25.4018H25.402H25.4021H25.4022H25.4023H25.4025H25.4026H25.4027H25.4029H25.403H25.4031H25.4032H25.4034H25.4035H25.4036H25.4037H25.4039H25.404H25.4041H25.4042H25.4044H25.4045H25.4046H25.4047H25.4049H25.405H25.4051H25.4052H25.4054H25.4055H25.4056H25.4057H25.4059H25.406H25.4061H25.4062H25.4064H25.4065H25.4066H25.4068H25.4069H25.407H25.4071H25.4073H25.4074H25.4075H25.4076H25.4078H25.4079H25.408H25.4081H25.4083H25.4084H25.4085H25.4086H25.4088H25.4089H25.409H25.4091H25.4093H25.4094H25.4095H25.4096H25.4098H25.4099H25.41H25.4101H25.4103H25.4104H25.4105H25.4106H25.4108H25.4109H25.411H25.4112H25.4113H25.4114H25.4115H25.4117H25.4118H25.4119H25.412H25.4122H25.4123H25.4124H25.4125H25.4127H25.4128H25.4129H25.413H25.4132H25.4133H25.4134H25.4135H25.4137H25.4138H25.4139H25.414H25.4142H25.4143H25.4144H25.4145H25.4147H25.4148H25.4149H25.415H25.4152H25.4153H25.4154H25.4156H25.4157H25.4158H25.4159H25.4161H25.4162H25.4163H25.4164H25.4166H25.4167H25.4168H25.4169H25.4171H25.4172H25.4173H25.4174H25.4176H25.4177H25.4178H25.4179H25.4181H25.4182H25.4183H25.4184H25.4186H25.4187H25.4188H25.4189H25.4191H25.4192H25.4193H25.4195H25.4196H25.4197H25.4198H25.42H25.4201H25.4202H25.4203H25.4205H25.4206H25.4207H25.4208H25.421H25.4211H25.4212H25.4213H25.4215H25.4216H25.4217H25.4218H25.422H25.4221H25.4222H25.4223H25.4225H25.4226H25.4227H25.4228H25.423H25.4231H25.4232H25.4233H25.4235H25.4236H25.4237H25.4239H25.424H25.4241H25.4242H25.4244H25.4245H25.4246H25.4247H25.4249H25.425H25.4251H25.4252H25.4254H25.4255H25.4256H25.4257H25.4259H25.426H25.4261H25.4262H25.4264H25.4265H25.4266H25.4267H25.4269H25.427H25.4271H25.4272H25.4274H25.4275H25.4276H25.4278H25.4279H25.428H25.4281H25.4283H25.4284H25.4285H25.4286H25.4288H25.4289H25.429H25.4291H25.4293H25.4294H25.4295H25.4296H25.4298H25.4299H25.43H25.4301H25.4303H25.4304H25.4305H25.4306H25.4308H25.4309H25.431H25.4311H25.4313H25.4314H25.4315H25.4316H25.4318H25.4319H25.432H25.4322H25.4323H25.4324H25.4325H25.4327H25.4328H25.4329H25.433H25.4332H25.4333H25.4334H25.4335H25.4337H25.4338H25.4339H25.434H25.4342H25.4343H25.4344H25.4345H25.4347H25.4348H25.4349H25.435H25.4352H25.4353H25.4354H25.4355H25.4357H25.4358H25.4359H25.4361H25.4362H25.4363H25.4364H25.4366H25.4367H25.4368H25.4369H25.4371H25.4372H25.4373H25.4374H25.4376H25.4377H25.4378H25.4379H25.4381H25.4382H25.4383H25.4384H25.4386H25.4387H25.4388H25.4389H25.4391H25.4392H25.4393H25.4394H25.4396H25.4397H25.4398H25.4399H25.4401H25.4402H25.4403H25.4405H25.4406H25.4407H25.4408H25.441H25.4411H25.4412H25.4413H25.4415H25.4416H25.4417H25.4418H25.442H25.4421H25.4422H25.4423H25.4425H25.4426H25.4427H25.4428H25.443H25.4431H25.4432H25.4433H25.4435H25.4436H25.4437H25.4438H25.444H25.4441H25.4442H25.4444H25.4445H25.4446H25.4447H25.4449H25.445H25.4451H25.4452H25.4454H25.4455H25.4456H25.4457H25.4459H25.446H25.4461H25.4462H25.4464H25.4465H25.4466H25.4467H25.4469H25.447H25.4471H25.4472H25.4474H25.4475H25.4476H25.4477H25.4479L25.4504 34.9106C25.4919 34.9106 25.5425 34.9106 25.5934 34.8852L25.5943 34.887L25.6032 34.8782L25.6049 34.8765C25.6466 34.8348 25.6719 34.8095 25.696 34.7611L25.6967 34.7614L25.6987 34.7542C25.7642 34.514 25.7868 34.2493 25.7201 34.0047L25.7203 34.0047L25.719 34.0013C25.6278 33.7618 25.4498 33.6479 25.2482 33.5947C25.0666 33.5468 24.8627 33.5473 24.6832 33.5478C24.666 33.5478 24.649 33.5479 24.6323 33.5479V33.5473L24.6256 33.5485C24.3998 33.5895 24.1524 33.5491 23.9454 33.4468C23.8468 33.3563 23.765 33.2092 23.7078 33.0141C23.65 32.8171 23.6181 32.574 23.6181 32.2976C23.6181 32.2454 23.5932 32.1713 23.5428 32.1209C23.5191 32.0972 23.4939 32.078 23.4644 32.0648C23.4347 32.0516 23.4026 32.0455 23.366 32.0455C23.3138 32.0455 23.2397 32.0705 23.1892 32.1209C23.1656 32.1446 23.1463 32.1697 23.1332 32.1992C23.12 32.2289 23.1139 32.2611 23.1139 32.2976C23.1139 32.5463 23.1355 32.8396 23.209 33.1148C23.2825 33.3898 23.4089 33.6502 23.6209 33.8287Z" fill="white" stroke="white" stroke-width="0.0749996"/>
<path d="M29.777 28.0201L29.7776 28.0199L29.7752 28.0134C29.644 27.6637 29.404 27.3364 29.0985 27.0962C28.949 26.968 28.8336 26.8575 28.7557 26.7562C28.6777 26.6549 28.6401 26.5662 28.6401 26.4813V26.4812V26.481V26.4809V26.4808V26.4807V26.4805V26.4804V26.4803V26.4801V26.48V26.4799V26.4798V26.4796V26.4795V26.4794V26.4792V26.4791V26.479V26.4788V26.4787V26.4785V26.4784V26.4783V26.4781V26.478V26.4779V26.4777V26.4776V26.4774V26.4773V26.4772V26.477V26.4769V26.4767V26.4766V26.4765V26.4763V26.4762V26.476V26.4759V26.4757V26.4756V26.4755V26.4753V26.4752V26.475V26.4749V26.4747V26.4746V26.4744V26.4743V26.4741V26.474V26.4738V26.4737V26.4735V26.4734V26.4732V26.4731V26.4729V26.4728V26.4726V26.4725V26.4723V26.4722V26.472V26.4719V26.4717V26.4716V26.4714V26.4712V26.4711V26.4709V26.4708V26.4706V26.4705V26.4703V26.4701V26.47V26.4698V26.4697V26.4695V26.4693V26.4692V26.469V26.4689V26.4687V26.4685V26.4684V26.4682V26.4681V26.4679V26.4677V26.4676V26.4674V26.4672V26.4671V26.4669V26.4667V26.4666V26.4664V26.4663V26.4661V26.4659V26.4658V26.4656V26.4654V26.4653V26.4651V26.4649V26.4647V26.4646V26.4644V26.4642V26.4641V26.4639V26.4637V26.4636V26.4634V26.4632V26.463V26.4629V26.4627V26.4625V26.4624V26.4622V26.462V26.4618V26.4617V26.4615V26.4613V26.4612V26.461V26.4608V26.4606V26.4605V26.4603V26.4601V26.4599V26.4598V26.4596V26.4594V26.4592V26.459V26.4589V26.4587V26.4585V26.4583V26.4582V26.458V26.4578V26.4576V26.4574V26.4573V26.4571V26.4569V26.4567V26.4566V26.4564V26.4562V26.456V26.4558V26.4557V26.4555V26.4553V26.4551V26.4549V26.4548V26.4546V26.4544V26.4542V26.454V26.4538V26.4537V26.4535V26.4533V26.4531V26.4529V26.4527V26.4526V26.4524V26.4522V26.452V26.4518V26.4516V26.4515V26.4513V26.4511V26.4509V26.4507V26.4505V26.4504V26.4502V26.45V26.4498V26.4496V26.4494V26.4492V26.4491V26.4489V26.4487V26.4485V26.4483V26.4481V26.4479V26.4478V26.4476V26.4474V26.4472V26.447V26.4468V26.4466V26.4465V26.4463V26.4461V26.4459V26.4457V26.4455V26.4453V26.4451V26.445V26.4448V26.4446V26.4444V26.4442V26.444V26.4438V26.4436V26.4435V26.4433V26.4431V26.4429V26.4427V26.4425V26.4423V26.4421V26.442V26.4418V26.4416V26.4414V26.4412V26.441V26.4408V26.4406V26.4404V26.4403V26.4401V26.4399V26.4397V26.4395V26.4393V26.4391V26.4389V26.4387V26.4386V26.4384V26.4382V26.438V26.4378V26.4376V26.4374V26.4372V26.437V26.4369V26.4367V26.4365V26.4363V26.4361V26.4359V26.4357V26.4355V26.4354V26.4352V26.435V26.4348V26.4346V26.4344V26.4342V26.434V26.4338V26.4337V26.4335V26.4333V26.4331V26.4329V26.4327V26.4325V26.4323V26.4322V26.432V26.4318V26.4316V26.4314V26.4312V26.431V26.4308V26.4307V26.4305V26.4303V26.4301V26.4299V26.4297V26.4295V26.4293V26.4292V26.429V26.4288V26.4286V26.4284V26.4282V26.428V26.4279V26.4277V26.4275V26.4273V26.4271V26.4269V26.4267V26.4266V26.4264V26.4262V26.426V26.4258V26.4256V26.4255V26.4253V26.4251V26.4249V26.4247V26.4245V26.4244V26.4242V26.424V26.4238V26.4236V26.4234V26.4233V26.4231V26.4229V26.4227V26.4225V26.4223V26.4222V26.422V26.4218V26.4216V26.4214V26.4213V26.4211V26.4209V26.4207V26.4205V26.4204V26.4202V26.42V26.4198V26.4196V26.4195V26.4193V26.4191V26.4189V26.4188V26.4186V26.4184V26.4182V26.418V26.4179V26.4177V26.4175V26.4173V26.4172V26.417V26.4168V26.4166V26.4165V26.4163V26.4161V26.4159V26.4158V26.4156V26.4154V26.4152V26.4151V26.4149V26.4147V26.4145V26.4144V26.4142V26.414V26.4139V26.4137V26.4135V26.4133V26.4132V26.413V26.4128V26.4127V26.4125V26.4123V26.4122V26.412V26.4118V26.4117V26.4115V26.4113V26.4112V26.411V26.4108V26.4107V26.4105V26.4103V26.4102V26.41V26.4098V26.4097V26.4095V26.4093V26.4092V26.409V26.4088V26.4087V26.4085V26.4084V26.4082V26.408V26.4079V26.4077V26.4075V26.4074V26.4072V26.4071V26.4069V26.4068V26.4066V26.4064V26.4063V26.4061V26.406V26.4058V26.4056V26.4055V26.4053V26.4052V26.405V26.4049V26.4047V26.4046V26.4044V26.4043V26.4041V26.404V26.4038V26.4036V26.4035V26.4033V26.4032V26.403V26.4029V26.4027V26.4026V26.4025V26.4023V26.4022V26.402V26.4019V26.4018C28.6687 26.3228 28.7419 26.2611 28.8546 26.2186C28.9696 26.1751 29.1202 26.1539 29.2894 26.1539C29.5646 26.1539 29.8396 26.1963 30.0931 26.2808C30.4096 26.3863 30.6836 26.5549 30.9155 26.7868C31.1471 27.0185 31.3157 27.2922 31.4213 27.5871C31.516 27.9352 31.5318 28.3525 31.4525 28.738C31.3732 29.124 31.1996 29.4739 30.9196 29.692C30.6273 29.9006 30.2721 29.9843 29.9163 29.9424C29.7526 29.9219 29.611 29.8612 29.4892 29.7402C29.4228 29.6538 29.4086 29.569 29.4281 29.4662C29.4484 29.3596 29.5046 29.2361 29.5798 29.0749C29.7775 28.7662 29.8427 28.3925 29.777 28.0201ZM31.9224 27.4584L31.9225 27.4584L31.9219 27.4567C31.7913 27.0648 31.5735 26.7164 31.2904 26.4333C31.0073 26.1502 30.6589 25.9325 30.267 25.8019L30.267 25.8018L30.266 25.8015C29.909 25.6933 29.4475 25.617 29.0436 25.6633C28.6401 25.7097 28.2837 25.8806 28.1591 26.2766C28.069 26.5472 28.1319 26.7842 28.2624 26.9897C28.392 27.1937 28.5894 27.3687 28.7719 27.519L28.7719 27.519L28.7723 27.5193C28.9797 27.6852 29.1472 27.9138 29.2741 28.1449C29.2935 28.3938 29.2507 28.6388 29.1084 28.8421L29.1078 28.8417L29.1048 28.8486C29.1001 28.8593 29.0954 28.8701 29.0906 28.8809C28.944 29.2148 28.761 29.6314 29.0882 30.0458L29.0884 30.046C29.1777 30.1576 29.2886 30.246 29.4188 30.3328C29.5554 30.4238 29.6919 30.446 29.8421 30.4675L29.842 30.4679H29.8474H29.8479H29.8484H29.8489H29.8494H29.8499H29.8504H29.8509H29.8514H29.8519H29.8524H29.8529H29.8534H29.8539H29.8544H29.8549H29.8554H29.8559H29.8564H29.8569H29.8574H29.8578H29.8583H29.8588H29.8593H29.8598H29.8603H29.8608H29.8613H29.8618H29.8623H29.8628H29.8632H29.8637H29.8642H29.8647H29.8652H29.8657H29.8662H29.8667H29.8671H29.8676H29.8681H29.8686H29.8691H29.8696H29.87H29.8705H29.871H29.8715H29.872H29.8724H29.8729H29.8734H29.8739H29.8744H29.8748H29.8753H29.8758H29.8763H29.8768H29.8772H29.8777H29.8782H29.8787H29.8791H29.8796H29.8801H29.8806H29.881H29.8815H29.882H29.8825H29.8829H29.8834H29.8839H29.8843H29.8848H29.8853H29.8858H29.8862H29.8867H29.8872H29.8876H29.8881H29.8886H29.889H29.8895H29.89H29.8904H29.8909H29.8914H29.8918H29.8923H29.8928H29.8932H29.8937H29.8942H29.8946H29.8951H29.8956H29.896H29.8965H29.8969H29.8974H29.8979H29.8983H29.8988H29.8993H29.8997H29.9002H29.9006H29.9011H29.9016H29.902H29.9025H29.9029H29.9034H29.9039H29.9043H29.9048H29.9052H29.9057H29.9061H29.9066H29.9071H29.9075H29.908H29.9084H29.9089H29.9093H29.9098H29.9102H29.9107H29.9112H29.9116H29.9121H29.9125H29.913H29.9134H29.9139H29.9143H29.9148H29.9152H29.9157H29.9161H29.9166H29.917H29.9175H29.9179H29.9184H29.9188H29.9193H29.9197H29.9202H29.9206H29.9211H29.9215H29.922H29.9224H29.9229H29.9233H29.9238H29.9242H29.9247H29.9251H29.9256H29.926H29.9265H29.9269H29.9274H29.9278H29.9283H29.9287H29.9292H29.9296H29.9301H29.9305H29.931H29.9314H29.9318H29.9323H29.9327H29.9332H29.9336H29.9341H29.9345H29.935H29.9354H29.9358H29.9363H29.9367H29.9372H29.9376H29.9381H29.9385H29.939H29.9394H29.9398H29.9403H29.9407H29.9412H29.9416H29.9421H29.9425H29.9429H29.9434H29.9438H29.9443H29.9447H29.9452H29.9456H29.946H29.9465H29.9469H29.9474H29.9478H29.9482H29.9487H29.9491H29.9496H29.95H29.9505H29.9509H29.9513H29.9518H29.9522H29.9527H29.9531H29.9535H29.954H29.9544H29.9549H29.9553H29.9557H29.9562H29.9566H29.9571H29.9575H29.9579H29.9584H29.9588H29.9593H29.9597H29.9602H29.9606H29.961H29.9615H29.9619H29.9624H29.9628H29.9632H29.9637H29.9641H29.9646H29.965H29.9654H29.9659H29.9663H29.9668H29.9672H29.9676H29.9681H29.9685H29.969H29.9694H29.9698H29.9703H29.9707H29.9712H29.9716H29.972H29.9725H29.9729H29.9734H29.9738H29.9742H29.9747H29.9751H29.9756H29.976H29.9764H29.9769H29.9773H29.9778H29.9782H29.9786H29.9791H29.9795H29.98H29.9804H29.9809H29.9813H29.9817H29.9822H29.9826H29.9831H29.9835H29.9839H29.9844H29.9848H29.9853H29.9857H29.9862H29.9866H29.987H29.9875H29.9879H29.9884H29.9888H29.9893H29.9897H29.9901H29.9906H29.991H29.9915H29.9919H29.9924H29.9928H29.9932H29.9937H29.9941H29.9946H29.995H29.9955H29.9959H29.9964H29.9968H29.9972H29.9977H29.9981H29.9986H29.999H29.9995H29.9999H30.0004H30.0008H30.0013H30.0017H30.0021H30.0026H30.003H30.0035H30.0039H30.0044H30.0048H30.0053H30.0057H30.0062H30.0066H30.0071H30.0075H30.008H30.0084H30.0089H30.0093H30.0098H30.0102H30.0107H30.0111H30.0116H30.012H30.0125H30.0129H30.0134H30.0138H30.0143H30.0147H30.0152H30.0156H30.0161H30.0165H30.017H30.0174H30.0179H30.0183H30.0188H30.0193H30.0197H30.0202H30.0206H30.0211H30.0215H30.022H30.0224H30.0229H30.0234H30.0238H30.0243H30.0247H30.0252H30.0256H30.0261H30.0266H30.027H30.0275H30.0279H30.0284H30.0288H30.0293H30.0298H30.0302H30.0307H30.0311H30.0316H30.0321H30.0325H30.033H30.0335H30.0339H30.0344H30.0348H30.0353H30.0358H30.0362H30.0367H30.0372H30.0376H30.0381H30.0386H30.039H30.0395H30.04H30.0404H30.0409H30.0414H30.0418H30.0423H30.0428H30.0432H30.0437H30.0442H30.0446H30.0451H30.0456H30.0461H30.0465H30.047H30.0475H30.0479H30.0484H30.0489H30.0494H30.0498H30.0503H30.0508H30.0513H30.0517H30.0522H30.0527H30.0532H30.0536H30.0541H30.0546H30.0551H30.0555H30.056H30.0565H30.057H30.0575H30.0579H30.0584H30.0589H30.0594H30.0599H30.0603H30.0608H30.0613H30.0618H30.0623H30.0628H30.0632H30.0637H30.0642H30.0647H30.0652H30.0657H30.0662H30.0666H30.0671H30.0676H30.0681H30.0686H30.0691H30.0696H30.0701H30.0706H30.071H30.0715H30.072H30.0725H30.073H30.0735H30.074H30.0745H30.075H30.0755H30.076H30.0765H30.077H30.0775H30.078H30.0785H30.079H30.0795H30.08H30.0805H30.081H30.0815H30.082H30.0825H30.083H30.0835C30.4995 30.4679 30.8931 30.3364 31.2422 30.0964L31.2423 30.0964L31.2439 30.0952C31.6284 29.7986 31.8573 29.3496 31.9606 28.8715C32.0638 28.3934 32.0421 27.8828 31.9224 27.4584Z" fill="white" stroke="white" stroke-width="0.0749996"/>
<path d="M27.9098 28.4897L27.91 28.4897L27.9087 28.486C27.7346 28.0073 27.4304 27.5949 27.0625 27.2485C26.7172 26.9032 26.4515 26.6135 26.4515 26.2238C26.4515 26.1379 26.4516 26.0777 26.4718 25.9968L26.4718 25.9968L26.4721 25.9958C26.5872 25.4724 26.9486 25.0725 27.4381 24.8026C27.928 24.5325 28.5439 24.3941 29.1612 24.3941C29.4164 24.3941 29.6501 24.4153 29.8838 24.4578C30.6067 24.6067 31.2657 24.9469 31.7972 25.4358C32.3284 25.9245 32.711 26.5621 32.9024 27.2636C33.0507 27.8361 33.0404 28.5483 32.8622 29.2134C32.6838 29.8788 32.3387 30.4926 31.8218 30.8723C31.3031 31.2534 30.5489 31.4877 29.8225 31.5143C29.0953 31.541 28.406 31.3593 28.0089 30.9207C27.8876 30.779 27.841 30.6113 27.8358 30.4187C27.8306 30.2251 27.8671 30.0094 27.9101 29.7732C28.0187 29.3594 28.0185 28.9243 27.9098 28.4897ZM33.4258 27.1592L33.4258 27.1592L33.4255 27.1583C33.2091 26.3574 32.7761 25.643 32.17 25.0803C31.5642 24.5177 30.8284 24.1282 30.006 23.955L30.006 23.955L30.0055 23.9549C29.1831 23.7926 28.2685 23.8736 27.5153 24.196C26.7617 24.5186 26.166 25.0847 25.991 25.8939C25.8189 26.6901 26.2592 27.1518 26.6778 27.5908C26.6881 27.6016 26.6985 27.6124 26.7088 27.6232L26.7086 27.6234L26.7114 27.6257C27.0282 27.9003 27.2817 28.2592 27.4298 28.639C27.5131 28.9742 27.4924 29.3319 27.4077 29.6921L27.4076 29.6921L27.4072 29.6948C27.4039 29.715 27.4006 29.7353 27.3973 29.7557C27.3142 30.2704 27.2251 30.8225 27.631 31.2711L27.6309 31.2712L27.6334 31.2735C27.9152 31.5336 28.2412 31.7512 28.59 31.882C28.9378 32.0124 29.3289 32.0777 29.7203 32.0561C30.5859 32.0559 31.4298 31.7961 32.1438 31.3201L32.1439 31.3202L32.1459 31.3186C32.755 30.8509 33.1557 30.14 33.3638 29.3833C33.5719 28.6266 33.5884 27.8206 33.4258 27.1592Z" fill="white" stroke="white" stroke-width="0.0749996"/>
<path d="M34.4052 26.1297L34.405 26.1298L34.4068 26.1333C34.4074 26.1346 34.4081 26.1359 34.4087 26.1372C34.4287 26.1773 34.4552 26.2303 34.5094 26.2574C34.5106 26.258 34.5119 26.2587 34.5131 26.2593C34.5533 26.2794 34.6031 26.3043 34.655 26.3043H34.6551H34.6552H34.6553H34.6555H34.6556H34.6557H34.6558H34.656H34.6561H34.6562H34.6563H34.6565H34.6566H34.6567H34.6568H34.657H34.6571H34.6572H34.6573H34.6575H34.6576H34.6577H34.6578H34.658H34.6581H34.6582H34.6584H34.6585H34.6586H34.6587H34.6589H34.659H34.6591H34.6592H34.6594H34.6595H34.6596H34.6597H34.6599H34.66H34.6601H34.6602H34.6604H34.6605H34.6606H34.6608H34.6609H34.661H34.6611H34.6613H34.6614H34.6615H34.6616H34.6618H34.6619H34.662H34.6622H34.6623H34.6624H34.6625H34.6627H34.6628H34.6629H34.663H34.6632H34.6633H34.6634H34.6636H34.6637H34.6638H34.6639H34.6641H34.6642H34.6643H34.6645H34.6646H34.6647H34.6648H34.665H34.6651H34.6652H34.6654H34.6655H34.6656H34.6657H34.6659H34.666H34.6661H34.6663H34.6664H34.6665H34.6667H34.6668H34.6669H34.667H34.6672H34.6673H34.6674H34.6676H34.6677H34.6678H34.668H34.6681H34.6682H34.6683H34.6685H34.6686H34.6687H34.6689H34.669H34.6691H34.6693H34.6694H34.6695H34.6697H34.6698H34.6699H34.6701H34.6702H34.6703H34.6705H34.6706H34.6707H34.6709H34.671H34.6711H34.6713H34.6714H34.6715H34.6717H34.6718H34.6719H34.6721H34.6722H34.6723H34.6725H34.6726H34.6727H34.6729H34.673H34.6731H34.6733H34.6734H34.6735H34.6737H34.6738H34.674H34.6741H34.6742H34.6744H34.6745H34.6746H34.6748H34.6749H34.675H34.6752H34.6753H34.6755H34.6756H34.6757H34.6759H34.676H34.6761H34.6763H34.6764H34.6766H34.6767H34.6768H34.677H34.6771H34.6773H34.6774H34.6775H34.6777H34.6778H34.678H34.6781H34.6782H34.6784H34.6785H34.6787H34.6788H34.679H34.6791H34.6792H34.6794H34.6795H34.6797H34.6798H34.6799H34.6801H34.6802H34.6804H34.6805H34.6807H34.6808H34.681H34.6811H34.6812H34.6814H34.6815H34.6817H34.6818H34.682H34.6821H34.6823H34.6824H34.6826H34.6827H34.6828H34.683H34.6831H34.6833H34.6834H34.6836H34.6837H34.6839H34.684H34.6842H34.6843H34.6845H34.6846H34.6848H34.6849H34.6851H34.6852H34.6854H34.6855H34.6857H34.6858H34.686H34.6861H34.6863H34.6864H34.6866H34.6867H34.6869H34.687H34.6872H34.6874H34.6875H34.6877H34.6878H34.688H34.6881H34.6883H34.6884H34.6886H34.6887H34.6889H34.6891H34.6892H34.6894H34.6895H34.6897H34.6898H34.69H34.6901H34.6903H34.6905H34.6906H34.6908H34.6909H34.6911H34.6913H34.6914H34.6916H34.6917H34.6919H34.6921H34.6922H34.6924H34.6925H34.6927H34.6929H34.693H34.6932H34.6934H34.6935H34.6937H34.6938H34.694H34.6942H34.6943H34.6945H34.6947H34.6948H34.695H34.6952H34.6953H34.6955H34.6957H34.6958H34.696H34.6962H34.6963H34.6965H34.6967H34.6968H34.697H34.6972H34.6973H34.6975H34.6977H34.6979H34.698H34.6982H34.6984H34.6985H34.6987H34.6989H34.6991H34.6992H34.6994H34.6996H34.6997H34.6999H34.7001H34.7003H34.7004H34.7006H34.7008H34.701H34.7011H34.7013H34.7015H34.7017H34.7019H34.702H34.7022H34.7024H34.7026H34.7027H34.7029H34.7031H34.7033H34.7035H34.7036H34.7038H34.704H34.7042H34.7044H34.7045H34.7047H34.7049H34.7051H34.7053H34.7055H34.7056H34.7058H34.706H34.7062H34.7064H34.7066H34.7068H34.7069H34.7071H34.7073H34.7075H34.7077H34.7079H34.7081H34.7083H34.7084H34.7086H34.7088H34.709H34.7092H34.7094H34.7096H34.7098H34.71H34.7102H34.7104H34.7106H34.7107H34.7109H34.7111H34.7113H34.7115H34.7117H34.7119H34.7121H34.7123H34.7125H34.7127H34.7129H34.7131H34.7133H34.7135H34.7137H34.7139H34.7141H34.7143H34.7145H34.7147H34.7149H34.7151H34.7153H34.7155H34.7157H34.7159H34.7161H34.7163H34.7165H34.7167H34.7169H34.7171H34.7173H34.7175H34.7177H34.718H34.7182H34.7184H34.7186H34.7188H34.719H34.7192H34.7194H34.7196H34.7198H34.72H34.7203H34.7205H34.7207H34.7209H34.7211H34.7213H34.7215H34.7218H34.722H34.7222H34.7224H34.7226H34.7228H34.723H34.7233H34.7235H34.7237H34.7239H34.7241H34.7244H34.7246H34.7248H34.725H34.7252H34.7255H34.7257H34.7259H34.7261H34.7263H34.7266H34.7268H34.727H34.7272H34.7275H34.7277H34.7279H34.7281H34.7284H34.7286H34.7288H34.7291H34.7293H34.7295H34.7297H34.73H34.7302H34.7304H34.7307H34.7309H34.7311H34.7314H34.7316H34.7318H34.7321H34.7323H34.7325H34.7328H34.733H34.7332H34.7335H34.7337H34.734H34.7342H34.7344H34.7347H34.7349H34.7352H34.7354H34.7356H34.7359H34.7361H34.7364H34.7366H34.7368H34.7371H34.7373H34.7376H34.7378H34.7381H34.7383H34.7386H34.7388H34.7391H34.7393H34.7396H34.7398H34.7401H34.7403H34.7406H34.7408C34.7993 26.3043 34.8304 26.2732 34.8522 26.2514L34.8532 26.2504C34.8682 26.2353 34.8759 26.22 34.8812 26.2093L34.8817 26.2085C34.887 26.1977 34.8901 26.192 34.8961 26.186C34.9151 26.167 34.9222 26.1414 34.9254 26.1227C34.9286 26.1036 34.9286 26.0849 34.9286 26.0743V26.0737V26.073C34.9286 26.0624 34.9286 26.0437 34.9254 26.0246C34.9226 26.0081 34.9168 25.9863 34.9024 25.9683C34.6539 25.2903 34.3025 24.7451 33.7974 24.2886C33.2924 23.8322 32.6352 23.4659 31.7771 23.1436C31.7591 23.1291 31.7373 23.1232 31.7207 23.1205C31.7016 23.1173 31.6829 23.1173 31.6723 23.1173L31.6717 23.1173C31.6611 23.1173 31.6504 23.1198 31.6423 23.122C31.634 23.1242 31.6251 23.1272 31.6174 23.1298L31.6169 23.1299C31.6086 23.1327 31.6016 23.135 31.5954 23.1367C31.5924 23.1375 31.59 23.1381 31.5881 23.1384C31.5865 23.1387 31.5857 23.1387 31.5857 23.1387C31.5857 23.1387 31.5858 23.1387 31.5858 23.1387C31.5628 23.1387 31.544 23.15 31.5311 23.1597C31.5182 23.1693 31.5059 23.1817 31.4958 23.1917C31.4955 23.192 31.4952 23.1923 31.4949 23.1927C31.4805 23.2071 31.4676 23.2269 31.4584 23.2453C31.4519 23.2583 31.4453 23.2742 31.4425 23.2898C31.4304 23.3069 31.4253 23.3266 31.4227 23.3418C31.4195 23.361 31.4195 23.3796 31.4195 23.3902L31.4195 23.3909L31.4195 23.3915C31.4195 23.4021 31.4195 23.4208 31.4227 23.44C31.4253 23.4552 31.4305 23.4751 31.4427 23.4922C31.4462 23.5082 31.4545 23.5216 31.4619 23.5314C31.4716 23.5443 31.4839 23.5566 31.494 23.5667L31.4949 23.5676C31.5093 23.5821 31.5291 23.5949 31.5476 23.6042C31.5626 23.6117 31.5816 23.6193 31.5994 23.6211C32.3774 23.9094 32.9668 24.2394 33.4172 24.6448C33.8683 25.0507 34.1817 25.5337 34.4052 26.1297Z" fill="white" stroke="white" stroke-width="0.0749996"/>
</svg>
