<svg width="58" height="58" viewBox="0 0 58 58" fill="none" xmlns="http://www.w3.org/2000/svg">
<circle cx="29" cy="29" r="20" fill="white" fill-opacity="0.08"/>
<circle cx="29" cy="29" r="28.5" stroke="white" stroke-opacity="0.45"/>
<path d="M35.75 28.25V26.75H34.25V25.25C34.25 24.425 33.575 23.75 32.75 23.75H31.25V22.25H29.75V23.75H28.25V22.25H26.75V23.75H25.25C24.425 23.75 23.75 24.425 23.75 25.25V26.75H22.25V28.25H23.75V29.75H22.25V31.25H23.75V32.75C23.75 33.575 24.425 34.25 25.25 34.25H26.75V35.75H28.25V34.25H29.75V35.75H31.25V34.25H32.75C33.575 34.25 34.25 33.575 34.25 32.75V31.25H35.75V29.75H34.25V28.25H35.75ZM32.75 32.75H25.25V25.25H32.75V32.75ZM31.25 26.75H26.75V31.25H31.25V26.75ZM29.75 29.75H28.25V28.25H29.75V29.75Z" fill="white"/>
</svg>
