<svg width="112" height="112" viewBox="0 0 112 112" fill="none" xmlns="http://www.w3.org/2000/svg">
<circle cx="56" cy="53" r="48" fill="#386C6A"/>
<path d="M22.0589 86.9411C26.5161 91.3983 31.8076 94.934 37.6312 97.3462C43.4548 99.7584 49.6966 101 56 101C62.3035 101 68.5452 99.7584 74.3688 97.3462C80.1924 94.934 85.4839 91.3983 89.9411 86.9411C94.3983 82.4839 97.934 77.1924 100.346 71.3688C102.758 65.5452 104 59.3034 104 53C104 46.6965 102.758 40.4548 100.346 34.6312C97.934 28.8076 94.3983 23.5161 89.9411 19.0589L56 53L22.0589 86.9411Z" fill="#255855"/>
<g filter="url(#filter0_d_465_11298)">
<circle cx="56" cy="53" r="34" fill="white" fill-opacity="0.1" shape-rendering="crispEdges"/>
</g>
<mask id="mask0_465_11298" style="mask-type:alpha" maskUnits="userSpaceOnUse" x="40" y="36" width="34" height="34">
<rect x="40" y="36" width="34" height="34" fill="#C4C4C4"/>
</mask>
<g mask="url(#mask0_465_11298)">
<path d="M51.334 38.833C49.7757 38.833 48.5007 40.108 48.5007 41.6663V58.6663C48.5007 60.2247 49.7757 61.4997 51.334 61.4997H68.334C69.8923 61.4997 71.1673 60.2247 71.1673 58.6663V41.6663C71.1673 40.108 69.8923 38.833 68.334 38.833H51.334ZM68.334 58.6663H51.334V41.6663H68.334V58.6663ZM62.1998 51.3422L58.6865 55.7197L56.2923 52.5322L52.7507 57.2497H66.9173L62.1998 51.3422ZM45.6673 67.1663H65.5007V64.333H45.6673V44.4997H42.834V64.333C42.834 65.8913 44.109 67.1663 45.6673 67.1663Z" fill="white"/>
</g>
<defs>
<filter id="filter0_d_465_11298" x="0" y="0" width="112" height="112" filterUnits="userSpaceOnUse" color-interpolation-filters="sRGB">
<feFlood flood-opacity="0" result="BackgroundImageFix"/>
<feColorMatrix in="SourceAlpha" type="matrix" values="0 0 0 0 0 0 0 0 0 0 0 0 0 0 0 0 0 0 127 0" result="hardAlpha"/>
<feOffset dy="3"/>
<feGaussianBlur stdDeviation="11"/>
<feComposite in2="hardAlpha" operator="out"/>
<feColorMatrix type="matrix" values="0 0 0 0 0.584375 0 0 0 0 0.685667 0 0 0 0 0.779167 0 0 0 0.2 0"/>
<feBlend mode="normal" in2="BackgroundImageFix" result="effect1_dropShadow_465_11298"/>
<feBlend mode="normal" in="SourceGraphic" in2="effect1_dropShadow_465_11298" result="shape"/>
</filter>
</defs>
</svg>
