<svg width="112" height="112" viewBox="0 0 112 112" fill="none" xmlns="http://www.w3.org/2000/svg">
<circle cx="56" cy="53" r="48" fill="#386C6A"/>
<path d="M22.0589 86.9411C26.5161 91.3983 31.8076 94.934 37.6312 97.3462C43.4548 99.7584 49.6966 101 56 101C62.3035 101 68.5452 99.7584 74.3688 97.3462C80.1924 94.934 85.4839 91.3983 89.9411 86.9411C94.3983 82.4839 97.934 77.1924 100.346 71.3688C102.758 65.5452 104 59.3034 104 53C104 46.6965 102.758 40.4548 100.346 34.6312C97.934 28.8076 94.3983 23.5161 89.9411 19.0589L56 53L22.0589 86.9411Z" fill="#255855"/>
<g filter="url(#filter0_d_483_17513)">
<ellipse cx="56" cy="53" rx="34" ry="34" fill="white" fill-opacity="0.1" shape-rendering="crispEdges"/>
</g>
<path d="M64.8167 41.2691L60.0002 46.0527L62.3668 48.4195L67.1499 43.6026L70.9831 47.4361V37.4355H60.9835L64.8167 41.2691ZM50.984 37.4355H40.9844V47.4361L44.8175 43.6026L49.6007 48.4195L51.9672 46.0527L47.1508 41.2691L50.984 37.4355ZM49.6007 56.4533L44.8175 61.2702L40.9844 57.4367V67.4372H50.984L47.1508 63.6037L51.9672 58.8201L49.6007 56.4533ZM62.3668 56.4533L60.0002 58.8201L64.8167 63.6037L60.9835 67.4372H70.9831V57.4367L67.1499 61.2702L62.3668 56.4533Z" fill="#F6F6F6"/>
<defs>
<filter id="filter0_d_483_17513" x="0" y="0" width="112" height="112" filterUnits="userSpaceOnUse" color-interpolation-filters="sRGB">
<feFlood flood-opacity="0" result="BackgroundImageFix"/>
<feColorMatrix in="SourceAlpha" type="matrix" values="0 0 0 0 0 0 0 0 0 0 0 0 0 0 0 0 0 0 127 0" result="hardAlpha"/>
<feOffset dy="3"/>
<feGaussianBlur stdDeviation="11"/>
<feComposite in2="hardAlpha" operator="out"/>
<feColorMatrix type="matrix" values="0 0 0 0 0.584375 0 0 0 0 0.685667 0 0 0 0 0.779167 0 0 0 0.2 0"/>
<feBlend mode="normal" in2="BackgroundImageFix" result="effect1_dropShadow_483_17513"/>
<feBlend mode="normal" in="SourceGraphic" in2="effect1_dropShadow_483_17513" result="shape"/>
</filter>
</defs>
</svg>
