<svg width="55" height="56" viewBox="0 0 55 56" fill="none" xmlns="http://www.w3.org/2000/svg">
<path d="M37.5985 5H17.8894C10.183 5 5 10.4104 5 18.4577V37.0325C5 45.0548 10.183 50.4652 17.8894 50.4652H37.5985C45.3049 50.4652 50.4652 45.0548 50.4652 37.0325V18.4577C50.4652 10.4104 45.3049 5 37.5985 5Z" fill="#1B974E"/>
<path fill-rule="evenodd" clip-rule="evenodd" d="M28 41C35.1797 41 41 35.1797 41 28C41 20.8203 35.1797 15 28 15C20.8203 15 15 20.8203 15 28C15 35.1797 20.8203 41 28 41ZM34.024 25.899C34.6587 25.2644 34.6587 24.2356 34.024 23.601C33.3894 22.9663 32.3606 22.9663 31.726 23.601L26.375 28.9519L24.274 26.851C23.6394 26.2163 22.6106 26.2163 21.976 26.851C21.3413 27.4856 21.3413 28.5144 21.976 29.149L25.226 32.399C25.8606 33.0337 26.8894 33.0337 27.524 32.399L34.024 25.899Z" fill="#F6F6F6"/>
</svg>
