<svg width="112" height="112" viewBox="0 0 112 112" fill="none" xmlns="http://www.w3.org/2000/svg">
<circle cx="56" cy="53" r="48" fill="#386C6A"/>
<path d="M22.0589 86.9411C26.5161 91.3983 31.8076 94.934 37.6312 97.3462C43.4548 99.7584 49.6966 101 56 101C62.3035 101 68.5452 99.7584 74.3688 97.3462C80.1924 94.934 85.4839 91.3983 89.9411 86.9411C94.3983 82.4839 97.934 77.1924 100.346 71.3688C102.758 65.5452 104 59.3034 104 53C104 46.6965 102.758 40.4548 100.346 34.6312C97.934 28.8076 94.3983 23.5161 89.9411 19.0589L56 53L22.0589 86.9411Z" fill="#255855"/>
<g filter="url(#filter0_d_483_11305)">
<circle cx="56" cy="53" r="34" fill="white" fill-opacity="0.1" shape-rendering="crispEdges"/>
</g>
<mask id="mask0_483_11305" style="mask-type:alpha" maskUnits="userSpaceOnUse" x="41" y="40" width="33" height="33">
<rect x="41" y="40" width="33" height="33" fill="#D9D9D9"/>
</mask>
<g mask="url(#mask0_483_11305)">
<path d="M57.5 60.625L59.6313 55.8813L64.375 53.75L59.6313 51.6187L57.5 46.875L55.3687 51.6187L50.625 53.75L55.3687 55.8813L57.5 60.625ZM43.75 70.25V45.5C43.75 44.7437 44.0195 44.0961 44.5585 43.5571C45.0966 43.019 45.7437 42.75 46.5 42.75H68.5C69.2563 42.75 69.9039 43.019 70.4429 43.5571C70.981 44.0961 71.25 44.7437 71.25 45.5V62C71.25 62.7563 70.981 63.4039 70.4429 63.9429C69.9039 64.481 69.2563 64.75 68.5 64.75H49.25L43.75 70.25ZM46.5 63.6156L48.1156 62H68.5V45.5H46.5V63.6156Z" fill="white"/>
</g>
<defs>
<filter id="filter0_d_483_11305" x="0" y="0" width="112" height="112" filterUnits="userSpaceOnUse" color-interpolation-filters="sRGB">
<feFlood flood-opacity="0" result="BackgroundImageFix"/>
<feColorMatrix in="SourceAlpha" type="matrix" values="0 0 0 0 0 0 0 0 0 0 0 0 0 0 0 0 0 0 127 0" result="hardAlpha"/>
<feOffset dy="3"/>
<feGaussianBlur stdDeviation="11"/>
<feComposite in2="hardAlpha" operator="out"/>
<feColorMatrix type="matrix" values="0 0 0 0 0.584375 0 0 0 0 0.685667 0 0 0 0 0.779167 0 0 0 0.2 0"/>
<feBlend mode="normal" in2="BackgroundImageFix" result="effect1_dropShadow_483_11305"/>
<feBlend mode="normal" in="SourceGraphic" in2="effect1_dropShadow_483_11305" result="shape"/>
</filter>
</defs>
</svg>
