<svg width="7" height="8" viewBox="0 0 7 8" fill="none" xmlns="http://www.w3.org/2000/svg">
<path d="M6.19326 4.05836C6.19326 5.69772 4.83867 7.03085 3.16252 7.03085C1.48636 7.03085 0.131772 5.69772 0.131772 4.05836C0.131772 2.419 1.48636 1.08587 3.16252 1.08587C4.83867 1.08587 6.19326 2.419 6.19326 4.05836Z" stroke="white" stroke-width="0.263543"/>
<mask id="mask0_735_25899" style="mask-type:alpha" maskUnits="userSpaceOnUse" x="1" y="1" width="5" height="6">
<rect x="1.0542" y="1.98883" width="4.21669" height="4.13902" fill="#D9D9D9"/>
</mask>
<g mask="url(#mask0_735_25899)">
<path d="M3.76168 3.26676L3.51395 3.02359L2.45978 4.05834L3.51395 5.0931L3.76168 4.84993L2.957 4.05834L3.76168 3.26676Z" fill="white"/>
</g>
</svg>
