<svg width="58" height="58" viewBox="0 0 58 58" fill="none" xmlns="http://www.w3.org/2000/svg">
<circle cx="29" cy="29" r="20" fill="white" fill-opacity="0.08"/>
<circle cx="29" cy="29" r="28.5" stroke="white" stroke-opacity="0.45"/>
<path d="M36.2 22H21.8C20.81 22 20.009 22.81 20.009 23.8L20 34.6C20 35.59 20.81 36.4 21.8 36.4H36.2C37.19 36.4 38 35.59 38 34.6V23.8C38 22.81 37.19 22 36.2 22ZM31.25 34.6H21.8V31.45H31.25V34.6ZM31.25 29.65H21.8V26.5H31.25V29.65ZM36.2 34.6H33.05V26.5H36.2V34.6Z" fill="white"/>
</svg>
