{
  "project_info": {
    "project_number": "770305057632",
    "firebase_url": "https://rentalmobil-d4900.firebaseio.com",
    "project_id": "rentalmobil-d4900",
    "storage_bucket": "rentalmobil-d4900.appspot.com"
  },
  "client": [
    {
      "client_info": {
        "mobilesdk_app_id": "1:770305057632:android:79f6bca551fb891e",
        "android_client_info": {
          "package_name": "com.aplication.rizky.cvrental"
        }
      },
      "oauth_client": [
        {
          "client_id": "770305057632-es1r5i52mi9ia3jtjtlhi59a7h1eskus.apps.googleusercontent.com",
          "client_type": 3
        }
      ],
      "api_key": [
        {
          "current_key": "AIzaSyASAsnXrlZg3XgDG2eKT-r6ocZyu0FAmbQ"
        }
      ],
      "services": {
        "analytics_service": {
          "status": 1
        },
        "appinvite_service": {
          "status": 1,
          "other_platform_oauth_client": []
        },
        "ads_service": {
          "status": 2
        }
      }
    }
  ],
  "configuration_version": "1"
}