file_name,answer
ppbwf7,ppbwf7
kx2pgy,kx2pgy
bem3mg,bem3mg
awha5r,awha5r
r2rbg2,r2rbg2
2kceee,2kceee
dnn4x7,dnn4x7
rekwga,rekwga
67b3y6,67b3y6
7ayc8c,7ayc8c
2pxfdg,2pxfdg
2g2pk5,2g2pk5
fden88,fden88
4ma7h8,4ma7h8
2gnphw,2gnphw
ban57n,ban57n
cwb37g,cwb37g
8xddr4,8xddr4
drw8cy,drw8cy
xedccg,xedccg
cknfr3,cknfr3
we46fb,we46fb
p4ax6d,p4ax6d
5ambna,5ambna
x5akbm,x5akbm
h34hah,h34hah
aryan2,aryan2
g6f6nm,g6f6nm
ry43mp,ry43mp
fwemd6,fwemd6
ce4g7d,ce4g7d
66rxn2,66rxn2
4e2gcn,4e2gcn
emfdef,emfdef
ge6f83,ge6f83
4r3bwr,4r3bwr
h2rxb7,h2rxb7
7742w3,7742w3
n4he2d,n4he2d
y2cchf,y2cchf
myxx2r,myxx2r
e4e4xp,e4e4xp
475ka3,475ka3
bxmk4c,bxmk4c
cxgkkr,cxgkkr
4b5y73,4b5y73
3cp8dh,3cp8dh
6fgp2x,6fgp2x
hc3w4e,hc3w4e
5mngca,5mngca
rxfxxk,rxfxxk
7pyeg5,7pyeg5
ychpmm,ychpmm
6dap8e,6dap8e
hhmpnc,hhmpnc
x57xcw,x57xcw
6adxr5,6adxr5
54pnhe,54pnhe
62agfy,62agfy
wpcc3x,wpcc3x
a3h2df,a3h2df
afbdxk,afbdxk
m48kff,m48kff
74f476,74f476
ek2xc3,ek2xc3
73mp86,73mp86
wnb8r7,wnb8r7
n8emgc,n8emgc
acd435,ccd435
xyp3rg,xyp3rg
4n4cyp,4n4cyp
h7r7p5,h7r7p5
k5kpgd,k5kpgd
fy5yn3,fy5yn3
3gd4yy,3gd4yy
g55khn,g55khn
457c54,457c54
eygncw,eygncw
bax8gm,bax8gm
cm47xc,cm47xc
awmpr5,awmpr5
bxk2aw,bxk2aw
cy5yd8,cy5yd8
hxdny2,hxdny2
c6eh56,c6eh56
ynm8ep,ynm8ep
h5m52k,h5m52k
fnmmfa,fnmmfa
rhgpy3,rhgpy3
emwpc6,emwpc6
27r8p3,27r8p3
mpak3r,mpak3r
w4cx2x,w4cx2x
2er4ga,2er4ga
mkxe2x,mkxe2x
6h4wpg,6h4wg
y8772y,y8772y
fa56n7,fa56n7
kbk7kk,kbk7kk
r3r55b,r3r55b
bpky7g,bpky7g
