@startuml Container

' Judul diagram
title <Nama Project>\nContainer Diagram

' Import library C4 PlantUML
!include https://raw.githubusercontent.com/plantuml-stdlib/C4-PlantUML/master/C4.puml

' Import library C4 PlantUML untuk diagram context
!include https://raw.githubusercontent.com/plantuml-stdlib/C4-PlantUML/master/C4_Context.puml

' Import library C4 PlantUML untuk diagram container
!include https://raw.githubusercontent.com/plantuml-stdlib/C4-PlantUML/master/C4_Container.puml


' Import dan definisikan sprites dari devicons 
!define DI https://raw.githubusercontent.com/tupadr3/plantuml-icon-font-sprites/master/devicons
!include DI/database.puml
!include DI/chrome.puml
!include DI/mongodb.puml
!include DI/postgresql.puml
!include DI/mongodb.puml
!include DI/redis.puml
!include DI/python.puml
!include DI/nginx.puml

' Import dan definisikan sprites dari devicons2
!define D2 https://raw.githubusercontent.com/tupadr3/plantuml-icon-font-sprites/master/devicons2
!include D2/graphql.puml
!include D2/redis.puml
!include D2/go.puml
!include D2/php.puml
!include D2/java.puml
!include D2/nodejs.puml
!include D2/react_original.puml

' Import dan definisikan sprites dari font awesome
!define FA https://raw.githubusercontent.com/tupadr3/plantuml-icon-font-sprites/master/font-awesome-5
!include FA/user.puml
!include FA/user_tie.puml
!include FA/user_tag.puml
!include FA/user_cog.puml
!include FA/users_cog.puml
!include FA/hiking.puml
!include FA/bell.puml
!include FA/at.puml
!include FA/cogs.puml
!include FA/layer_group.puml
!include FA/biking.puml
!include FA/headset.puml
!include FA/tablet_alt.puml
!include FA/bolt.puml
!include FA/ellipsis_h.puml
!include FA/html5.puml
!include FA/docker.puml
!include FA/sitemap.puml
!include FA/map.puml
!include FA/microchip.puml
!include FA/credit_card.puml

' Import dan definisikan sprites dari material
!define MA https://raw.githubusercontent.com/tupadr3/plantuml-icon-font-sprites/master/material
!include MA/web.puml
!include MA/phone_iphone.puml
!include MA/fiber_pin.puml
!include MA/phonelink_lock.puml
!include MA/gps_fixed.puml
!include MA/navigation.puml
!include MA/near_me.puml
!include MA/timer_off.puml
!include MA/memory.puml
!include MA/toys.puml

' Definisikan semua actor manusia yang berinteraksi dengan sistem utama
Person(personCustomer, "Customer", "Menggunakan aplikasi untuk ...")
Person(personAdministrator, "Administrator", "Berkepentingan untuk ...", $sprite="user_tie")
Person_Ext(personMerchant, "Merchant", "Berkepentingan untuk ...", $sprite="user_tag")


' Definisikan semua sistem lain yang berinteraksi dengan sistem utama
System_Ext(extMailer, "GMail", "E-mail System", $sprite="at")
System_Ext(extPaymentAggregator, "Payment Aggregator", "Menediakan API untuk payment",$sprite="layer_group")

' Definisikan bondary sistem utama
System_Boundary(sys, "<Nama Project>") {
    
}

' Definisikan relasi antar actor dan sistem utama

@enduml
