{
  "project_info": {
    "project_number": "444264652503",
    "firebase_url": "https://gratika-apps-product.firebaseio.com",
    "project_id": "gratika-apps-product",
    "storage_bucket": "gratika-apps-product.appspot.com"
  },
  "client": [
    {
      "client_info": {
        "mobilesdk_app_id": "1:444264652503:android:5e8814198ec7fedc",
        "android_client_info": {
          "package_name": "com.gratikagina"
        }
      },
      "oauth_client": [
        {
          "client_id": "444264652503-13pehh2vrv3dip3a9id0k7r4umijanii.apps.googleusercontent.com",
          "client_type": 1,
          "android_info": {
            "package_name": "com.gratikagina",
            "certificate_hash": "82c39b49b768ab2cf431cb54465537cbd101933f"
          }
        },
        {
          "client_id": "444264652503-31b82vfrs9hmenb0rk2cqc71r9c93m4s.apps.googleusercontent.com",
          "client_type": 3
        }
      ],
      "api_key": [
        {
          "current_key": "AIzaSyC8zfyrFisw_Y1rlUIiDQh1ucrWpwUst2g"
        }
      ],
      "services": {
        "appinvite_service": {
          "other_platform_oauth_client": [
            {
              "client_id": "444264652503-31b82vfrs9hmenb0rk2cqc71r9c93m4s.apps.googleusercontent.com",
              "client_type": 3
            }
          ]
        }
      }
    },
    {
      "client_info": {
        "mobilesdk_app_id": "1:444264652503:android:c5fa50a8f9e8c300",
        "android_client_info": {
          "package_name": "com.gratikaglobe"
        }
      },
      "oauth_client": [
        {
          "client_id": "444264652503-0nevj2kukkdf27v2bvqiqcpbeiopllm3.apps.googleusercontent.com",
          "client_type": 1,
          "android_info": {
            "package_name": "com.gratikaglobe",
            "certificate_hash": "82c39b49b768ab2cf431cb54465537cbd101933f"
          }
        },
        {
          "client_id": "444264652503-31b82vfrs9hmenb0rk2cqc71r9c93m4s.apps.googleusercontent.com",
          "client_type": 3
        }
      ],
      "api_key": [
        {
          "current_key": "AIzaSyC8zfyrFisw_Y1rlUIiDQh1ucrWpwUst2g"
        }
      ],
      "services": {
        "appinvite_service": {
          "other_platform_oauth_client": [
            {
              "client_id": "444264652503-31b82vfrs9hmenb0rk2cqc71r9c93m4s.apps.googleusercontent.com",
              "client_type": 3
            }
          ]
        }
      }
    },
    {
      "client_info": {
        "mobilesdk_app_id": "1:444264652503:android:38b02e66f5f4a3c9ea5a92",
        "android_client_info": {
          "package_name": "com.rnmapsandroid"
        }
      },
      "oauth_client": [
        {
          "client_id": "444264652503-31b82vfrs9hmenb0rk2cqc71r9c93m4s.apps.googleusercontent.com",
          "client_type": 3
        }
      ],
      "api_key": [
        {
          "current_key": "AIzaSyC8zfyrFisw_Y1rlUIiDQh1ucrWpwUst2g"
        }
      ],
      "services": {
        "appinvite_service": {
          "other_platform_oauth_client": [
            {
              "client_id": "444264652503-31b82vfrs9hmenb0rk2cqc71r9c93m4s.apps.googleusercontent.com",
              "client_type": 3
            }
          ]
        }
      }
    },
    {
      "client_info": {
        "mobilesdk_app_id": "1:444264652503:android:b21fc6a3068db410",
        "android_client_info": {
          "package_name": "com.sag"
        }
      },
      "oauth_client": [
        {
          "client_id": "444264652503-6jro1h40c7v21g4dh9m54nir5qbo0if8.apps.googleusercontent.com",
          "client_type": 1,
          "android_info": {
            "package_name": "com.sag",
            "certificate_hash": "82c39b49b768ab2cf431cb54465537cbd101933f"
          }
        },
        {
          "client_id": "444264652503-d4a759khgedojc68dptt4sdd4nja6jce.apps.googleusercontent.com",
          "client_type": 1,
          "android_info": {
            "package_name": "com.sag",
            "certificate_hash": "a7e5cf2195ded563139c6498f1223610a0405ce4"
          }
        },
        {
          "client_id": "444264652503-31b82vfrs9hmenb0rk2cqc71r9c93m4s.apps.googleusercontent.com",
          "client_type": 3
        }
      ],
      "api_key": [
        {
          "current_key": "AIzaSyC8zfyrFisw_Y1rlUIiDQh1ucrWpwUst2g"
        }
      ],
      "services": {
        "appinvite_service": {
          "other_platform_oauth_client": [
            {
              "client_id": "444264652503-31b82vfrs9hmenb0rk2cqc71r9c93m4s.apps.googleusercontent.com",
              "client_type": 3
            }
          ]
        }
      }
    }
  ],
  "configuration_version": "1"
}