/home/ensai/Bureau/Cours 3A/Genie Logiciel/TP final/scanstorage/src/main/java/fr/ensai/demo/model/FileComponent.java
/home/ensai/Bureau/Cours 3A/Genie Logiciel/TP final/scanstorage/src/main/java/fr/ensai/demo/service/LocalStorage.java
/home/ensai/Bureau/Cours 3A/Genie Logiciel/TP final/scanstorage/src/main/java/fr/ensai/demo/repository/ScanRepository.java
/home/ensai/Bureau/Cours 3A/Genie Logiciel/TP final/scanstorage/src/main/java/fr/ensai/demo/dto/ScanConfiguration.java
/home/ensai/Bureau/Cours 3A/Genie Logiciel/TP final/scanstorage/src/main/java/fr/ensai/demo/model/FileLeaf.java
/home/ensai/Bureau/Cours 3A/Genie Logiciel/TP final/scanstorage/src/main/java/fr/ensai/demo/model/FolderComposite.java
/home/ensai/Bureau/Cours 3A/Genie Logiciel/TP final/scanstorage/src/main/java/fr/ensai/demo/model/Scan.java
/home/ensai/Bureau/Cours 3A/Genie Logiciel/TP final/scanstorage/src/main/java/fr/ensai/demo/service/S3Storage.java
/home/ensai/Bureau/Cours 3A/Genie Logiciel/TP final/scanstorage/src/main/java/fr/ensai/demo/Application.java
/home/ensai/Bureau/Cours 3A/Genie Logiciel/TP final/scanstorage/src/main/java/fr/ensai/demo/repository/FileRepository.java
/home/ensai/Bureau/Cours 3A/Genie Logiciel/TP final/scanstorage/src/main/java/fr/ensai/demo/controller/ScanController.java
/home/ensai/Bureau/Cours 3A/Genie Logiciel/TP final/scanstorage/src/main/java/fr/ensai/demo/service/ScanService.java
/home/ensai/Bureau/Cours 3A/Genie Logiciel/TP final/scanstorage/src/main/java/fr/ensai/demo/service/ScanTemplateMethod.java
