fr/ensai/demo/service/ScanTemplateMethod.class
fr/ensai/demo/model/FileLeaf.class
fr/ensai/demo/service/LocalStorage.class
fr/ensai/demo/service/S3Storage.class
fr/ensai/demo/repository/ScanRepository.class
fr/ensai/demo/model/FileComponent.class
fr/ensai/demo/controller/ScanController.class
fr/ensai/demo/model/Scan.class
fr/ensai/demo/service/ScanService.class
fr/ensai/demo/model/FolderComposite.class
