GO:0008658	1.9832390827301383e-89	4	5	molecular_function: penicillin binding	spr0304,spr0329,spr1517,spr1823
GO:0004180	1.948755913372417e-62	3	4	molecular_function: carboxypeptidase activity	spr0776,spr0329,spr1823
GO:0009002	1.948755913372417e-62	3	4	molecular_function: serine-type D-Ala-D-Ala carboxypeptidase activity	spr0776,spr0329,spr1823
GO:0009252	6.0332721776498886e-49	7	27	biological_process: peptidoglycan biosynthetic process	spr1517,spr0329,spr1540,spr0776,spr1823,spr0304,spr0305
GO:0046677	1.6917132689886138e-43	4	10	biological_process: response to antibiotic	spr0304,spr1823,spr1517,spr0329
GO:0008144	1.6179755272603677e-36	2	3	molecular_function: drug binding	spr0329,spr1823
GO:0008955	1.6179755272603677e-36	2	3	molecular_function: peptidoglycan glycosyltransferase activity	spr0329,spr1823
GO:0071555	4.1776468199828247e-26	5	25	biological_process: cell wall organization	spr1517,spr0776,spr0304,spr0305,spr0329
GO:0008360	4.6135058247071035e-23	5	28	biological_process: regulation of cell shape	spr1517,spr0776,spr0304,spr0305,spr0329
GO:0006310	5.173063255130503e-10	3	22	biological_process: DNA recombination	spr1539,spr1516,spr0330
GO:0044038	1.3446299344949813e-08	1	3	biological_process: cell wall macromolecule biosynthetic process	spr0305
GO:0005887	1.224076929638714e-07	4	48	cellular_component: integral component of plasma membrane	spr0304,spr0303,spr1517,spr0305
GO:0006974	2.706973462403667e-07	3	29	biological_process: cellular response to DNA damage stimulus	spr1539,spr1516,spr0330
GO:0007049	2.706973462403667e-07	3	29	biological_process: cell cycle	spr0304,spr0303,spr0305
GO:0006508	2.414330820838873e-06	4	56	biological_process: proteolysis	spr0776,spr0329,spr1517,spr1823
GO:0016780	2.5763057601305417e-06	1	4	molecular_function: phosphotransferase activity, for other substituted phosphate groups	spr0305
GO:0051301	4.694413225014382e-06	3	34	biological_process: cell division	spr0304,spr0303,spr0305
GO:0006281	1.7727352638921436e-05	3	37	biological_process: DNA repair	spr1539,spr1516,spr0330
GO:0043093	5.7294925824543505e-05	1	5	biological_process: FtsZ-dependent cytokinesis	spr0303
GO:0008233	0.00018905842379024726	3	44	molecular_function: peptidase activity	spr0776,spr0329,spr1823
GO:0070475	0.00043785599545682907	1	6	biological_process: rRNA base methylation	spr0302
GO:0032153	0.00043785599545682907	1	6	cellular_component: cell division site	spr0303
