GO:0055114	1.1425657584351468e-32	64	448	biological_process: oxidation-reduction process	b2279,b0723,b4211,b0306,b4153,b2276,b4515,b3152,b0042,b1656,b2210,b4154,b2769,b2277,b1387,b2490,b3236,b1479,b2486,b1800,b2770,b2484,b1378,b2280,b1109,b0979,b0721,b2281,b2483,b2284,b2489,b0041,b2288,b2278,b2485,b2463,b1136,b3908,b3962,b0432,b2287,b2285,b0073,b1697,b2282,b2487,b2286,b2283,b0722,b0431,b1415,b0307,b2482,b0726,b2481,b0734,b0724,b2488,b3003,b0733,b1698,b0429,b0978,b0430
GO:0030964	1.260957617496641e-22	14	14	cellular_component: NADH dehydrogenase complex	b2283,b2288,b2278,b2286,b2279,b2276,b2280,b2277,b1109,b2287,b2285,b2281,b2282,b2284
GO:0009060	5.873841744623413e-22	17	24	biological_process: aerobic respiration	b2283,b0722,b0431,b0723,b2276,b0429,b0724,b1109,b0432,b2287,b2488,b0721,b2277,b2281,b2282,b0430,b2284
GO:0003954	2.4317391892536256e-21	15	18	molecular_function: NADH dehydrogenase activity	b2283,b2286,b2278,b2288,b2279,b2276,b2280,b2484,b2277,b2488,b2287,b2285,b2281,b2282,b2284
GO:0045272	1.4422898508175668e-20	14	16	cellular_component: plasma membrane respiratory chain complex I	b2283,b2288,b2278,b2286,b2279,b2276,b2280,b2277,b2488,b2287,b2285,b2281,b2282,b2284
GO:0048038	4.405046005758986e-20	15	20	molecular_function: quinone binding	b2283,b2288,b2278,b2286,b2279,b2284,b2276,b2280,b2277,b2282,b2287,b2285,b2281,b2487,b2489
GO:0006099	7.828524689379968e-20	17	29	biological_process: tricarboxylic acid cycle	b1612,b0722,b1611,b3236,b1136,b4122,b0723,b0320,b4153,b0729,b0726,b0727,b0724,b2210,b0728,b0518,b0721
GO:0008137	7.979275551101238e-20	14	17	molecular_function: NADH dehydrogenase (ubiquinone) activity	b2283,b2288,b2278,b2286,b2279,b2284,b2482,b2276,b2280,b1109,b2287,b2277,b2487,b2489
GO:0009055	4.0893595989987895e-15	21	83	molecular_function: electron transfer activity	b0723,b4153,b0042,b4154,b2769,b2770,b0979,b0721,b0041,b0432,b1697,b2283,b0722,b0431,b0734,b0724,b0733,b1698,b0429,b0978,b0430
GO:0015990	1.0315895718318102e-14	9	9	biological_process: electron transport coupled proton transport	b2278,b0431,b2484,b2276,b0432,b2287,b2277,b0429,b0430
GO:0019646	1.0315895718318102e-14	9	9	biological_process: aerobic electron transport chain	b0431,b0734,b1109,b0432,b0979,b0733,b0429,b0978,b0430
GO:0016491	1.9697989956727358e-11	35	356	molecular_function: oxidoreductase activity	b0723,b4211,b4153,b1656,b2210,b4154,b1387,b2490,b3236,b1479,b2486,b1800,b1378,b2484,b1109,b2483,b2489,b2485,b2463,b1136,b3908,b3962,b0432,b2285,b0073,b2487,b2283,b1415,b2482,b0726,b2481,b0724,b3003,b0429,b0430
GO:0016651	5.881199262320693e-11	8	11	molecular_function: oxidoreductase activity, acting on NAD(P)H	b2283,b2288,b2286,b2279,b2488,b2281,b2487,b2284
GO:0042773	1.1018130866314053e-10	7	8	biological_process: ATP synthesis coupled electron transport	b2283,b2278,b2279,b2482,b2276,b0432,b2277
GO:0044569	4.3705252378050244e-10	8	13	cellular_component: [Ni-Fe] hydrogenase complex	b2485,b2486,b2482,b2484,b2481,b2488,b2487,b2483
GO:0000104	5.14473296562218e-10	6	6	molecular_function: succinate dehydrogenase activity	b0722,b4151,b0723,b4152,b4154,b0721
GO:0050136	5.14473296562218e-10	6	6	molecular_function: NADH dehydrogenase (quinone) activity	b2286,b2288,b2279,b2276,b2287,b2281
GO:0022900	1.4504968832055485e-09	14	63	biological_process: electron transport chain	b0041,b0722,b1136,b0723,b4153,b1378,b2770,b0042,b1697,b4154,b0432,b1698,b2769,b0721
GO:0016682	1.3736115348939129e-08	6	8	molecular_function: oxidoreductase activity, acting on diphenols and related substances as donors, oxygen as acceptor	b0431,b0734,b0432,b0979,b0733,b0978
GO:0006119	1.858898797962944e-08	5	5	biological_process: oxidative phosphorylation	b4515,b0734,b0979,b0733,b0978
GO:0006108	1.0896156139455342e-07	5	6	biological_process: malate metabolic process	b1611,b1479,b3236,b2463,b1800
GO:0015078	2.1104944648802873e-07	6	11	molecular_function: proton transmembrane transporter activity	b3737,b0431,b3738,b0432,b0429,b0430
GO:0004775	6.655552612156257e-07	4	4	molecular_function: succinate-CoA ligase (ADP-forming) activity	b0320,b0729,b0728,b0518
GO:0009361	6.655552612156257e-07	4	4	cellular_component: succinate-CoA ligase complex (ADP-forming)	b0320,b0729,b0728,b0518
GO:0015453	6.655552612156257e-07	4	4	molecular_function: oxidoreduction-driven active transmembrane transporter activity	b0429,b0432,b0431,b0430
GO:0009486	6.655552612156257e-07	4	4	molecular_function: cytochrome bo3 ubiquinol oxidase activity	b0429,b0432,b0431,b0430
GO:0009319	6.655552612156257e-07	4	4	cellular_component: cytochrome o ubiquinol oxidase complex	b0429,b0432,b0431,b0430
GO:0070069	6.655552612156257e-07	4	4	cellular_component: cytochrome complex	b0978,b0733,b0979,b0734
GO:0102040	6.655552612156257e-07	4	4	molecular_function: fumarate reductase (menaquinone)	b4152,b4154,b4151,b4153
GO:0045284	6.655552612156257e-07	4	4	cellular_component: plasma membrane fumarate reductase complex	b4152,b4154,b4151,b4153
GO:0051539	8.726496389132918e-07	15	117	molecular_function: 4 iron, 4 sulfur cluster binding	b1612,b2283,b4122,b0072,b0307,b4153,b1378,b2481,b0724,b2488,b2287,b2489,b2281,b2487,b2284
GO:0006113	9.706366153096107e-07	5	8	biological_process: fermentation	b4151,b3236,b4153,b4152,b4154
GO:0051287	2.0644491695632236e-06	9	42	molecular_function: NAD binding	b2286,b1479,b1136,b2463,b1800,b3152,b0073,b2487,b2284
GO:0051536	3.1136753288716535e-06	16	146	molecular_function: iron-sulfur cluster binding	b1612,b2283,b4122,b0072,b0307,b4153,b1378,b2481,b0724,b2488,b2287,b2489,b2285,b2281,b2487,b2284
GO:0004776	2.3614886675754278e-05	3	3	molecular_function: succinate-CoA ligase (GDP-forming) activity	b0320,b0729,b0518
GO:0008827	2.3614886675754278e-05	3	3	molecular_function: cytochrome o ubiquinol oxidase activity	b0429,b0432,b0430
GO:0004129	2.3614886675754278e-05	3	3	molecular_function: cytochrome-c oxidase activity	b0432,b0431,b0430
GO:0008177	2.3614886675754278e-05	3	3	molecular_function: succinate dehydrogenase (ubiquinone) activity	b0724,b0723,b0721
GO:0009098	4.256674362893295e-05	4	8	biological_process: leucine biosynthetic process	b0072,b0073,b0071,b0074
GO:0006754	7.491323290815948e-05	4	9	biological_process: ATP biosynthetic process	b3738,b3731,b3733,b3737
GO:0046933	7.491323290815948e-05	4	9	molecular_function: proton-transporting ATP synthase activity, rotational mechanism	b3738,b3731,b3733,b3737
GO:0015986	7.491323290815948e-05	4	9	biological_process: ATP synthesis coupled proton transport	b3738,b3731,b3733,b3737
GO:0016655	9.246288091915922e-05	3	4	molecular_function: oxidoreductase activity, acting on NAD(P)H, quinone or similar compound as acceptor	b2286,b4211,b2282
GO:0015765	9.246288091915922e-05	3	4	biological_process: methylgalactoside transport	b2150,b2148,b2149
GO:0045263	9.246288091915922e-05	3	4	cellular_component: proton-transporting ATP synthase complex, coupling factor F(o)	b3738,b3739,b3737
GO:0016627	0.00012207603752057656	4	10	molecular_function: oxidoreductase activity, acting on the CH-CH group of donors	b0723,b0722,b0721,b4154
GO:0048039	0.00022627707176666253	3	5	molecular_function: ubiquinone binding	b2277,b0431,b0721
GO:0004333	0.00022627707176666253	3	5	molecular_function: fumarate hydratase activity	b1612,b1611,b4122
GO:0050660	0.00031382001686029655	8	61	molecular_function: flavin adenine dinucleotide binding	b0723,b0042,b1698,b2210,b4154,b1109,b3962,b2769
GO:0005886	0.000371471868207204	50	1139	cellular_component: plasma membrane	b2279,b3738,b0723,b2148,b3739,b4153,b2276,b4515,b3731,b4154,b2277,b2486,b2484,b2280,b0428,b1109,b0979,b3733,b0721,b0321,b2281,b2483,b2284,b2288,b2278,b4151,b2485,b3737,b4152,b0432,b2287,b0518,b2285,b1496,b2282,b2286,b2283,b0869,b0722,b0431,b2482,b3528,b0734,b0724,b0733,b4123,b0429,b2149,b0978,b0430
GO:0009061	0.00044287296889147776	7	49	biological_process: anaerobic respiration	b4151,b3236,b0723,b4153,b4152,b1109,b4154
GO:0015757	0.0007589441421925031	3	7	biological_process: galactose transmembrane transport	b2150,b2148,b2149
GO:0020037	0.0007686292414975123	6	39	molecular_function: heme binding	b0722,b0431,b0734,b0733,b0721,b0978
GO:0006091	0.0008304207397025129	2	2	biological_process: generation of precursor metabolites and energy	b1612,b4122
GO:0003861	0.0008304207397025129	2	2	molecular_function: 3-isopropylmalate dehydratase activity	b0072,b0071
GO:0003862	0.0008304207397025129	2	2	molecular_function: 3-isopropylmalate dehydrogenase activity	b0073,b1800
GO:0070469	0.0008304207397025129	2	2	cellular_component: respiratory chain	b0432,b0431
GO:0045252	0.0008304207397025129	2	2	cellular_component: oxoglutarate dehydrogenase complex	b0726,b0727
GO:0004471	0.0008304207397025129	2	2	molecular_function: malate dehydrogenase (decarboxylating) (NAD+) activity	b1479,b2463
GO:0004470	0.0008304207397025129	2	2	molecular_function: malic enzyme activity	b1479,b2463
GO:0006106	0.0008304207397025129	2	2	biological_process: fumarate metabolic process	b4151,b1611
GO:0005354	0.0008304207397025129	2	2	molecular_function: galactose transmembrane transporter activity	b2148,b2149
GO:0042777	0.0008304207397025129	2	2	biological_process: plasma membrane ATP synthesis coupled proton transport	b3738,b3733
GO:0044780	0.001182403159901284	4	17	biological_process: bacterial-type flagellum assembly	b4152,b4154,b4151,b4153
GO:0046961	0.001188770581337957	3	8	molecular_function: proton-transporting ATPase activity, rotational mechanism	b3738,b3733,b3737
GO:0009082	0.0014866045564096903	4	18	biological_process: branched-chain amino acid biosynthetic process	b0072,b0073,b0071,b0074
GO:0046872	0.001568412042980283	33	692	molecular_function: metal ion binding	b4122,b4153,b1656,b0728,b1479,b0072,b1378,b0979,b0721,b2281,b2284,b2489,b1612,b2463,b1136,b3908,b2287,b2285,b0073,b2487,b1494,b2283,b0722,b0431,b2150,b3527,b0307,b2481,b0734,b0724,b2488,b0733,b0978
