GO:0010124	1.0219044405116918e-253	12	15	biological_process: phenylacetate catabolic process	b1389,b1390,b1391,b1397,b1388,b3845,b1393,b1395,b1396,b1392,b1398,b1394
GO:0006635	7.95628278773639e-111	8	15	biological_process: fatty acid beta-oxidation	b3846,b2342,b1397,b3845,b1393,b2341,b0221,b1394
GO:0003857	4.972428257822196e-105	4	4	molecular_function: 3-hydroxyacyl-CoA dehydrogenase activity	b3846,b1395,b2341,b2342
GO:0004300	4.193997306092757e-93	5	7	molecular_function: enoyl-CoA hydratase activity	b3846,b2342,b1393,b2341,b1394
GO:0047780	1.848738213217831e-78	3	3	molecular_function: citrate dehydratase activity	b0118,b0334,b1276
GO:0003994	2.822520827426748e-58	3	4	molecular_function: aconitate hydratase activity	b0118,b0334,b1276
GO:0004108	5.924962455655909e-52	2	2	molecular_function: citrate (Si)-synthase activity	b0720,b0333
GO:0050218	5.924962455655909e-52	2	2	molecular_function: propionate-CoA ligase activity	b4069,b0335
GO:0005291	5.924962455655909e-52	2	2	molecular_function: high-affinity L-histidine transmembrane transporter activity	b2306,b2308
GO:1903810	5.924962455655909e-52	2	2	biological_process: L-histidine import across plasma membrane	b2306,b2308
GO:0089709	5.924962455655909e-52	2	2	biological_process: L-histidine transmembrane transport	b2306,b2308
GO:0016509	5.924962455655909e-52	2	2	molecular_function: long-chain-3-hydroxyacyl-CoA dehydrogenase activity	b3846,b2341
GO:0008692	5.924962455655909e-52	2	2	molecular_function: 3-hydroxybutyryl-CoA epimerase activity	b3846,b2341
GO:0003988	3.449750168318381e-46	3	5	molecular_function: acetyl-CoA C-acyltransferase activity	b3845,b1397,b2342
GO:0006631	1.4817656513674383e-37	7	32	biological_process: fatty acid metabolic process	b3846,b2342,b3845,b1393,b1395,b2341,b0221
GO:0016042	1.4985016661000114e-36	4	11	biological_process: lipid catabolic process	b3846,b3845,b2341,b2342
GO:0046912	4.4479273053034085e-34	2	3	molecular_function: transferase activity, transferring acyl groups, acyl groups converted into alkyl on transfer	b0720,b0333
GO:0003730	4.4479273053034085e-34	2	3	molecular_function: mRNA 3'-UTR binding	b0118,b1276
GO:0019679	4.4479273053034085e-34	2	3	biological_process: propionate metabolic process, methylcitrate cycle	b0334,b0333
GO:0019629	3.527041438046975e-25	2	4	biological_process: propionate catabolic process, 2-methylcitrate cycle	b0118,b0335
GO:0071705	7.487235819326222e-23	4	17	biological_process: nitrogen compound transport	b2307,b2308,b2310,b2309
GO:0006099	2.139680510041605e-20	5	29	biological_process: tricarboxylic acid cycle	b0118,b0720,b1276,b0334,b0333
GO:0009062	2.401471368269571e-12	1	2	biological_process: fatty acid catabolic process	b3846
GO:0015822	2.401471368269571e-12	1	2	biological_process: ornithine transport	b2310
GO:0006476	2.401471368269571e-12	1	2	biological_process: protein deacetylation	b4069
GO:0019427	2.401471368269571e-12	1	2	biological_process: acetyl-CoA biosynthetic process from acetate	b4069
GO:0045733	2.401471368269571e-12	1	2	biological_process: acetate catabolic process	b4069
GO:0071294	2.401471368269571e-12	1	2	biological_process: cellular response to zinc ion	b2310
GO:0015654	2.401471368269571e-12	1	2	molecular_function: tellurite transmembrane transporter activity	b4067
GO:0015710	2.401471368269571e-12	1	2	biological_process: tellurite transport	b4067
GO:0006097	5.9533566113478e-12	2	8	biological_process: glyoxylate cycle	b0118,b1276
GO:0006629	3.365411255883152e-10	6	74	biological_process: lipid metabolic process	b3846,b2342,b3845,b1393,b2341,b0221
GO:0016405	5.2072058282188004e-08	1	3	molecular_function: CoA-ligase activity	b1398
GO:0033539	5.2072058282188004e-08	1	3	biological_process: fatty acid beta-oxidation using acyl-CoA dehydrogenase	b0221
GO:0006995	5.2072058282188004e-08	1	3	biological_process: cellular response to nitrogen starvation	b2310
GO:0016747	6.012685564889432e-08	3	25	molecular_function: transferase activity, transferring acyl groups other than amino-acyl groups	b3845,b1397,b2342
GO:0003729	5.705503532395222e-07	2	13	molecular_function: mRNA binding	b0118,b1276
GO:0003995	7.032221146696155e-06	1	4	molecular_function: acyl-CoA dehydrogenase activity	b0221
GO:0003985	7.032221146696155e-06	1	4	molecular_function: acetyl-CoA C-acetyltransferase activity	b2342
GO:0070404	7.032221146696155e-06	1	4	molecular_function: NADH binding	b0720
GO:0006865	1.9149536146333384e-05	5	87	biological_process: amino acid transport	b2309,b2307,b2306,b2308,b2310
GO:0006814	3.8728618306736824e-05	2	17	biological_process: sodium ion transport	b4067,b0007
GO:0016829	6.329267567002223e-05	7	169	molecular_function: lyase activity	b3846,b0118,b1276,b0334,b1393,b2341,b1394
GO:0016289	0.0001267428563676392	1	5	molecular_function: CoA hydrolase activity	b1396
GO:0016208	0.0001267428563676392	1	5	molecular_function: AMP binding	b4069
