GO:0003735	0.0	55	58	molecular_function: structural constituent of ribosome	b3318,b3185,b3314,b3305,b3231,b3297,b3308,b3342,b3985,b3230,b3299,b3986,b3313,b2606,b3636,b0911,b3315,b0023,b4506,b3165,b3296,b3936,b3984,b3311,b3302,b3316,b1716,b3319,b3309,b3341,b3637,b2185,b2609,b3307,b3317,b3703,b3312,b3303,b4203,b3321,b4202,b4200,b0169,b3186,b3065,b3983,b1717,b3320,b1089,b3298,b3310,b3301,b3294,b3306,b3304
GO:0005840	0.0	56	61	cellular_component: ribosome	b3318,b3185,b3314,b3305,b3231,b3297,b3308,b3342,b3985,b3230,b3299,b3986,b3313,b2606,b3636,b0911,b3315,b0023,b4506,b3165,b3296,b3936,b3984,b3311,b3302,b3316,b1716,b3319,b3309,b3341,b3637,b2185,b2609,b3307,b3317,b3703,b3312,b2608,b3303,b4203,b3321,b4202,b4200,b0169,b3186,b3065,b3983,b1717,b3320,b1089,b3298,b3310,b3301,b3294,b3306,b3304
GO:0006412	0.0	66	107	biological_process: translation	b3318,b3591,b3314,b3185,b3305,b3231,b3297,b3308,b3985,b3342,b3339,b3230,b3299,b3986,b3313,b2606,b3636,b3980,b0911,b3315,b0023,b4506,b3296,b3936,b3165,b0884,b3984,b3311,b3590,b3341,b3316,b1716,b3302,b3309,b3637,b3319,b2185,b3307,b2609,b3317,b3703,b1718,b3168,b3170,b3312,b4203,b3303,b0170,b4147,b3321,b4202,b4200,b0169,b3186,b3340,b3065,b3983,b1717,b3320,b1089,b3298,b3310,b3301,b3294,b3306,b3304
GO:0019843	6.683715035180389e-278	44	59	molecular_function: rRNA binding	b3318,b3185,b3314,b3305,b3871,b3297,b3308,b3342,b3985,b2597,b3313,b2606,b3315,b0023,b3165,b3296,b3936,b0884,b3984,b3311,b3316,b3319,b1716,b3341,b3309,b3637,b2185,b3307,b3317,b3312,b2608,b3303,b4203,b4202,b4200,b3186,b3065,b3983,b3320,b3298,b3310,b3301,b3306,b3304
GO:0022625	8.748578921504387e-274	32	32	cellular_component: cytosolic large ribosomal subunit	b3318,b3185,b3305,b3231,b3985,b3308,b3299,b3986,b3313,b3636,b2606,b3315,b3936,b3984,b3302,b3319,b1716,b3309,b3637,b2185,b3317,b3312,b4203,b3186,b3983,b1717,b3320,b1089,b3310,b3301,b3294,b3304
GO:0022627	1.3943897642402977e-163	22	25	cellular_component: cytosolic small ribosomal subunit	b3314,b3297,b3342,b3230,b2597,b0911,b0023,b3165,b3296,b3311,b3316,b3341,b3307,b2609,b3303,b3321,b4202,b4200,b0169,b3065,b3298,b3306
GO:0003723	5.869503594246818e-144	54	161	molecular_function: RNA binding	b3318,b3704,b3314,b3185,b3871,b3305,b3297,b3308,b3985,b3342,b3339,b3230,b2597,b3313,b2606,b3636,b3980,b0911,b3315,b0023,b3296,b3936,b3165,b0884,b3984,b3311,b3590,b3341,b3316,b1716,b3319,b3309,b3637,b2185,b3317,b3169,b1718,b3260,b3312,b2608,b4203,b3303,b3321,b4202,b4200,b3186,b3065,b3983,b3320,b3298,b3310,b3301,b3306,b3304
GO:0000028	2.4417252006051e-121	17	20	biological_process: ribosomal small subunit assembly	b3314,b3165,b3296,b3170,b3311,b2608,b3297,b3303,b3316,b3341,b0169,b3307,b2609,b0911,b3065,b3306,b0023
GO:0015934	2.1012304435697694e-118	14	14	cellular_component: large ribosomal subunit	b1717,b1089,b3317,b3984,b3985,b3310,b3302,b3319,b3315,b3301,b3986,b3294,b3636,b3983
GO:0000027	1.062261952644224e-106	19	28	biological_process: ribosomal large subunit assembly	b3318,b3185,b3320,b3305,b1089,b3317,b3984,b3294,b3312,b3308,b2185,b3302,b1716,b3309,b3313,b3637,b2606,b3636,b3983
GO:0015935	2.948205252530772e-101	12	12	cellular_component: small ribosomal subunit	b3296,b3298,b3303,b3342,b3316,b3230,b3321,b3341,b0169,b3307,b2609,b0023
GO:0070180	1.3556223930962144e-75	9	9	molecular_function: large ribosomal subunit rRNA binding	b3305,b3231,b3985,b4203,b3310,b1716,b3309,b2606,b3983
GO:0003746	9.82148610320671e-51	7	8	molecular_function: translation elongation factor activity	b2171,b3590,b4147,b0170,b3339,b3340,b3980
GO:0070181	2.155296807601648e-42	6	7	molecular_function: small ribosomal subunit rRNA binding	b3165,b3311,b3297,b4202,b4200,b0023
GO:0006414	2.155296807601648e-42	6	7	biological_process: translational elongation	b2171,b4147,b0170,b3339,b3340,b3980
GO:0000049	8.944299365372881e-37	15	46	molecular_function: tRNA binding	b3704,b3185,b3871,b3984,b3260,b3298,b3590,b3308,b3342,b3316,b3230,b3341,b3321,b3313,b3636
GO:0043022	6.434656675507853e-27	10	28	molecular_function: ribosome binding	b1718,b3185,b0884,b3985,b2608,b4147,b0436,b2597,b1203,b3986
GO:0008097	1.2958545846875975e-24	3	3	molecular_function: 5S rRNA binding	b3308,b3304,b2185
GO:1990145	1.2958545846875975e-24	3	3	biological_process: maintenance of translational fidelity	b3303,b3342,b3296
GO:0006413	2.8971332847885e-21	4	6	biological_process: translational initiation	b1718,b3168,b3936,b0884
GO:0048027	2.8971332847885e-21	4	6	molecular_function: mRNA 5'-UTR binding	b3297,b3296,b4202,b4200
GO:0005829	1.751809410087417e-20	68	1032	cellular_component: cytosol	b3591,b3314,b3305,b3231,b3297,b3308,b3985,b3342,b3988,b3230,b2597,b3986,b2606,b3636,b3980,b3315,b0023,b3296,b3936,b3165,b0884,b3984,b3357,b3590,b0171,b3341,b1716,b3316,b3309,b3637,b3987,b1088,b2185,b3319,b3295,b3317,b0910,b3169,b1718,b3168,b0474,b3170,b2608,b4203,b3303,b0170,b4147,b3321,b4202,b4200,b3186,b3340,b3065,b3983,b2607,b3320,b1089,b3298,b2171,b0436,b3067,b1274,b3310,b3294,b3261,b3306,b4059,b3304
GO:0017148	1.2335235082108447e-19	6	14	biological_process: negative regulation of translation	b3231,b3985,b3341,b3319,b1716,b2185
GO:0003743	5.237721933136186e-18	3	4	molecular_function: translation initiation factor activity	b1718,b3168,b0884
GO:0003924	6.499792507720092e-18	8	26	molecular_function: GTPase activity	b3168,b3871,b3985,b3590,b3339,b3986,b3340,b3980
GO:0043043	3.16121091447048e-16	2	2	biological_process: peptide biosynthetic process	b2171,b4147
GO:0046034	3.16121091447048e-16	2	2	biological_process: ATP metabolic process	b3734,b3732
GO:0002181	3.16121091447048e-16	2	2	biological_process: cytoplasmic translation	b3317,b3305
GO:0042788	3.16121091447048e-16	2	2	cellular_component: polysomal ribosome	b3315,b3319
GO:0001514	3.16121091447048e-16	2	2	biological_process: selenocysteine incorporation	b3591,b3590
GO:0046961	2.047698137136792e-15	4	8	molecular_function: proton-transporting ATPase activity, rotational mechanism	b3736,b3735,b3734,b3732
GO:0003729	2.363624532902373e-14	5	13	molecular_function: mRNA binding	b3314,b3231,b3341,b1716,b0911
GO:0046940	4.541460745986305e-14	3	5	biological_process: nucleoside monophosphate phosphorylation	b0474,b0910,b0171
GO:0006417	6.440646891384166e-14	7	25	biological_process: regulation of translation	b3165,b3296,b3984,b3985,b3319,b2597,b3306
GO:0006754	1.7721226661036164e-13	4	9	biological_process: ATP biosynthetic process	b3736,b3735,b3734,b3732
GO:0046933	1.7721226661036164e-13	4	9	molecular_function: proton-transporting ATP synthase activity, rotational mechanism	b3736,b3735,b3734,b3732
GO:0015986	1.7721226661036164e-13	4	9	biological_process: ATP synthesis coupled proton transport	b3736,b3735,b3734,b3732
GO:0006353	1.8394995028068667e-11	3	6	biological_process: DNA-templated transcription, termination	b3169,b3296,b3319
GO:0045261	1.8394995028068667e-11	3	6	cellular_component: proton-transporting ATP synthase complex, catalytic core F(1)	b3735,b3734,b3732
GO:0000900	2.0211634860383017e-10	2	3	molecular_function: translation repressor activity, mRNA regulatory element binding	b1716,b3296
GO:0032790	2.0211634860383017e-10	2	3	biological_process: ribosome disassembly	b1718,b3340
GO:0045947	1.3001604684385508e-09	3	7	biological_process: negative regulation of translational initiation	b2597,b3296,b3984
GO:0003899	1.3001604684385508e-09	3	7	molecular_function: DNA-directed 5'-3' RNA polymerase activity	b3987,b3988,b3295
GO:0042254	4.1377115796032145e-09	5	19	biological_process: ribosome biogenesis	b3871,b3170,b2608,b3985,b1088
GO:0005515	2.7561819236340265e-08	54	1066	molecular_function: protein binding	b3318,b3591,b3185,b3871,b3297,b3985,b3734,b3342,b3988,b3339,b2597,b3986,b3980,b3315,b4201,b3296,b0884,b3984,b3357,b3590,b3300,b3341,b3319,b3309,b3637,b3987,b3317,b3295,b3169,b1718,b3168,b3732,b0474,b3170,b2608,b4203,b3303,b0170,b3321,b4202,b4200,b0169,b3983,b3320,b1089,b3298,b0436,b3067,b1274,b3310,b1203,b3301,b3261,b4059
GO:0046677	1.1350847402607339e-07	12	101	biological_process: response to antibiotic	b3305,b3296,b3311,b3988,b3303,b3342,b3339,b3319,b3987,b3636,b3980,b3315
GO:0042255	1.466847185001189e-07	2	4	biological_process: ribosome assembly	b3315,b3319
GO:0016021	4.823799211287953e-05	3	966	cellular_component: integral component of membrane	b2543,b3736,b3300
GO:0042274	9.242084715206416e-05	2	6	biological_process: ribosomal small subunit biogenesis	b3170,b2608
GO:0005525	0.00016473401377814135	7	58	molecular_function: GTP binding	b3168,b3871,b3590,b3339,b1203,b3340,b3980
GO:0005886	0.00029901099964885333	8	1139	cellular_component: plasma membrane	b3732,b3736,b3734,b3735,b3300,b3339,b2543,b3980
GO:0044238	0.0008973856337248216	1	2	biological_process: primary metabolic process	b2597
GO:0008073	0.0008973856337248216	1	2	molecular_function: ornithine decarboxylase inhibitor activity	b0023
GO:0015951	0.0008973856337248216	1	2	biological_process: purine ribonucleotide interconversion	b0474
GO:0006165	0.0008973856337248216	1	2	biological_process: nucleoside diphosphate phosphorylation	b0474
GO:0009132	0.0008973856337248216	1	2	biological_process: nucleoside diphosphate metabolic process	b0474
GO:0009041	0.0008973856337248216	1	2	molecular_function: uridylate kinase activity	b0171
GO:0044210	0.0008973856337248216	1	2	biological_process: 'de novo' CTP biosynthetic process	b0171
GO:0004017	0.0008973856337248216	1	2	molecular_function: adenylate kinase activity	b0474
GO:0004550	0.0008973856337248216	1	2	molecular_function: nucleoside diphosphate kinase activity	b0474
GO:0042256	0.0008973856337248216	1	2	biological_process: mature ribosome assembly	b3185
GO:0097056	0.0008973856337248216	1	2	biological_process: selenocysteinyl-tRNA(Sec) biosynthetic process	b3591
GO:0000462	0.0008973856337248216	1	2	biological_process: maturation of SSU-rRNA from tricistronic rRNA transcript (SSU-rRNA, 5.8S rRNA, LSU-rRNA)	b3297
GO:0001121	0.0008973856337248216	1	2	biological_process: bacterial transcription	b3261
GO:0042781	0.0008973856337248216	1	2	molecular_function: 3'-tRNA processing endoribonuclease activity	b3704
GO:0034414	0.0008973856337248216	1	2	biological_process: tRNA 3'-trailer cleavage, endonucleolytic	b3704
GO:0008301	0.0008973856337248216	1	2	molecular_function: DNA binding, bending	b3357
GO:0031421	0.0008973856337248216	1	2	cellular_component: invertasome	b3261
