GO:0006313	1.478122504104189e-23	12	48	biological_process: transposition, DNA-mediated	b1894,b0988,b0274,b0264,b0022,b0021,b3445,b0275,b3444,b1893,b4516,b0265
GO:0032196	1.1622882533903894e-22	12	57	biological_process: transposition	b1894,b0988,b0274,b0264,b0022,b0021,b3445,b0275,b3444,b1893,b4516,b0265
GO:0006310	2.225465739447219e-19	12	107	biological_process: DNA recombination	b1894,b0988,b0274,b0264,b0022,b0021,b3445,b0275,b3444,b1893,b4516,b0265
GO:0004803	9.697608347281728e-10	6	39	molecular_function: transposase activity	b0988,b0274,b0264,b0021,b3445,b1893
GO:0032196	1.1622882533903894e-22	12	57	biological_process: transposition	b1996,b1402,b0360,b4272,b2861,b4273,b3045,b0361,b2860,b1403,b3044,b1997
GO:0006310	2.225465739447219e-19	12	107	biological_process: DNA recombination	b1996,b1402,b0360,b4272,b2861,b4273,b3045,b0361,b2860,b1403,b3044,b1997
GO:0003677	2.1907645182875454e-11	12	496	molecular_function: DNA binding	b1996,b1402,b0360,b4272,b2861,b4273,b3045,b0361,b2860,b1403,b3044,b1997
GO:0015074	2.472516625562888e-10	6	31	biological_process: DNA integration	b1996,b1402,b4273,b3045,b0361,b2860
GO:0004803	9.697608347281728e-10	6	39	molecular_function: transposase activity	b0360,b4272,b2861,b1403,b3044,b1997
GO:0006313	3.329943165125711e-09	6	48	biological_process: transposition, DNA-mediated	b0360,b4272,b2861,b1403,b3044,b1997
GO:0003676	1.2797338625228194e-07	6	89	molecular_function: nucleic acid binding	b1996,b1402,b4273,b3045,b0361,b2860
GO:0009231	2.1324150636176342e-08	4	9	biological_process: riboflavin biosynthetic process	b0414,b0415,b1277,b3041
GO:0008962	1.3610854201689897e-07	3	3	molecular_function: phosphatidylglycerophosphatase activity	b0418,b2560,b1278
GO:0009395	1.3610854201689897e-07	3	3	biological_process: phospholipid catabolic process	b0418,b2560,b1278
GO:0006655	3.219971460081336e-07	3	4	biological_process: phosphatidylglycerol biosynthetic process	b0418,b2560,b1278
GO:0046474	6.276715237451033e-07	3	5	biological_process: glycerophospholipid biosynthetic process	b0418,b2560,b1278
GO:0016042	6.605432712301357e-06	3	11	biological_process: lipid catabolic process	b0418,b2560,b1278
GO:0046872	7.153671392978863e-05	9	692	molecular_function: metal ion binding	b4161,b0418,b0413,b2560,b0414,b4162,b0417,b1277,b3041
GO:0006629	8.620359134685432e-05	4	74	biological_process: lipid metabolic process	b4160,b0418,b2560,b1278
GO:0006260	6.127835795650685e-25	22	47	biological_process: DNA replication	b4372,b4259,b0923,b2675,b0924,b0640,b2235,b3702,b3701,b3935,b0922,b0470,b1099,b2676,b3700,b0184,b3066,b0215,b2496,b3863,b2234,b4052
GO:0003887	5.877803298302858e-17	12	14	molecular_function: DNA-directed DNA polymerase activity	b0184,b0215,b4372,b1183,b4259,b0640,b0470,b3863,b1099,b1184,b0060,b3701
GO:0071897	8.338850469820845e-13	9	11	biological_process: DNA biosynthetic process	b0184,b0215,b4372,b4259,b0640,b0470,b3863,b1099,b0060
GO:0016779	4.214393343795483e-12	13	47	molecular_function: nucleotidyltransferase activity	b0184,b3066,b0215,b4372,b4259,b3053,b0640,b3052,b0470,b1099,b3863,b0060,b3701
GO:0005737	8.962830655501429e-11	41	848	cellular_component: cytoplasm	b0183,b2827,b2564,b0954,b0923,b2675,b0949,b2567,b0924,b0185,b2231,b3256,b4258,b2949,b3255,b2235,b3702,b1098,b2236,b3701,b2315,b0181,b0922,b4373,b0948,b2563,b0182,b3640,b2676,b0214,b3700,b0471,b4374,b0184,b3066,b2566,b2316,b2580,b3699,b3863,b0180
GO:0006261	2.735220941861314e-10	8	14	biological_process: DNA-dependent DNA replication	b3935,b2231,b3699,b0640,b0470,b3863,b1099,b0060
GO:0006633	7.383232683108611e-08	7	19	biological_process: fatty acid biosynthetic process	b0185,b2316,b2563,b3256,b0954,b3255,b0180
GO:0005515	1.1977720740781173e-07	41	1066	molecular_function: protein binding	b2553,b4372,b4259,b0923,b0949,b2567,b0924,b2674,b1184,b0185,b1100,b2231,b1097,b3256,b0640,b3255,b2235,b3702,b3701,b3935,b0922,b0948,b1183,b0182,b0470,b1099,b2676,b0214,b3639,b3700,b0471,b0184,b3066,b0215,b2566,b2316,b2580,b3699,b2496,b2234,b4052
GO:0008408	1.7992398443447847e-07	6	13	molecular_function: 3'-5' exonuclease activity	b0184,b0215,b4372,b3863,b1099,b3701
GO:0090305	9.992579442225236e-07	10	73	biological_process: nucleic acid phosphodiester bond hydrolysis	b0183,b0184,b0215,b4372,b2949,b3863,b1099,b2567,b0060,b3701
GO:0009360	1.087476288053692e-06	4	4	cellular_component: DNA polymerase III complex	b0640,b0470,b1099,b3701
GO:0003989	1.087476288053692e-06	4	4	molecular_function: acetyl-CoA carboxylase activity	b2316,b0185,b3256,b3255
GO:0005971	1.087476288053692e-06	4	4	cellular_component: ribonucleoside-diphosphate reductase complex	b2235,b2234,b2675,b2676
GO:0000166	3.057669482875098e-06	25	517	molecular_function: nucleotide binding	b2553,b3052,b2675,b0949,b2567,b0924,b0060,b0185,b2231,b3256,b4258,b3702,b1098,b3935,b2315,b0470,b3700,b4374,b2566,b2316,b3699,b3053,b2496,b2234,b4052
GO:0009314	4.276808850006581e-06	8	50	biological_process: response to radiation	b2827,b2565,b4372,b4259,b0949,b0472,b3700,b0471
GO:0009263	5.353865849667686e-06	4	6	biological_process: deoxyribonucleotide biosynthetic process	b2235,b2234,b2675,b2676
GO:0004748	5.353865849667686e-06	4	6	molecular_function: ribonucleoside-diphosphate reductase activity, thioredoxin disulfide as acceptor	b2235,b2234,b2675,b2676
GO:0005524	9.271796975183012e-06	22	441	molecular_function: ATP binding	b2553,b3052,b2675,b0949,b2567,b0955,b0924,b0185,b2231,b3256,b4258,b3702,b1098,b3935,b2315,b0470,b3700,b2316,b3699,b3053,b2234,b4052
GO:0006629	9.380251615617312e-06	9	74	biological_process: lipid metabolic process	b0185,b0181,b2316,b2563,b3256,b0954,b0182,b3255,b0180
GO:0006281	1.733050773668988e-05	9	80	biological_process: DNA repair	b2565,b0060,b2580,b1183,b0949,b3863,b0472,b1184,b3700
GO:0016740	2.0974189192186266e-05	25	576	molecular_function: transferase activity	b2827,b2564,b4372,b4259,b3052,b0060,b0185,b0640,b0921,b1098,b3701,b0181,b4373,b0948,b2563,b0182,b0470,b1099,b0184,b3066,b0215,b2316,b3053,b3863,b2828
GO:0008094	2.5994040336202554e-05	4	9	molecular_function: DNA-dependent ATPase activity	b2231,b1184,b3699,b1183
GO:2001295	2.6291363950977963e-05	3	3	biological_process: malonyl-CoA biosynthetic process	b2316,b0185,b3256
GO:0009317	2.6291363950977963e-05	3	3	cellular_component: acetyl-CoA carboxylase complex	b2316,b0185,b3255
GO:0006631	3.0386988013063345e-05	6	32	biological_process: fatty acid metabolic process	b0185,b2316,b2563,b3256,b0954,b3255
GO:0003677	5.826141404928975e-05	22	496	molecular_function: DNA binding	b4259,b0949,b0924,b0060,b2231,b0640,b0472,b3702,b3701,b3935,b1183,b0470,b1099,b3700,b0471,b0184,b3066,b0215,b2316,b3699,b3863,b4052
GO:0006270	0.0001185332056644036	3	5	biological_process: DNA replication initiation	b3702,b2496,b3935
GO:0005829	0.00012774594982986452	34	1032	cellular_component: cytosol	b2553,b2827,b2564,b0954,b3052,b1096,b2948,b2567,b0924,b0185,b1100,b2231,b3256,b4258,b3255,b2235,b3702,b1098,b3701,b0181,b3640,b3639,b3700,b0471,b0184,b0215,b2566,b2316,b3699,b3053,b2496,b3863,b2234,b4052
GO:0030261	0.00020212969164514448	3	6	biological_process: chromosome condensation	b0922,b0923,b0924
GO:0009295	0.00023555698656727657	4	16	cellular_component: nucleoid	b0922,b0923,b0924,b0471
GO:0003676	0.00024357252179831813	8	89	molecular_function: nucleic acid binding	b0183,b0184,b3935,b0215,b0948,b3863,b0214,b0060
GO:1990077	0.00031675309259794333	3	7	cellular_component: primosome complex	b3066,b3935,b4052
GO:0006269	0.00031675309259794333	3	7	biological_process: DNA replication, synthesis of RNA primer	b3066,b3935,b4052
GO:0015949	0.00044930737235941205	4	19	biological_process: nucleobase-containing small molecule interconversion	b2235,b2234,b2675,b1098
GO:0006302	0.0006556426898001908	3	9	biological_process: double-strand break repair	b3935,b2565,b3700
GO:0008693	0.0006598583666775019	2	2	molecular_function: 3-hydroxydecanoyl-[acyl-carrier-protein] dehydratase activity	b0954,b0180
GO:0019171	0.0006598583666775019	2	2	molecular_function: 3-hydroxyacyl-[acyl-carrier-protein] dehydratase activity	b0954,b0180
GO:0004317	0.0006598583666775019	2	2	molecular_function: 3-hydroxypalmitoyl-[acyl-carrier-protein] dehydratase activity	b0954,b0180
GO:0008659	0.0006598583666775019	2	2	molecular_function: (3R)-hydroxymyristoyl-[acyl-carrier-protein] dehydratase activity	b0954,b0180
GO:0047451	0.0006598583666775019	2	2	molecular_function: 3-hydroxyoctanoyl-[acyl-carrier-protein] dehydratase activity	b0954,b0180
GO:0004523	0.0006598583666775019	2	2	molecular_function: RNA-DNA hybrid ribonuclease activity	b0183,b0214
GO:0043137	0.0006598583666775019	2	2	biological_process: DNA replication, removal of RNA primer	b0183,b0214
GO:0009329	0.0006598583666775019	2	2	cellular_component: acetate CoA-transferase complex	b2316,b0185
GO:0042759	0.0006598583666775019	2	2	biological_process: long-chain fatty acid biosynthetic process	b2316,b0185
GO:0009355	0.0006598583666775019	2	2	cellular_component: DNA polymerase V complex	b1184,b1183
GO:0034335	0.0006598583666775019	2	2	molecular_function: DNA supercoiling activity	b2231,b3699
GO:0051301	9.409404257623848e-19	15	73	biological_process: cell division	b0087,b0094,b0088,b0090,b0083,b0085,b0086,b0890,b0093,b0095,b0634,b0091,b0089,b3933,b0084
GO:0007049	1.4959599213293306e-17	14	67	biological_process: cell cycle	b0087,b0094,b0088,b0090,b0083,b0085,b0086,b0890,b0093,b0095,b0091,b0089,b3933,b0084
GO:0009252	4.91101220861604e-16	12	47	biological_process: peptidoglycan biosynthetic process	b0087,b0088,b0149,b0635,b0090,b0085,b0086,b0634,b0092,b0091,b0089,b0084
GO:0008360	8.030786479047835e-16	12	49	biological_process: regulation of cell shape	b0087,b0088,b0149,b0635,b0090,b0085,b0086,b0634,b0092,b0091,b0089,b0084
GO:0071555	5.099518648968929e-15	13	78	biological_process: cell wall organization	b0087,b0088,b0633,b0149,b0635,b0090,b0085,b0086,b0634,b0092,b0091,b0089,b0084
GO:0032153	8.62816205639721e-11	8	32	cellular_component: cell division site	b0094,b0083,b0634,b0093,b0095,b0089,b3933,b0084
GO:0043093	1.9072701065633798e-09	7	29	biological_process: FtsZ-dependent cytokinesis	b0094,b0083,b0093,b0095,b0089,b3933,b0084
GO:0008955	2.54189929381057e-07	4	7	molecular_function: peptidoglycan glycosyltransferase activity	b0089,b0634,b0149,b0084
GO:0000917	3.921248643960676e-06	4	14	biological_process: division septum assembly	b0095,b0093,b3933,b0084
GO:0005515	2.5867145171236423e-05	19	1066	molecular_function: protein binding	b0094,b3019,b0088,b0149,b3030,b0090,b0635,b0083,b0085,b0636,b0890,b0637,b0093,b0095,b3034,b0091,b0089,b3933,b0084
GO:0009002	6.15749832111985e-05	3	10	molecular_function: serine-type D-Ala-D-Ala carboxypeptidase activity	b0635,b0149,b0084
GO:0090529	8.154121582323e-05	3	11	biological_process: cell septum assembly	b0095,b0093,b3933
GO:0008658	8.154121582323e-05	3	11	molecular_function: penicillin binding	b0635,b0149,b0084
GO:0030541	0.00010939061565443776	2	2	biological_process: plasmid partitioning	b3019,b3030
GO:0007059	0.00016556538294982106	3	14	biological_process: chromosome segregation	b3019,b3030,b0890
GO:0004180	0.00020260737830754726	3	15	molecular_function: carboxypeptidase activity	b0635,b0149,b0084
GO:0015836	0.0002449774867901376	2	3	biological_process: lipid-linked peptidoglycan transport	b0089,b0634
GO:0015648	0.0002449774867901376	2	3	molecular_function: lipid-linked peptidoglycan transporter activity	b0089,b0634
GO:0007062	0.00043347897914936255	2	4	biological_process: sister chromatid cohesion	b3019,b3030
GO:0003918	0.00043347897914936255	2	4	molecular_function: DNA topoisomerase type II (ATP-hydrolyzing) activity	b3019,b3030
GO:0009058	0.0004538233547471079	4	48	biological_process: biosynthetic process	b0091,b0088,b0085,b0086
GO:0006633	2.4632740011364982e-11	6	19	biological_process: fatty acid biosynthetic process	b1093,b1095,b1092,b1090,b1288,b1091
GO:0006629	1.5432669059186916e-09	7	74	biological_process: lipid metabolic process	b1093,b1095,b1092,b1090,b1288,b0736,b1091
GO:0043213	2.1324150636176342e-08	4	9	biological_process: bacteriocin transport	b0739,b0738,b0737,b0740
GO:0007049	4.390856312328487e-08	6	67	biological_process: cell cycle	b0739,b0738,b0740,b0742,b0741,b0737
GO:0006631	4.9235161360957365e-08	5	32	biological_process: fatty acid metabolic process	b1093,b1095,b1092,b1288,b1091
GO:0032153	4.9235161360957365e-08	5	32	cellular_component: cell division site	b0739,b0738,b0740,b0741,b0737
GO:0051301	7.276195740065868e-08	6	73	biological_process: cell division	b0739,b0738,b0740,b0742,b0741,b0737
GO:0017038	6.276715237451033e-07	3	5	biological_process: protein import	b0739,b0737,b0740
GO:0071237	2.113309004857981e-05	2	2	biological_process: cellular response to bacteriocin	b0739,b0740
GO:0004315	4.745862477706747e-05	2	3	molecular_function: 3-oxoacyl-[acyl-carrier-protein] synthase activity	b1091,b1095
GO:0030497	4.745862477706747e-05	2	3	biological_process: fatty acid elongation	b1093,b1288
GO:0055072	3.297450827778743e-28	22	28	biological_process: iron ion homeostasis	b0153,b0151,b0590,b0588,b4292,b4289,b4288,b2155,b4290,b1102,b0592,b0152,b4291,b4293,b0150,b3409,b3408,b0805,b0584,b0589,b4287,b0585
GO:0006811	3.3115791795011035e-21	27	113	biological_process: ion transport	b0153,b0151,b0590,b0588,b4292,b4289,b4288,b3966,b4036,b2155,b4290,b1102,b0592,b0152,b4291,b4293,b0150,b3409,b0698,b3408,b0696,b0805,b0584,b0589,b0697,b4287,b0585
GO:0043190	1.8440673138134367e-17	22	90	cellular_component: ATP-binding cassette (ABC) transporter complex	b3750,b0153,b1709,b0151,b0590,b0588,b4033,b0914,b3749,b1124,b1126,b4035,b1711,b0886,b0855,b0887,b0856,b3450,b4034,b4032,b0857,b1125
GO:0033214	6.682850413233935e-14	10	11	biological_process: iron assimilation by chelation and transport	b4289,b4288,b0153,b0584,b0589,b4290,b0151,b0590,b0585,b4367
GO:0009239	1.1141821132903751e-11	8	8	biological_process: enterobactin biosynthetic process	b0593,b0596,b0597,b0594,b0595,b0583,b0586,b4511
GO:0044718	5.69919062992644e-10	7	8	biological_process: siderophore transmembrane transport	b4291,b0805,b0150,b0584,b2155,b1252,b1102
GO:0015847	1.509433161410092e-09	8	15	biological_process: putrescine transport	b0854,b1124,b1126,b1123,b0857,b0856,b1125,b0855
GO:0055085	2.8786566195197504e-09	27	357	biological_process: transmembrane transport	b3750,b0153,b1709,b3451,b0590,b4033,b0914,b4289,b1124,b4288,b3452,b1126,b1711,b0886,b0855,b3005,b0887,b0856,b3453,b4034,b4032,b3006,b0589,b0857,b1252,b4287,b1125
GO:0015889	4.6380833037407365e-09	6	6	biological_process: cobalamin transport	b1710,b3966,b1709,b1711,b1252,b0158
GO:0015344	1.1498691870048234e-08	6	7	molecular_function: siderophore uptake transmembrane transporter activity	b4291,b0805,b0150,b0584,b2155,b1102
GO:0015891	5.0208422945001245e-08	6	9	biological_process: siderophore transport	b4291,b0805,b0150,b0584,b1252,b1102
GO:0042956	9.45459995705422e-08	5	5	biological_process: maltodextrin transport	b4034,b4032,b4036,b4035,b4033
GO:0038023	2.313626431807606e-07	5	6	molecular_function: signaling receptor activity	b4291,b0805,b0150,b0584,b1102
GO:0015685	2.313626431807606e-07	5	6	biological_process: ferric-enterobactin transport	b0584,b0589,b0590,b0588,b0592
GO:0015768	2.313626431807606e-07	5	6	biological_process: maltose transport	b4034,b4032,b4036,b4035,b4033
GO:0001407	1.9397400165294313e-06	4	4	biological_process: glycerophosphodiester transmembrane transport	b3451,b3453,b3452,b3450
GO:0016020	4.201346484356512e-06	48	1299	cellular_component: membrane	b3750,b0153,b1709,b3451,b0151,b0590,b0588,b4033,b0915,b0914,b4289,b3749,b1124,b4288,b3452,b1126,b3966,b4036,b2155,b3751,b0583,b4035,b1711,b1102,b0886,b0855,b4291,b0150,b3409,b0698,b3005,b0887,b0856,b3450,b0696,b0805,b4032,b3006,b0584,b0589,b0594,b0697,b0857,b1252,b0695,b4287,b1125,b4367
GO:0015620	4.659421058590805e-06	4	5	molecular_function: ferric-enterobactin transmembrane transporter activity	b0584,b0589,b0590,b0588
GO:0015846	4.659421058590805e-06	4	5	biological_process: polyamine transport	b1126,b0854,b0855,b1123
GO:0015794	4.659421058590805e-06	4	5	biological_process: glycerol-3-phosphate transmembrane transport	b3451,b3453,b3452,b3450
GO:0016887	5.695158036340717e-06	12	114	molecular_function: ATPase activity	b0914,b3749,b1126,b0887,b1709,b4035,b0151,b3450,b0588,b4287,b0886,b0855
GO:0055052	1.103157779989314e-05	6	23	cellular_component: ATP-binding cassette (ABC) transporter complex, substrate-binding subunit-containing	b4034,b3452,b0589,b3451,b4035,b3450
GO:0047527	4.0476309695804405e-05	3	3	molecular_function: 2,3-dihydroxybenzoate-serine ligase activity	b0586,b0594,b0595
GO:0015595	4.0476309695804405e-05	3	3	molecular_function: spermidine-importing ATPase activity	b1126,b1125,b1124
GO:0031992	4.0476309695804405e-05	3	3	molecular_function: energy transducer activity	b1252,b3005,b3006
GO:0015420	4.0476309695804405e-05	3	3	molecular_function: cobalamin-transporting ATPase activity	b3966,b1711,b1709
GO:0015752	4.0476309695804405e-05	3	3	biological_process: D-ribose transmembrane transport	b3750,b3749,b3751
GO:1904981	4.0476309695804405e-05	3	3	biological_process: maltose transmembrane transport	b4035,b4033,b4032
GO:0015423	4.0476309695804405e-05	3	3	molecular_function: maltose-transporting ATPase activity	b4035,b4033,b4032
GO:1990060	4.0476309695804405e-05	3	3	cellular_component: maltose transport complex	b4035,b4033,b4032
GO:0043213	4.5840500516215484e-05	4	9	biological_process: bacteriocin transport	b1252,b3005,b2155,b3006
GO:0031230	6.874557168087346e-05	4	10	cellular_component: intrinsic component of cell outer membrane	b0584,b3966,b4036,b2155
GO:0042626	7.538964242801746e-05	5	20	molecular_function: ATPase activity, coupled to transmembrane movement of substances	b0914,b0887,b1709,b4287,b0886
GO:0008643	7.741468835102386e-05	10	104	biological_process: carbohydrate transport	b4037,b4034,b3750,b3749,b4032,b4036,b3751,b4035,b4033,b3450
GO:0019290	9.447716048774477e-05	3	4	biological_process: siderophore biosynthetic process	b0594,b0596,b4511
GO:0008556	9.447716048774477e-05	3	4	molecular_function: potassium-transporting ATPase activity	b0697,b0698,b0696
GO:0031004	9.447716048774477e-05	3	4	cellular_component: potassium ion-transporting ATPase complex	b0697,b0698,b0696
GO:0015169	9.447716048774477e-05	3	4	molecular_function: glycerol-3-phosphate transmembrane transporter activity	b3451,b3452,b3450
GO:0019904	9.903400804087962e-05	4	11	molecular_function: protein domain specific binding	b0150,b1252,b3966,b0584
GO:1903711	0.0001817072334742666	3	5	biological_process: spermidine transmembrane transport	b1126,b1125,b1124
GO:0098797	0.00030919820432864683	3	6	cellular_component: plasma membrane protein complex	b1252,b3005,b3006
GO:0005887	0.00033867747230937717	24	546	cellular_component: integral component of plasma membrane	b3750,b0153,b3451,b0590,b4033,b0914,b4289,b1124,b4288,b3452,b1711,b0886,b3409,b0698,b3005,b0887,b0856,b0696,b4032,b3006,b0589,b0697,b0695,b1125
GO:0005886	0.0004940924080759541	39	1139	cellular_component: plasma membrane	b3750,b0153,b1709,b3451,b0586,b0151,b0590,b0588,b4033,b0915,b0914,b4289,b3749,b1124,b4288,b3452,b1126,b4035,b1711,b0886,b0855,b3409,b0698,b3005,b0887,b0856,b3450,b0696,b4032,b3006,b0589,b0595,b0697,b0857,b1252,b0695,b4287,b1125,b4367
GO:0042597	0.000535956682611991	12	184	cellular_component: periplasmic space	b1710,b4037,b0854,b0152,b4034,b1123,b3751,b4290,b4292,b0592,b0158,b3453
GO:0005524	0.0008289336117056276	20	441	molecular_function: ATP binding	b0914,b3749,b0886,b0696,b1126,b0594,b0887,b1709,b3752,b0697,b0586,b4035,b0151,b3418,b0588,b3450,b0695,b4287,b0915,b0855
GO:0030288	0.0008515536455522783	12	194	cellular_component: outer membrane-bounded periplasmic space	b4037,b0854,b0152,b4034,b1452,b3751,b1123,b4290,b1252,b0592,b0158,b3453
GO:0090482	0.0008784910755274821	2	2	molecular_function: vitamin transmembrane transporter activity	b3966,b1711
GO:0035461	0.0008784910755274821	2	2	biological_process: vitamin transmembrane transport	b3966,b1711
GO:0015343	0.0008784910755274821	2	2	molecular_function: siderophore transmembrane transporter activity	b1252,b2155
GO:0015603	0.0008784910755274821	2	2	molecular_function: iron chelate transmembrane transporter activity	b4289,b4288
GO:0009366	0.0008784910755274821	2	2	cellular_component: enterobactin synthetase complex	b0583,b0586
GO:0042914	0.0008784910755274821	2	2	biological_process: colicin transport	b0584,b1252
GO:0019810	0.0008784910755274821	2	2	molecular_function: putrescine binding	b0854,b1123
GO:0015417	0.0008784910755274821	2	2	molecular_function: polyamine-transporting ATPase activity	b1126,b0855
GO:0001406	0.0008784910755274821	2	2	molecular_function: glycerophosphodiester transmembrane transporter activity	b3452,b3450
GO:0019303	0.0008784910755274821	2	2	biological_process: D-ribose catabolic process	b3752,b3748
GO:0015591	0.0008784910755274821	2	2	molecular_function: D-ribose transmembrane transporter activity	b3750,b3749
GO:0016021	0.0009132639882545102	34	966	cellular_component: integral component of membrane	b3750,b0153,b3451,b0590,b4033,b0914,b4289,b1124,b4288,b3452,b3966,b4036,b2155,b1711,b1102,b0886,b4291,b0150,b3409,b0698,b3005,b0887,b0856,b0696,b0805,b4032,b3006,b0584,b0589,b0697,b0857,b1252,b0695,b1125
GO:0006826	0.0009965705624058584	3	9	biological_process: iron ion transport	b3409,b4291,b0585
GO:0006212	9.813147370955789e-13	7	9	biological_process: uracil catabolic process	b1009,b1008,b1006,b1011,b1010,b1012,b1007
GO:0070814	1.0442246720137159e-11	6	6	biological_process: hydrogen sulfide biosynthetic process	b2762,b2764,b2750,b2751,b2752,b2763
GO:0000103	2.6184618767705988e-11	6	7	biological_process: sulfate assimilation	b4214,b2764,b2750,b2751,b2752,b2763
GO:0019740	5.801886597171984e-11	6	8	biological_process: nitrogen utilization	b1009,b1008,b1011,b1010,b1012,b1007
GO:0006208	1.169648589063698e-10	6	9	biological_process: pyrimidine nucleobase catabolic process	b1009,b1008,b1011,b1010,b1012,b1007
GO:0015419	6.222638621086533e-10	5	5	molecular_function: ATPase-coupled sulfate transmembrane transporter activity	b3917,b2423,b2422,b2424,b2425
GO:0006790	1.6114606467295627e-09	6	14	biological_process: sulfur compound metabolic process	b3917,b4214,b2762,b2751,b2425,b2752
GO:0008272	3.3090678520419394e-09	5	7	biological_process: sulfate transport	b3917,b2423,b2422,b2424,b2425
GO:1902358	3.3090678520419394e-09	5	7	biological_process: sulfate transmembrane transport	b3917,b2423,b2422,b2424,b2425
GO:0019344	6.415206528327089e-09	5	8	biological_process: cysteine biosynthetic process	b3607,b2764,b2421,b2414,b2763
GO:0006535	4.990039488953277e-06	3	4	biological_process: cysteine biosynthetic process from serine	b2421,b2414,b3607
GO:0043190	7.420899044742207e-05	6	90	cellular_component: ATP-binding cassette (ABC) transporter complex	b0830,b0831,b2423,b2422,b2424,b0832
GO:1901681	0.0001252002823424952	2	2	molecular_function: sulfur compound binding	b3917,b2425
GO:0004124	0.0001252002823424952	2	2	molecular_function: cysteine synthase activity	b2414,b2421
GO:0009333	0.0001252002823424952	2	2	cellular_component: cysteine synthase complex	b2414,b3607
GO:0015709	0.0001252002823424952	2	2	biological_process: thiosulfate transport	b2422,b2425
GO:0043199	0.0001252002823424952	2	2	molecular_function: sulfate binding	b3917,b2425
GO:0004781	0.0001252002823424952	2	2	molecular_function: sulfate adenylyltransferase (ATP) activity	b2751,b2752
GO:0009337	0.0001252002823424952	2	2	cellular_component: sulfite reductase complex (NADPH)	b2764,b2763
GO:0004783	0.0001252002823424952	2	2	molecular_function: sulfite reductase (NADPH) activity	b2764,b2763
GO:0042602	0.00028028561565523184	2	3	molecular_function: riboflavin reductase (NADPH) activity	b2764,b1007
GO:0006096	4.889046469713615e-16	13	19	biological_process: glycolytic process	b3612,b0755,b3916,b4025,b1854,b2926,b1676,b2779,b1779,b3919,b2925,b4395,b1723
GO:0006094	3.060530954659648e-08	7	14	biological_process: gluconeogenesis	b4025,b3403,b4232,b2926,b3919,b2925,b0755
GO:0008152	3.144591301508165e-07	14	119	biological_process: metabolic process	b3428,b3431,b3916,b3403,b0403,b4167,b1854,b4232,b1676,b3430,b3956,b1767,b3080,b3417
GO:0005737	7.124503922623549e-07	39	848	cellular_component: cytoplasm	b3432,b1780,b1914,b4232,b2927,b4166,b3919,b4395,b3417,b3403,b4025,b0143,b4173,b1779,b0688,b3813,b1807,b2518,b1767,b3064,b1084,b3916,b3416,b1676,b2779,b1493,b1913,b3780,b0687,b4168,b3164,b0755,b3612,b3428,b4058,b0403,b1854,b2926,b0779
GO:0005980	2.136292669392446e-06	4	4	biological_process: glycogen catabolic process	b3416,b3428,b3431,b3417
GO:0005977	2.136292669392446e-06	4	4	biological_process: glycogen metabolic process	b3428,b3432,b3431,b3430
GO:0003824	3.883046529313045e-06	23	375	molecular_function: catalytic activity	b3432,b1780,b4167,b4232,b3919,b3956,b4395,b3417,b3403,b3614,b2925,b1767,b3916,b1676,b3430,b1493,b0755,b3612,b3428,b3431,b0403,b1854,b3517
GO:0005975	6.3197072327125874e-06	14	154	biological_process: carbohydrate metabolic process	b3428,b1780,b3431,b3432,b0403,b3416,b4232,b3430,b2925,b3614,b0688,b1723,b3080,b3417
GO:0006289	1.0460818384729074e-05	4	6	biological_process: nucleotide-excision repair	b3813,b0779,b1913,b4058
GO:0005829	1.534941998211098e-05	41	1032	cellular_component: cytosol	b3432,b1780,b4232,b2927,b4174,b3919,b3956,b4172,b3417,b3403,b4025,b0143,b4173,b1779,b0688,b3813,b1807,b2518,b1767,b3064,b2925,b3916,b1867,b3416,b1676,b2779,b1493,b2733,b3429,b3780,b0687,b3164,b0755,b3407,b3612,b4058,b1854,b2926,b0144,b3517,b1723
GO:0042802	3.485543875113687e-05	23	429	molecular_function: identical protein binding	b4232,b3506,b3919,b4025,b3510,b1807,b2925,b1767,b3064,b1084,b3916,b1676,b2779,b3430,b2733,b0687,b4168,b3164,b4058,b1854,b4170,b0779,b1723
GO:0004619	4.349858457063845e-05	3	3	molecular_function: phosphoglycerate mutase activity	b3612,b0755,b4395
GO:0009381	4.349858457063845e-05	3	3	molecular_function: excinuclease ABC activity	b0779,b1913,b4058
GO:0005978	4.349858457063845e-05	3	3	biological_process: glycogen biosynthetic process	b3432,b3429,b3430
GO:0000287	4.520093499349984e-05	14	184	molecular_function: magnesium ion binding	b1084,b3916,b3403,b1854,b4232,b1676,b2779,b3430,b3164,b0688,b3956,b0142,b3064,b1723
GO:0005524	5.3754235151429376e-05	23	441	molecular_function: ATP binding	b4167,b3403,b0143,b4173,b2786,b3813,b4171,b2518,b0142,b3916,b1676,b3430,b2733,b3780,b4168,b0755,b4058,b1854,b2926,b0144,b4170,b0779,b1723
GO:0006298	7.552380240885857e-05	4	10	biological_process: mismatch repair	b2733,b3813,b4170,b1960
GO:0000166	8.01147792751794e-05	25	517	molecular_function: nucleotide binding	b4167,b4232,b3403,b0143,b4173,b1779,b2786,b3813,b4171,b2518,b0142,b3916,b1676,b3430,b2733,b2628,b3780,b4168,b4058,b1854,b2926,b0144,b4170,b0779,b1723
GO:0009380	0.00010149211658219522	3	4	cellular_component: excinuclease repair complex	b0779,b1913,b4058
GO:0002949	0.00010149211658219522	3	4	biological_process: tRNA threonylcarbamoyladenosine modification	b1807,b4168,b3064
GO:0051454	0.00019512336811228423	3	5	biological_process: intracellular pH elevation	b3517,b1492,b1493
GO:0006974	0.0002993961604584752	15	248	biological_process: cellular response to DNA damage stimulus	b3432,b1780,b3431,b4058,b1960,b3515,b4170,b2733,b0779,b3429,b1913,b3516,b3813,b1723,b3080
GO:0009268	0.0003318990053412239	3	6	biological_process: response to pH	b0486,b3511,b3509
GO:0016868	0.0003318990053412239	3	6	molecular_function: intramolecular transferase activity, phosphotransferases	b0755,b4395,b0688
GO:0005975	5.280365747388936e-06	5	154	biological_process: carbohydrate metabolic process	b1315,b1314,b1313,b1317,b1316
GO:0055114	3.6207083153709986e-31	64	448	biological_process: oxidation-reduction process	b2769,b0721,b3152,b0306,b4211,b0429,b1415,b2280,b2285,b0430,b2486,b1109,b2488,b2484,b4153,b2482,b2490,b2282,b0978,b0726,b2210,b0073,b1378,b0307,b2489,b2279,b0724,b0979,b2770,b2277,b3236,b1656,b2278,b4515,b2487,b0431,b1800,b0432,b2276,b2286,b1136,b2287,b3962,b0042,b0733,b0723,b0041,b3908,b2481,b2483,b0734,b4154,b2284,b2463,b1479,b1697,b2288,b0722,b2485,b3003,b1387,b2283,b2281,b1698
GO:0009060	9.048661628031483e-19	17	24	biological_process: aerobic respiration	b0431,b0721,b2284,b0724,b0429,b0432,b2276,b0430,b1109,b2488,b0722,b2277,b2281,b2287,b2282,b2283,b0723
GO:0003954	1.0526152288434227e-17	15	18	molecular_function: NADH dehydrogenase activity	b2279,b2284,b2280,b2285,b2276,b2288,b2286,b2488,b2484,b2277,b2287,b2282,b2283,b2278,b2281
GO:0030964	1.1274432537749268e-17	14	14	cellular_component: NADH dehydrogenase complex	b2279,b2284,b2280,b2285,b2276,b2288,b1109,b2286,b2277,b2287,b2282,b2283,b2278,b2281
GO:0006099	2.0102957266254776e-17	17	29	biological_process: tricarboxylic acid cycle	b0518,b0320,b0721,b0727,b4122,b0724,b1612,b4153,b0722,b1136,b1611,b3236,b0726,b0729,b2210,b0723,b0728
GO:0048038	4.877411410354466e-17	15	20	molecular_function: quinone binding	b2487,b2489,b2279,b2284,b2280,b2276,b2285,b2288,b2286,b2277,b2287,b2282,b2283,b2278,b2281
GO:0045272	6.97324610066189e-17	14	16	cellular_component: plasma membrane respiratory chain complex I	b2279,b2284,b2280,b2285,b2276,b2288,b2286,b2488,b2277,b2287,b2282,b2283,b2278,b2281
GO:0008137	1.5913459103637326e-16	14	17	molecular_function: NADH dehydrogenase (ubiquinone) activity	b2487,b2489,b2279,b2284,b2276,b2288,b1109,b2286,b2277,b2287,b2482,b2280,b2283,b2278
GO:0009055	3.919831937169155e-14	21	83	molecular_function: electron transfer activity	b2769,b0721,b0429,b0430,b4153,b0978,b0724,b0979,b2770,b0431,b0432,b0042,b0041,b0733,b0723,b0734,b4154,b1697,b0722,b2283,b1698
GO:0015990	8.796036305539247e-12	9	9	biological_process: electron transport coupled proton transport	b0431,b0429,b0432,b2276,b0430,b2484,b2277,b2287,b2278
GO:0019646	8.796036305539247e-12	9	9	biological_process: aerobic electron transport chain	b0734,b0431,b0429,b0432,b0979,b0430,b1109,b0978,b0733
GO:0016491	5.180258072211807e-11	35	356	molecular_function: oxidoreductase activity	b4211,b0429,b1415,b2285,b0430,b2486,b1109,b4153,b2484,b2482,b2490,b0726,b2210,b0073,b1378,b2489,b0724,b3236,b1656,b2487,b1800,b0432,b1136,b3962,b0723,b3908,b2481,b2483,b4154,b2463,b1479,b3003,b2485,b1387,b2283
GO:0016651	1.5558552864502247e-09	8	11	molecular_function: oxidoreductase activity, acting on NAD(P)H	b2487,b2279,b2284,b2288,b2286,b2488,b2281,b2283
GO:0042773	4.829406568589674e-09	7	8	biological_process: ATP synthesis coupled electron transport	b2279,b0432,b2276,b2277,b2482,b2283,b2278
GO:0022900	4.922075504253997e-09	14	63	biological_process: electron transport chain	b2769,b1378,b0721,b4154,b0432,b2770,b1697,b4153,b0722,b1136,b0042,b0041,b0723,b1698
GO:0044569	5.644898458269397e-09	8	13	cellular_component: [Ni-Fe] hydrogenase complex	b2483,b2487,b2486,b2488,b2485,b2484,b2482,b2481
GO:0000104	2.8849273045162986e-08	6	6	molecular_function: succinate dehydrogenase activity	b0721,b4154,b4151,b4152,b0722,b0723
GO:0050136	2.8849273045162986e-08	6	6	molecular_function: NADH dehydrogenase (quinone) activity	b2279,b2276,b2288,b2286,b2287,b2281
GO:0016682	1.5467557405891992e-07	6	8	molecular_function: oxidoreductase activity, acting on diphenols and related substances as donors, oxygen as acceptor	b0734,b0431,b0432,b0979,b0978,b0733
GO:0006119	4.303583333031613e-07	5	5	biological_process: oxidative phosphorylation	b0734,b0979,b0978,b0733,b4515
GO:0015078	9.744088639371136e-07	6	11	molecular_function: proton transmembrane transporter activity	b3738,b0431,b3737,b0429,b0432,b0430
GO:0006108	1.0465443043094856e-06	5	6	biological_process: malate metabolic process	b1800,b2463,b1479,b3236,b1611
GO:0051539	1.5749311348541019e-06	15	117	molecular_function: 4 iron, 4 sulfur cluster binding	b2487,b1378,b2489,b0072,b4122,b0724,b2284,b1612,b2488,b4153,b2287,b2281,b2283,b0307,b2481
GO:0051287	4.192452779607877e-06	9	42	molecular_function: NAD binding	b0073,b2487,b3152,b1800,b2284,b2463,b1479,b2286,b1136
GO:0006113	4.212184651786519e-06	5	8	biological_process: fermentation	b4154,b4151,b4152,b4153,b3236
GO:0051536	5.081050867294973e-06	16	146	molecular_function: iron-sulfur cluster binding	b2487,b1378,b2489,b0072,b4122,b0724,b2284,b1612,b2285,b2488,b4153,b2287,b2281,b2283,b0307,b2481
GO:0004775	6.483565766213575e-06	4	4	molecular_function: succinate-CoA ligase (ADP-forming) activity	b0518,b0320,b0728,b0729
GO:0009361	6.483565766213575e-06	4	4	cellular_component: succinate-CoA ligase complex (ADP-forming)	b0518,b0320,b0728,b0729
GO:0015453	6.483565766213575e-06	4	4	molecular_function: oxidoreduction-driven active transmembrane transporter activity	b0429,b0431,b0432,b0430
GO:0009486	6.483565766213575e-06	4	4	molecular_function: cytochrome bo3 ubiquinol oxidase activity	b0429,b0431,b0432,b0430
GO:0009319	6.483565766213575e-06	4	4	cellular_component: cytochrome o ubiquinol oxidase complex	b0429,b0431,b0432,b0430
GO:0070069	6.483565766213575e-06	4	4	cellular_component: cytochrome complex	b0734,b0733,b0979,b0978
GO:0102040	6.483565766213575e-06	4	4	molecular_function: fumarate reductase (menaquinone)	b4153,b4151,b4154,b4152
GO:0045284	6.483565766213575e-06	4	4	cellular_component: plasma membrane fumarate reductase complex	b4153,b4151,b4154,b4152
GO:0009098	9.491362881337358e-05	4	8	biological_process: leucine biosynthetic process	b0073,b0074,b0071,b0072
GO:0004776	9.967583527633118e-05	3	3	molecular_function: succinate-CoA ligase (GDP-forming) activity	b0518,b0320,b0729
GO:0008827	9.967583527633118e-05	3	3	molecular_function: cytochrome o ubiquinol oxidase activity	b0429,b0432,b0430
GO:0004129	9.967583527633118e-05	3	3	molecular_function: cytochrome-c oxidase activity	b0431,b0432,b0430
GO:0008177	9.967583527633118e-05	3	3	molecular_function: succinate dehydrogenase (ubiquinone) activity	b0724,b0723,b0721
GO:0006754	0.00014869814040537093	4	9	biological_process: ATP biosynthetic process	b3731,b3738,b3737,b3733
GO:0046933	0.00014869814040537093	4	9	molecular_function: proton-transporting ATP synthase activity, rotational mechanism	b3731,b3738,b3737,b3733
GO:0015986	0.00014869814040537093	4	9	biological_process: ATP synthesis coupled proton transport	b3731,b3738,b3737,b3733
GO:0016627	0.00022167144755928835	4	10	molecular_function: oxidoreductase activity, acting on the CH-CH group of donors	b0722,b0723,b0721,b4154
GO:0016655	0.00023135144293612455	3	4	molecular_function: oxidoreductase activity, acting on NAD(P)H, quinone or similar compound as acceptor	b4211,b2282,b2286
GO:0015765	0.00023135144293612455	3	4	biological_process: methylgalactoside transport	b2149,b2150,b2148
GO:0045263	0.00023135144293612455	3	4	cellular_component: proton-transporting ATP synthase complex, coupling factor F(o)	b3738,b3737,b3739
GO:0050660	0.0004234900001812514	8	61	molecular_function: flavin adenine dinucleotide binding	b2769,b4154,b1109,b3962,b0042,b2210,b0723,b1698
GO:0048039	0.00044246575869328177	3	5	molecular_function: ubiquinone binding	b2277,b0431,b0721
GO:0004333	0.00044246575869328177	3	5	molecular_function: fumarate hydratase activity	b4122,b1612,b1611
GO:0005886	0.0004486368914531626	50	1139	cellular_component: plasma membrane	b0518,b0721,b0429,b3739,b2285,b0869,b0430,b2486,b2484,b1109,b4153,b2482,b2282,b0978,b2279,b2148,b0724,b4151,b0979,b2277,b2278,b4515,b4123,b0428,b0431,b3733,b3528,b0432,b2276,b2286,b3731,b2287,b1496,b0733,b0723,b2483,b3738,b0734,b3737,b4154,b2284,b2149,b0321,b4152,b2288,b0722,b2485,b2280,b2283,b2281
GO:0009061	0.0005932972922243402	7	49	biological_process: anaerobic respiration	b4154,b4151,b4152,b1109,b4153,b3236,b0723
GO:0020037	0.0010081555378619858	6	39	molecular_function: heme binding	b0734,b0431,b0721,b0722,b0978,b0733
GO:0015757	0.001164267547326499	3	7	biological_process: galactose transmembrane transport	b2150,b2149,b2148
GO:0009389	6.730440098974731e-15	6	6	molecular_function: dimethyl sulfoxide reductase activity	b0894,b1588,b1590,b1587,b0896,b0895
GO:0009061	1.1325301538358257e-13	8	49	biological_process: anaerobic respiration	b0894,b1588,b0997,b1590,b1587,b0996,b0896,b0895
GO:0009390	3.8828887783923057e-10	4	4	cellular_component: dimethyl sulfoxide reductase complex	b0894,b0895,b0896,b1590
GO:0043546	1.0279417380150076e-09	5	18	molecular_function: molybdopterin cofactor binding	b0894,b1588,b0997,b1587,b0998
GO:0019645	7.556031493299913e-08	4	15	biological_process: anaerobic electron transport chain	b0896,b0997,b1590,b0996
GO:0030151	9.767264378476004e-08	4	16	molecular_function: molybdenum ion binding	b0894,b1588,b1587,b0997
GO:0055114	1.7846384860909224e-07	9	448	biological_process: oxidation-reduction process	b0894,b1588,b0997,b1590,b1587,b0996,b0896,b0895,b1589
GO:0009055	1.9671752506726477e-06	5	83	molecular_function: electron transfer activity	b0894,b1588,b0997,b1587,b0996
GO:0051539	1.0465668595086795e-05	5	117	molecular_function: 4 iron, 4 sulfur cluster binding	b0894,b1588,b1587,b0895,b1589
GO:0033797	1.4911900757922708e-05	2	2	molecular_function: selenate reductase activity	b1588,b1587
GO:0051536	3.0462978053176565e-05	5	146	molecular_function: iron-sulfur cluster binding	b0894,b1588,b1587,b0895,b1589
GO:0030288	0.0001182927951816091	5	194	cellular_component: outer membrane-bounded periplasmic space	b0894,b1588,b0997,b1587,b0996
GO:0031237	0.00018124738539470668	2	7	cellular_component: intrinsic component of periplasmic side of plasma membrane	b0894,b0895
GO:0016491	0.0001956118781191726	6	356	molecular_function: oxidoreductase activity	b0894,b1588,b0997,b1590,b1587,b0896
GO:0009432	3.5957676026106225e-09	5	30	biological_process: SOS response	b2698,b2699,b2616,b0958,b1848
GO:0006740	9.7673051590138e-06	2	2	biological_process: NADPH regeneration	b1603,b1602
GO:0008750	9.7673051590138e-06	2	2	molecular_function: NAD(P)+ transhydrogenase (AB-specific) activity	b1603,b1602
GO:0006281	2.1936995692859622e-05	4	80	biological_process: DNA repair	b2698,b1848,b2616,b2699
GO:0008746	2.1949707682630706e-05	2	3	molecular_function: NAD(P)+ transhydrogenase activity	b1603,b1602
GO:0016226	1.4788679465452828e-14	6	19	biological_process: iron-sulfur cluster assembly	b1681,b1682,b1679,b1684,b1680,b1683
GO:1990229	9.557252431531976e-09	3	3	cellular_component: iron-sulfur cluster assembly complex	b1681,b1682,b1683
GO:0031162	4.073957320987509e-06	2	2	biological_process: sulfur incorporation into metallo-sulfur cluster	b1679,b1680
GO:0006979	4.564499262235588e-05	3	51	biological_process: response to oxidative stress	b1679,b1681,b1684
GO:0006526	3.520548773124842e-14	9	12	biological_process: arginine biosynthetic process	b0273,b4254,b2818,b3960,b3958,b3359,b3959,b3957,b3172
GO:0042908	6.464052691342069e-14	10	20	biological_process: xenobiotic transport	b0463,b2074,b0462,b3514,b2470,b2076,b2075,b3266,b3513,b3265
GO:0015721	2.5926559617704934e-12	8	12	biological_process: bile acid and bile salt transport	b0463,b3035,b2074,b3514,b2470,b2076,b2075,b3513
GO:0015125	1.0049507102975107e-11	7	8	molecular_function: bile acid transmembrane transporter activity	b3035,b2074,b3514,b2470,b2076,b2075,b3513
GO:0015562	4.0199712377054174e-11	8	17	molecular_function: efflux transmembrane transporter activity	b2074,b0462,b3514,b2470,b0878,b0879,b3266,b3035
GO:0022857	2.3456974901716566e-09	16	213	molecular_function: transmembrane transporter activity	b0463,b2077,b2074,b0462,b3514,b2470,b1117,b2076,b0862,b2075,b0879,b0861,b3266,b0878,b3513,b3265
GO:1990281	5.520968901440708e-09	5	5	cellular_component: efflux pump complex	b0463,b2074,b0462,b0878,b3035
GO:0044874	5.520968901440708e-09	5	5	biological_process: lipoprotein localization to outer membrane	b1117,b0891,b1118,b1209,b1116
GO:0042450	5.632841691628248e-08	5	8	biological_process: arginine biosynthetic process via ornithine	b0273,b4254,b3960,b3359,b3959
GO:0097638	2.0366225160768785e-07	4	4	biological_process: L-arginine import across plasma membrane	b0861,b0860,b0862,b0864
GO:0042953	2.0366225160768785e-07	4	4	biological_process: lipoprotein transport	b0891,b1116,b1118,b1117
GO:0042910	2.387948859368742e-07	6	21	molecular_function: xenobiotic transmembrane transporter activity	b0463,b2074,b3514,b0462,b3513,b3265
GO:0055085	2.8321339689053303e-06	16	357	biological_process: transmembrane transport	b0463,b2077,b2074,b0462,b3514,b2470,b1117,b2076,b0862,b3265,b2075,b0878,b0861,b3266,b3513,b3035
GO:0008652	3.0934320313577843e-06	9	100	biological_process: cellular amino acid biosynthetic process	b0273,b4254,b2818,b3960,b3958,b3359,b3959,b3957,b3172
GO:0046677	3.3527837919441432e-06	9	101	biological_process: response to antibiotic	b0463,b3514,b2470,b3265,b3191,b0879,b0878,b3513,b3035
GO:1990196	7.564487784263004e-06	3	3	cellular_component: MacAB-TolC complex	b0878,b0879,b3035
GO:0030288	1.7697055325936696e-05	11	194	cellular_component: outer membrane-bounded periplasmic space	b0463,b0462,b3193,b1743,b3192,b0891,b1209,b1116,b0860,b3035,b0863
GO:0015914	1.7777204299461225e-05	3	4	biological_process: phospholipid transport	b3194,b3192,b3193
GO:0098797	5.8976210971228645e-05	3	6	cellular_component: plasma membrane protein complex	b1116,b1118,b1117
GO:0071705	5.914385234569283e-05	4	17	biological_process: nitrogen compound transport	b0860,b0861,b0862,b0863
GO:0009636	9.064844258890382e-05	4	19	biological_process: response to toxic substance	b3035,b3513,b3514,b2470
GO:0016020	0.00027278531586974567	28	1299	cellular_component: membrane	b2077,b2074,b1209,b2078,b0863,b0462,b1116,b1846,b3035,b2076,b0862,b3194,b0879,b0861,b3266,b0860,b3265,b0864,b3193,b0463,b3514,b2470,b1117,b2075,b0878,b1118,b3195,b3513
GO:0014070	0.00028944468301756625	2	2	biological_process: response to organic cyclic compound	b1743,b3035
GO:0006591	0.00028944468301756625	2	2	biological_process: ornithine metabolic process	b0273,b4254
GO:0005548	0.00028944468301756625	2	2	molecular_function: phospholipid transporter activity	b3194,b3193
GO:0031226	0.0005649191505019555	3	13	cellular_component: intrinsic component of plasma membrane	b0463,b3265,b3513
GO:0006189	2.158257170859408e-16	11	12	biological_process: 'de novo' IMP biosynthetic process	b1131,b2500,b0522,b2476,b2557,b2499,b1849,b4006,b2312,b0523,b4005
GO:0006164	3.6583125600549167e-16	12	18	biological_process: purine nucleotide biosynthetic process	b1131,b2500,b0522,b2557,b2476,b2499,b1849,b4006,b2312,b0523,b4005,b0529
GO:0006221	3.6351782530540595e-13	9	11	biological_process: pyrimidine nucleotide biosynthetic process	b1281,b0945,b0033,b1062,b4246,b4244,b3642,b0032,b4245
GO:0044205	4.2837459180883576e-11	7	7	biological_process: 'de novo' UMP biosynthetic process	b1281,b0945,b0033,b1062,b3642,b0032,b4245
GO:0006207	2.4229188128763675e-10	7	9	biological_process: 'de novo' pyrimidine nucleobase biosynthetic process	b1281,b0945,b1062,b4244,b3642,b0032,b4245
GO:0005829	1.1454720794547796e-09	41	1032	cellular_component: cytosol	b1131,b1133,b2453,b0528,b2500,b3951,b1281,b2551,b2557,b0114,b3113,b2476,b4245,b2905,b4006,b0522,b2154,b2904,b0523,b0355,b1241,b2499,b0337,b3117,b2903,b3589,b0033,b0903,b4243,b0356,b1849,b0529,b0032,b2498,b0945,b0116,b3114,b2312,b3642,b1062,b0823
GO:0004022	7.160535967355133e-08	5	6	molecular_function: alcohol dehydrogenase (NAD) activity	b2453,b1241,b3589,b1478,b0356
GO:0019464	7.615551325801873e-07	4	4	biological_process: glycine decarboxylation via glycine cleavage system	b0116,b2904,b2905,b2903
GO:0070689	6.875487769077742e-06	4	7	biological_process: L-threonine catabolic process to propionate	b3115,b3113,b3117,b3114
GO:0006546	2.016354534050011e-05	3	3	biological_process: glycine catabolic process	b2551,b2905,b2903
GO:0046294	2.016354534050011e-05	3	3	biological_process: formaldehyde catabolic process	b0356,b0355,b2154
GO:0006567	2.7566242328932416e-05	4	10	biological_process: threonine catabolic process	b0903,b3117,b3114,b3115
GO:0019856	4.72202588587123e-05	3	4	biological_process: pyrimidine nucleobase biosynthetic process	b0033,b4246,b1062
GO:0003824	0.0001271386583074352	17	375	molecular_function: catalytic activity	b1131,b1241,b1281,b3951,b2551,b0824,b0945,b0114,b2498,b3952,b0903,b3117,b3114,b4006,b2903,b0823,b0529
GO:0005737	0.00013046247700098604	28	848	cellular_component: cytoplasm	b0512,b1133,b2500,b1281,b2551,b2557,b3952,b4244,b2904,b2873,b0824,b2499,b0357,b0033,b0903,b3953,b4243,b0356,b0032,b0945,b1132,b0115,b0116,b3114,b2312,b3642,b1062,b4245
GO:0006541	0.00013098549607546905	4	15	biological_process: glutamine metabolic process	b2557,b0032,b0033,b2312
GO:0016597	0.00013098549607546905	4	15	molecular_function: amino acid binding	b3117,b2551,b0033,b4245
GO:0046336	0.00016743253812963397	4	16	biological_process: ethanolamine catabolic process	b2454,b2453,b2455,b2456
GO:0042802	0.00020365931952983092	18	429	molecular_function: identical protein binding	b2873,b3113,b1241,b2551,b2456,b2312,b0114,b2498,b4243,b2154,b0337,b0116,b3117,b0523,b2903,b0356,b0904,b4245
GO:0006829	1.8070245766556634e-07	3	8	biological_process: zinc ion transport	b1857,b1858,b1859
GO:0034224	4.073957320987509e-06	2	2	biological_process: cellular response to zinc ion starvation	b0296,b1973
GO:0010043	2.540915298645503e-05	2	5	biological_process: response to zinc ion	b1858,b1859
GO:0071973	5.24156592832138e-41	27	33	biological_process: bacterial-type flagellum-dependent cell motility	b1074,b1923,b1083,b1081,b1077,b1078,b1924,b1940,b1082,b1926,b1937,b1944,b1079,b1938,b1073,b1194,b1939,b1942,b1943,b1072,b1925,b1076,b1945,b1890,b1946,b1080,b1941
GO:0009288	5.778672361042287e-40	25	25	cellular_component: bacterial-type flagellum	b1074,b1878,b1923,b1083,b1077,b1078,b1924,b1082,b1940,b1937,b1079,b1938,b1073,b1194,b1939,b1949,b1942,b1948,b1950,b1881,b1947,b1076,b1945,b1946,b1080
GO:0009425	1.4932634468856281e-28	18	18	cellular_component: bacterial-type flagellum basal body	b1076,b1074,b1949,b1937,b1945,b1073,b1939,b1944,b1079,b1077,b1938,b1947,b1948,b1950,b1078,b1194,b1946,b1080
GO:0006935	3.0712722989418536e-28	19	24	biological_process: chemotaxis	b1882,b1945,b1890,b1883,b1944,b1888,b1942,b1946,b1889,b1881,b1886,b1885,b4355,b3072,b1884,b1947,b1887,b1939,b1421
GO:0044781	1.3887528897028356e-24	16	18	biological_process: bacterial-type flagellum organization	b1075,b1878,b1926,b1879,b1081,b1942,b1943,b1948,b1072,b1070,b1925,b1947,b1941,b1940,b1071,b1880
GO:0097588	3.4134204816530794e-19	12	12	biological_process: archaeal or bacterial-type flagellum-dependent cell motility	b1882,b1945,b1937,b1939,b1944,b1079,b1889,b1881,b1890,b1947,b1946,b1080
GO:0044780	2.1177193281565526e-17	12	17	biological_process: bacterial-type flagellum assembly	b1949,b1879,b1081,b1943,b1950,b1072,b1070,b1925,b1939,b1082,b1941,b1880
GO:0009424	3.820234062257121e-16	10	10	cellular_component: bacterial-type flagellum hook	b1075,b1074,b1076,b1083,b1077,b1943,b1078,b1073,b1924,b1082
GO:0003774	4.001527511658443e-13	8	8	molecular_function: motor activity	b1945,b1937,b1939,b1079,b1938,b1942,b1946,b1940
GO:0071978	1.1584809609739314e-12	9	15	biological_process: bacterial-type flagellum-dependent swarming motility	b1075,b1074,b1076,b1944,b1077,b1881,b1078,b1890,b1073
GO:0098561	1.2687306524385334e-11	7	7	cellular_component: methyl accepting chemotaxis protein complex	b1888,b1881,b4355,b1884,b1887,b1886,b1421
GO:0007165	2.4379268317017763e-09	9	36	biological_process: signal transduction	b1883,b1888,b1885,b4355,b3072,b1887,b1886,b3210,b1421
GO:0004888	1.2412529357012038e-08	5	5	molecular_function: transmembrane signaling receptor activity	b1885,b4355,b3072,b1886,b1421
GO:1902021	3.0552749645488735e-08	5	6	biological_process: regulation of bacterial-type flagellum-dependent cell motility	b1882,b1888,b1921,b3525,b4355
GO:0050920	3.868385581175587e-07	4	4	biological_process: regulation of chemotaxis	b1888,b1881,b1886,b4355
GO:0005198	1.937405807771992e-06	5	14	molecular_function: structural molecule activity	b1937,b1923,b1083,b1080,b1082
GO:1901875	1.2181715058843846e-05	3	3	biological_process: positive regulation of post-translational protein modification	b1887,b1886,b1888
GO:0009306	3.9224901133841465e-05	4	13	biological_process: protein secretion	b1949,b1879,b1880,b1948
GO:0005576	3.9224901133841465e-05	4	13	cellular_component: extracellular region	b1083,b1924,b1923,b1082
GO:0023014	0.00011473769011441617	5	33	biological_process: signal transduction by protein phosphorylation	b1882,b1883,b1888,b1887,b3210
GO:0015031	0.00039590309802881696	6	67	biological_process: protein transport	b1879,b1942,b1948,b1940,b1941,b1880
GO:0030694	0.00039651601374735056	2	2	cellular_component: bacterial-type flagellum basal body, rod	b1073,b1074
GO:0009454	0.00039651601374735056	2	2	biological_process: aerotaxis	b1887,b1882
GO:0007172	0.00039651601374735056	2	2	biological_process: signal complex assembly	b1886,b4355
GO:0051286	0.00039651601374735056	2	2	cellular_component: cell tip	b1887,b1886
GO:0008652	2.2393194045384486e-29	26	100	biological_process: cellular amino acid biosynthetic process	b3771,b2022,b3212,b2019,b3213,b2026,b2025,b1264,b2021,b3769,b0674,b2024,b0077,b3744,b0078,b1263,b1260,b3671,b1262,b2023,b3772,b3770,b1261,b2020,b3670,b4054
GO:0000105	2.2176864452658746e-13	8	9	biological_process: histidine biosynthetic process	b2021,b2023,b2022,b2020,b2024,b2019,b2026,b2025
GO:0009099	1.0850300370613928e-12	8	11	biological_process: valine biosynthetic process	b3769,b0078,b3771,b3770,b3670,b3671,b0077,b3572
GO:0009097	2.1573452427850904e-12	8	12	biological_process: isoleucine biosynthetic process	b3769,b0078,b3771,b3772,b3770,b3670,b3671,b0077
GO:0000162	8.56839402487891e-12	7	8	biological_process: tryptophan biosynthetic process	b3360,b1263,b1260,b1261,b2024,b1262,b1264
GO:0009082	5.243923448739188e-11	8	18	biological_process: branched-chain amino acid biosynthetic process	b3769,b0078,b3771,b3772,b3770,b3670,b3671,b0077
GO:0003824	2.8443020938516133e-09	20	375	molecular_function: catalytic activity	b2021,b2147,b3771,b3772,b1263,b2022,b3212,b1260,b3671,b3770,b2024,b0077,b1262,b2290,b3572,b0928,b2025,b2026,b4054,b1264
GO:0003984	4.938991052774854e-09	5	5	molecular_function: acetolactate synthase activity	b3769,b0078,b3670,b3671,b0077
GO:0009073	8.525540173346745e-08	6	18	biological_process: aromatic amino acid family biosynthetic process	b1263,b1260,b1261,b1262,b4054,b1264
GO:0008483	2.742082831860242e-07	6	22	molecular_function: transaminase activity	b2021,b3770,b2290,b3572,b0928,b4054
GO:0006537	9.27692048939859e-07	4	6	biological_process: glutamate biosynthetic process	b1761,b3213,b3212,b2878
GO:0006541	1.0979077955786066e-06	5	15	biological_process: glutamine metabolic process	b2023,b3360,b1263,b3212,b0674
GO:0009058	1.67883443109422e-06	7	48	biological_process: biosynthetic process	b2021,b2290,b3572,b1812,b0928,b4054,b1264
GO:0030170	5.158364015893029e-06	7	57	molecular_function: pyridoxal phosphate binding	b2021,b3772,b1261,b2290,b3572,b0928,b4054
GO:0005948	1.6655488849598235e-05	3	4	cellular_component: acetolactate synthase complex	b3670,b0077,b3671
GO:0006568	1.6655488849598235e-05	3	4	biological_process: tryptophan metabolic process	b1262,b1260,b1261
GO:0006520	2.2163667243914354e-05	5	28	biological_process: cellular amino acid metabolic process	b3772,b2957,b1761,b0928,b4054
GO:0016829	2.6090947554045362e-05	10	169	molecular_function: lyase activity	b2023,b3771,b3772,b1263,b2022,b1260,b1261,b1262,b1264,b2025
GO:0051536	5.140942046235604e-05	9	146	molecular_function: iron-sulfur cluster binding	b2147,b2146,b2881,b3771,b2878,b3212,b2468,b2887,b3213
GO:1990610	0.00027722408721338724	2	2	molecular_function: acetolactate synthase regulator activity	b3670,b0078
GO:0004071	0.00027722408721338724	2	2	molecular_function: aspartate-ammonia ligase activity	b0674,b3744
GO:0070981	0.00027722408721338724	2	2	biological_process: L-asparagine biosynthetic process	b0674,b3744
GO:0006529	0.00027722408721338724	2	2	biological_process: asparagine biosynthetic process	b0674,b3744
GO:0033585	0.00027722408721338724	2	2	biological_process: L-phenylalanine biosynthetic process from chorismate via phenylpyruvate	b0928,b4054
GO:0004838	0.00027722408721338724	2	2	molecular_function: L-tyrosine:2-oxoglutarate aminotransferase activity	b0928,b4054
GO:0004834	0.00027722408721338724	2	2	molecular_function: tryptophan synthase activity	b1260,b1261
GO:0004049	0.00027722408721338724	2	2	molecular_function: anthranilate synthase activity	b1263,b1264
GO:0046820	0.00027722408721338724	2	2	molecular_function: 4-amino-4-deoxychorismate synthase activity	b3360,b1812
GO:0000107	0.00027722408721338724	2	2	molecular_function: imidazoleglycerol-phosphate synthase activity	b2023,b2025
GO:0009382	0.00027722408721338724	2	2	cellular_component: imidazoleglycerol-phosphate synthase complex	b2023,b2025
GO:0004159	0.00027722408721338724	2	2	molecular_function: dihydrouracil dehydrogenase (NAD+) activity	b2147,b2146
GO:0015930	0.00027722408721338724	2	2	molecular_function: glutamate synthase activity	b3212,b2878
GO:0004355	0.00027722408721338724	2	2	molecular_function: glutamate synthase (NADPH) activity	b3212,b3213
GO:0097054	0.00027722408721338724	2	2	biological_process: L-glutamate biosynthetic process	b3212,b3213
GO:0006532	0.00027722408721338724	2	2	biological_process: aspartate biosynthetic process	b3770,b4054
GO:0005737	0.0003370534211403714	21	848	cellular_component: cytoplasm	b2947,b2022,b2019,b3572,b2026,b0928,b2025,b0674,b2024,b3744,b2946,b2147,b1260,b0852,b1761,b1812,b2023,b1261,b2020,b2290,b4054
GO:0019676	0.0006190104313067371	2	3	biological_process: ammonia assimilation cycle	b3212,b2878
GO:0046872	0.0006419453418453548	18	692	molecular_function: metal ion binding	b2147,b2881,b3771,b2947,b2878,b2022,b3212,b2020,b3671,b0852,b0077,b2887,b1813,b2019,b3213,b2468,b1264,b2879
GO:0016740	0.0007210612318369813	16	576	molecular_function: transferase activity	b2021,b3769,b0078,b3360,b1263,b3770,b3671,b3670,b2290,b0077,b2019,b3572,b1812,b0928,b4054,b2946
GO:0043952	1.3461171679293208e-11	6	7	biological_process: protein transport by the Sec complex	b0409,b3609,b3175,b0098,b3981,b0408
GO:0006605	2.9846750938212734e-11	6	8	biological_process: protein targeting	b0409,b3609,b0098,b3981,b3464,b0408
GO:0006886	8.940632609552241e-10	5	6	biological_process: intracellular protein transport	b0409,b3175,b0098,b3981,b0408
GO:0006072	8.940632609552241e-10	5	6	biological_process: glycerol-3-phosphate metabolic process	b2241,b2242,b3608,b3926,b3426
GO:0065002	6.688196982511436e-09	5	9	biological_process: intracellular protein transmembrane transport	b0409,b3175,b0098,b3981,b0408
GO:0019563	6.688196982511436e-09	5	9	biological_process: glycerol catabolic process	b3426,b2241,b2243,b3926,b2242
GO:0015031	1.9737222042699968e-08	8	67	biological_process: protein transport	b0409,b3609,b3175,b0098,b0407,b3981,b3705,b0408
GO:0015450	2.3752265857330732e-08	4	4	molecular_function: P-P-bond-hydrolysis-driven protein transmembrane transporter activity	b3175,b0408,b0409,b3981
GO:0046168	2.3752265857330732e-08	4	4	biological_process: glycerol-3-phosphate catabolic process	b3608,b2242,b2241,b3426
GO:0009331	2.3752265857330732e-08	4	4	cellular_component: glycerol-3-phosphate dehydrogenase complex	b3608,b2242,b2241,b3426
GO:0031522	5.769932294276105e-08	4	5	cellular_component: cell envelope Sec protein transport complex	b3705,b3175,b0098,b3981
GO:0052591	1.5454061972170295e-06	3	3	molecular_function: sn-glycerol-3-phosphate:ubiquinone-8 oxidoreductase activity	b2242,b2241,b3426
GO:0052590	1.5454061972170295e-06	3	3	molecular_function: sn-glycerol-3-phosphate:ubiquinone oxidoreductase activity	b2242,b2241,b3426
GO:0004368	1.5454061972170295e-06	3	3	molecular_function: glycerol-3-phosphate dehydrogenase (quinone) activity	b2242,b2241,b3426
GO:0006071	2.5331948245772424e-06	4	13	biological_process: glycerol metabolic process	b2240,b2239,b3926,b3426
GO:0002099	0.00010188181694417261	2	2	biological_process: tRNA wobble guanine modification	b0405,b0406
GO:0015793	0.00010188181694417261	2	2	biological_process: glycerol transport	b2240,b3927
GO:0006614	0.00010188181694417261	2	2	biological_process: SRP-dependent cotranslational protein targeting to membrane	b3464,b2610
GO:0006612	0.00010188181694417261	2	2	biological_process: protein targeting to membrane	b3464,b2610
GO:0032977	0.00010188181694417261	2	2	molecular_function: membrane insertase activity	b3705,b4557
GO:0070678	0.00022820129542375402	2	3	molecular_function: preprotein binding	b3609,b0098
GO:0006616	0.00022820129542375402	2	3	biological_process: SRP-dependent cotranslational protein targeting to membrane, translocation	b3175,b3981
GO:0032978	0.0004038640677771935	2	4	biological_process: protein insertion into membrane from inner side	b3175,b3981
GO:0010124	1.6891205284681382e-21	12	15	biological_process: phenylacetate catabolic process	b1391,b1394,b1396,b1390,b1395,b1388,b3845,b1389,b1398,b1392,b1393,b1397
GO:0006635	3.9887953570517907e-13	8	15	biological_process: fatty acid beta-oxidation	b1394,b2342,b0221,b2341,b3845,b3846,b1393,b1397
GO:0004300	3.3090678520419394e-09	5	7	molecular_function: enoyl-CoA hydratase activity	b1394,b2342,b2341,b3846,b1393
GO:0006631	6.213008020197935e-09	7	32	biological_process: fatty acid metabolic process	b2342,b0221,b1395,b2341,b3845,b3846,b1393
GO:0003857	3.641012871712386e-08	4	4	molecular_function: 3-hydroxyacyl-CoA dehydrogenase activity	b1395,b3846,b2342,b2341
GO:0016042	2.0018559107739838e-06	4	11	biological_process: lipid catabolic process	b3846,b2342,b2341,b3845
GO:0047780	2.1167258038605877e-06	3	3	molecular_function: citrate dehydratase activity	b0118,b0334,b1276
GO:0006099	3.5658883152208093e-06	5	29	biological_process: tricarboxylic acid cycle	b1276,b0334,b0333,b0118,b0720
GO:0003994	4.990039488953277e-06	3	4	molecular_function: aconitate hydratase activity	b0118,b0334,b1276
GO:0003988	9.692985634551459e-06	3	5	molecular_function: acetyl-CoA C-acyltransferase activity	b1397,b2342,b3845
GO:0071705	1.1040416163586076e-05	4	17	biological_process: nitrogen compound transport	b2307,b2308,b2310,b2309
GO:0006629	2.5092974503501274e-05	6	74	biological_process: lipid metabolic process	b2342,b0221,b2341,b3845,b3846,b1393
GO:0004108	0.0001252002823424952	2	2	molecular_function: citrate (Si)-synthase activity	b0333,b0720
GO:0050218	0.0001252002823424952	2	2	molecular_function: propionate-CoA ligase activity	b0335,b4069
GO:0005291	0.0001252002823424952	2	2	molecular_function: high-affinity L-histidine transmembrane transporter activity	b2306,b2308
GO:1903810	0.0001252002823424952	2	2	biological_process: L-histidine import across plasma membrane	b2306,b2308
GO:0089709	0.0001252002823424952	2	2	biological_process: L-histidine transmembrane transport	b2306,b2308
GO:0016509	0.0001252002823424952	2	2	molecular_function: long-chain-3-hydroxyacyl-CoA dehydrogenase activity	b3846,b2341
GO:0008692	0.0001252002823424952	2	2	molecular_function: 3-hydroxybutyryl-CoA epimerase activity	b3846,b2341
GO:0046912	0.00028028561565523184	2	3	molecular_function: transferase activity, transferring acyl groups, acyl groups converted into alkyl on transfer	b0333,b0720
GO:0003730	0.00028028561565523184	2	3	molecular_function: mRNA 3'-UTR binding	b0118,b1276
GO:0019679	0.00028028561565523184	2	3	biological_process: propionate metabolic process, methylcitrate cycle	b0333,b0334
GO:0016829	0.00033273108613496267	7	169	molecular_function: lyase activity	b1394,b1276,b0334,b2341,b3846,b1393,b0118
GO:0019629	0.0004957836794647441	2	4	biological_process: propionate catabolic process, 2-methylcitrate cycle	b0335,b0118
GO:0046336	5.273848942198839e-15	6	16	biological_process: ethanolamine catabolic process	b2458,b2457,b2460,b2462,b2461,b2459
GO:0031471	1.6273175055042414e-05	2	4	cellular_component: ethanolamine degradation polyhedral organelle	b2462,b2457
GO:0043165	5.805934225527733e-14	11	13	biological_process: Gram-negative-bacterium-type cell outer membrane assembly	b2512,b0054,b2617,b0641,b0178,b0053,b2477,b2595,b3199,b0177,b3200
GO:0004812	2.8493957448615814e-12	12	25	molecular_function: aminoacyl-tRNA ligase activity	b4129,b2400,b0526,b2514,b2890,b1714,b2697,b1876,b0642,b1713,b0026,b1719
GO:1990351	8.075917904405155e-10	7	7	cellular_component: transporter complex	b0054,b4262,b0641,b3199,b3200,b4261,b3201
GO:0016874	2.3896182023893667e-09	16	94	molecular_function: ligase activity	b2780,b4129,b2400,b2514,b0526,b3421,b2890,b1714,b2697,b2507,b4475,b1876,b0642,b1713,b0026,b1719
GO:0015920	4.499703474979754e-09	7	9	biological_process: lipopolysaccharide transport	b0054,b4262,b0641,b3200,b3199,b4261,b3201
GO:0006418	2.5465051067650182e-08	8	18	biological_process: tRNA aminoacylation for protein translation	b4129,b2400,b0526,b2890,b1876,b0642,b0026,b1719
GO:0000049	3.177115786327573e-08	11	46	molecular_function: tRNA binding	b4129,b2400,b2890,b1714,b2697,b1713,b0026,b1719,b2474,b3282,b3166
GO:0006412	9.888670891744705e-08	15	107	biological_process: translation	b4129,b2400,b2514,b0526,b2890,b1714,b2697,b3287,b1876,b2891,b0642,b3288,b1713,b0026,b1719
GO:1990063	2.3127003503131978e-07	5	5	cellular_component: Bam protein complex	b2512,b2617,b2477,b2595,b0177
GO:0051205	1.1946612579025675e-06	5	7	biological_process: protein insertion into membrane	b2512,b2617,b2477,b2595,b0177
GO:0005829	1.7527894004716516e-05	46	1032	cellular_component: cytosol	b2508,b4129,b2514,b0526,b3281,b2697,b0125,b3198,b1876,b2891,b0642,b3282,b1713,b1719,b3179,b0104,b1714,b2507,b2594,b0120,b0179,b1712,b3288,b0051,b0844,b3166,b2780,b3203,b2400,b0121,b2890,b3290,b0178,b0912,b2959,b3287,b1778,b0238,b2593,b3180,b3167,b0174,b0469,b2478,b3289,b0026
GO:0043039	3.4964486295884955e-05	4	7	biological_process: tRNA aminoacylation	b1714,b2697,b2400,b1719
GO:0048473	6.886791994438388e-05	3	3	biological_process: D-methionine transport	b0199,b0197,b0198
GO:0006364	6.937392171571841e-05	7	39	biological_process: rRNA processing	b3167,b2594,b3289,b1835,b3282,b0051,b3179
GO:0002161	9.188763112499215e-05	4	9	molecular_function: aminoacyl-tRNA editing activity	b2697,b1719,b0026,b0642
GO:0106074	9.188763112499215e-05	4	9	biological_process: aminoacyl-tRNA metabolism involved in translational fidelity	b2697,b1719,b0026,b0642
GO:0044877	0.0001602484632744916	3	4	molecular_function: protein-containing complex binding	b2782,b2513,b2783
GO:0001530	0.0001602484632744916	3	4	molecular_function: lipopolysaccharide binding	b0641,b0178,b3200
GO:0015437	0.0001602484632744916	3	4	molecular_function: lipopolysaccharide-transporting ATPase activity	b4261,b3201,b4262
GO:0000166	0.00018017567936014133	27	517	molecular_function: nucleotide binding	b2508,b4129,b2514,b0526,b3281,b2697,b0125,b1876,b0642,b3282,b1804,b1719,b1713,b0639,b3421,b1714,b2507,b4475,b0199,b2474,b2780,b2400,b2890,b3201,b0025,b2781,b0026
GO:0006417	0.0004835477051963233	5	25	biological_process: regulation of translation	b3203,b0912,b1712,b2782,b1719
GO:0001510	0.0005212122845979132	3	6	biological_process: RNA methylation	b3289,b1835,b3179
GO:0016226	1.2249437104572192e-13	7	19	biological_process: iron-sulfur cluster assembly	b2524,b2525,b2529,b2530,b2526,b2528,b3807
GO:0051537	5.732392658934754e-08	5	33	molecular_function: 2 iron, 2 sulfur cluster binding	b2531,b2525,b2529,b2530,b2528
GO:0019285	3.219971460081336e-07	3	4	biological_process: glycine betaine biosynthetic process from choline	b0313,b0312,b0311
GO:0005506	7.093212171021155e-07	5	55	molecular_function: iron ion binding	b2524,b2531,b2529,b2528,b3807
GO:0008198	1.0483062827920594e-06	4	24	molecular_function: ferrous iron binding	b2524,b2528,b2529,b3807
GO:0097428	1.0824964049562908e-06	3	6	biological_process: protein maturation by iron-sulfur cluster transfer	b2526,b2527,b2528
GO:0008802	2.113309004857981e-05	2	2	molecular_function: betaine-aldehyde dehydrogenase activity	b0312,b0311
GO:1990230	2.113309004857981e-05	2	2	cellular_component: iron-sulfur cluster transfer complex	b2526,b2527
GO:0044571	2.113309004857981e-05	2	2	biological_process: [2Fe-2S] cluster assembly	b2530,b2527
GO:0005829	2.3737888476571008e-05	11	1032	cellular_component: cytosol	b2524,b2531,b2527,b0312,b2525,b2529,b3895,b2530,b2526,b2528,b3807
GO:0006970	2.854885490046893e-05	3	18	biological_process: response to osmotic stress	b0313,b0312,b0311
GO:0051536	7.959437118274942e-05	5	146	molecular_function: iron-sulfur cluster binding	b2531,b2525,b2529,b2530,b2528
GO:0097163	0.0002564174632866434	2	7	molecular_function: sulfur carrier activity	b2530,b3895
GO:0051539	3.0046036070992617e-06	5	117	molecular_function: 4 iron, 4 sulfur cluster binding	b2721,b4079,b2719,b2724,b2720
GO:0008137	7.172277904116287e-06	3	17	molecular_function: NADH dehydrogenase (ubiquinone) activity	b2721,b2719,b2723
GO:0055114	8.616356909287954e-06	7	448	biological_process: oxidation-reduction process	b2721,b4079,b2719,b2724,b2720,b2723,b2722
GO:0051536	8.858955546750033e-06	5	146	molecular_function: iron-sulfur cluster binding	b2721,b4079,b2719,b2724,b2720
GO:0051604	6.66054794925865e-15	8	16	biological_process: protein maturation	b2992,b2727,b2729,b2726,b2990,b2728,b2730,b2991
GO:0033748	1.0702963382345249e-10	5	6	molecular_function: hydrogenase (acceptor) activity	b0972,b2994,b0973,b2997,b2995
GO:0008901	4.53028535922276e-09	4	4	molecular_function: ferredoxin hydrogenase activity	b0972,b0973,b2997,b2994
GO:0044569	5.002697378530613e-09	5	13	cellular_component: [Ni-Fe] hydrogenase complex	b0972,b0973,b2997,b0974,b2995
GO:0016151	2.5074373878746125e-08	5	18	molecular_function: nickel cation binding	b2727,b2994,b0973,b2726,b2991
GO:0006464	4.220543062206968e-08	5	20	biological_process: cellular protein modification process	b0975,b2729,b2726,b2993,b2991
GO:0046872	1.947336939014556e-06	13	692	molecular_function: metal ion binding	b0972,b2727,b2994,b0975,b0973,b2729,b2726,b2996,b2997,b2993,b0974,b2991,b2995
GO:0009061	3.4096122728809367e-06	5	49	biological_process: anaerobic respiration	b0972,b0973,b2997,b0974,b2995
GO:0006113	8.578792178165155e-06	3	8	biological_process: fermentation	b0972,b0973,b0974
GO:0009375	4.623372932314902e-05	2	2	cellular_component: ferredoxin hydrogenase complex	b0972,b2997
GO:1902670	4.623372932314902e-05	2	2	molecular_function: carbon dioxide binding	b2990,b2728
GO:0031236	0.00010371905731306007	2	3	cellular_component: extrinsic component of periplasmic side of plasma membrane	b2997,b2994
GO:0005506	0.00013799329970244533	4	55	molecular_function: iron ion binding	b2729,b2990,b0974,b2728
GO:0016485	0.0002864118411110447	2	5	biological_process: protein processing	b2993,b0975
GO:0019698	9.924849645249988e-07	3	7	biological_process: D-galacturonate catabolic process	b3091,b3092,b3128
GO:0006412	2.4633873379318138e-79	66	107	biological_process: translation	b4203,b3636,b3307,b4147,b3321,b3314,b3231,b3065,b3985,b3341,b3315,b3339,b2606,b3294,b2185,b0911,b3299,b3168,b3316,b3165,b3298,b3310,b0884,b3591,b3590,b3186,b3313,b3340,b3936,b3230,b3304,b3305,b3312,b0170,b3306,b3308,b1089,b3301,b3296,b3983,b3320,b3319,b3185,b1718,b3311,b3317,b3980,b3986,b4506,b4200,b3703,b1716,b4202,b3984,b2609,b3302,b3637,b3303,b1717,b0169,b0023,b3297,b3309,b3318,b3342,b3170
GO:0005840	7.47321796555512e-75	56	61	cellular_component: ribosome	b4203,b3636,b3307,b3321,b3314,b3231,b3065,b3985,b2608,b3341,b3315,b2606,b3294,b2185,b0911,b3299,b3316,b3165,b3298,b3310,b3186,b3313,b3304,b3230,b3936,b3305,b3306,b3308,b3312,b1089,b3319,b3296,b3301,b3983,b3320,b3185,b3311,b3317,b3986,b4506,b4200,b3703,b1716,b3984,b4202,b2609,b3302,b3637,b3303,b1717,b0169,b0023,b3297,b3309,b3318,b3342
GO:0003735	4.171289992065503e-74	55	58	molecular_function: structural constituent of ribosome	b4203,b3636,b3307,b3321,b3314,b3231,b3065,b3985,b3341,b3315,b2606,b3294,b2185,b0911,b3299,b3316,b3165,b3298,b3310,b3186,b3313,b3304,b3230,b3936,b3305,b3306,b3308,b3312,b1089,b3319,b3296,b3301,b3983,b3320,b3185,b3311,b3317,b3986,b4506,b4200,b3703,b1716,b3984,b4202,b2609,b3302,b3637,b3303,b1717,b0169,b0023,b3297,b3309,b3318,b3342
GO:0019843	1.9725071715196888e-53	44	59	molecular_function: rRNA binding	b4203,b3307,b3314,b3065,b3985,b2608,b3341,b3315,b2606,b2185,b2597,b3316,b0884,b3165,b3298,b3310,b3186,b3313,b3936,b3304,b3305,b3306,b3308,b3312,b3319,b3296,b3301,b3983,b3320,b3185,b3311,b3317,b3871,b4200,b1716,b3984,b4202,b3637,b3303,b0023,b3297,b3309,b3318,b3342
GO:0003723	1.052805986403878e-48	54	161	molecular_function: RNA binding	b4203,b3636,b3321,b3314,b3065,b3985,b2608,b3341,b3315,b3260,b3339,b2606,b2185,b0911,b2597,b3316,b3165,b3298,b3310,b3169,b0884,b3590,b3186,b3313,b3936,b3230,b3304,b3305,b3704,b3312,b3306,b3308,b3319,b3301,b3296,b3983,b3320,b3185,b1718,b3311,b3317,b3980,b4200,b3871,b1716,b4202,b3984,b3637,b3303,b0023,b3297,b3309,b3318,b3342
GO:0022625	3.6204827641496444e-42	32	32	cellular_component: cytosolic large ribosomal subunit	b4203,b3636,b3231,b3985,b3315,b2606,b3294,b2185,b3299,b3310,b3186,b3313,b3936,b3304,b3305,b3308,b3312,b1089,b3301,b3983,b3320,b3185,b3317,b3986,b1716,b3984,b3302,b3637,b1717,b3309,b3318,b3319
GO:0022627	1.0632539514204948e-27	22	25	cellular_component: cytosolic small ribosomal subunit	b3307,b3321,b3314,b3065,b3341,b0911,b2597,b3316,b3165,b3298,b3230,b3306,b3296,b3311,b4200,b4202,b2609,b3303,b0169,b0023,b3297,b3342
GO:0000027	6.736898307800358e-22	19	28	biological_process: ribosomal large subunit assembly	b3308,b3636,b3294,b2185,b3312,b1089,b3983,b1716,b3320,b3984,b3302,b3185,b3637,b3317,b3313,b3318,b3309,b3305,b2606
GO:0000028	2.7249540435724293e-21	17	20	biological_process: ribosomal small subunit assembly	b3306,b3296,b2609,b0911,b3307,b3316,b3314,b3165,b3303,b3065,b2608,b3311,b0169,b3341,b0023,b3297,b3170
GO:0005829	1.6141477258451679e-19	68	1032	cellular_component: cytosol	b4203,b3636,b4147,b3321,b3314,b3231,b3065,b3985,b2608,b3341,b3315,b2606,b3294,b3067,b2185,b2171,b2597,b0171,b3316,b3168,b3165,b3298,b3310,b3169,b0884,b3590,b3591,b3186,b2607,b3340,b1274,b3936,b3230,b3304,b3305,b0910,b3306,b0170,b0436,b3308,b1089,b3296,b3983,b3319,b3320,b1088,b0474,b1718,b3317,b3980,b3986,b3357,b4200,b3295,b1716,b3988,b3261,b4202,b3984,b4059,b3637,b3987,b3303,b0023,b3297,b3309,b3342,b3170
GO:0015934	1.1576217606133996e-18	14	14	cellular_component: large ribosomal subunit	b3636,b3294,b1089,b3984,b3301,b3983,b3302,b3310,b3985,b1717,b3317,b3315,b3986,b3319
GO:0015935	3.788405753798908e-16	12	12	cellular_component: small ribosomal subunit	b2609,b3296,b3307,b3316,b3321,b3298,b3303,b0169,b3341,b0023,b3342,b3230
GO:0000049	6.848077019944802e-13	15	46	molecular_function: tRNA binding	b3308,b3636,b3984,b3871,b3316,b3321,b3185,b3298,b3342,b3590,b3341,b3313,b3260,b3230,b3704
GO:0070180	2.115591898036851e-12	9	9	molecular_function: large ribosomal subunit rRNA binding	b4203,b1716,b3983,b3310,b3231,b3985,b3309,b3305,b2606
GO:0003746	1.6177236273560503e-09	7	8	molecular_function: translation elongation factor activity	b0170,b2171,b4147,b3590,b3980,b3340,b3339
GO:0043022	2.4729442646210543e-09	10	28	molecular_function: ribosome binding	b0436,b2597,b4147,b3185,b0884,b3985,b2608,b1718,b3986,b1203
GO:0005515	2.7983412249711323e-09	54	1066	molecular_function: protein binding	b4203,b3321,b3300,b3985,b2608,b3341,b3315,b1203,b3339,b3067,b3734,b2597,b3168,b3310,b3298,b3169,b0884,b3591,b3590,b4201,b1274,b0436,b0170,b1089,b3319,b3301,b3296,b3983,b3320,b3185,b0474,b1718,b3317,b3980,b3986,b3357,b4200,b3295,b3871,b3261,b3988,b4202,b3984,b4059,b3637,b3987,b3303,b3732,b0169,b3297,b3309,b3318,b3342,b3170
GO:0070181	2.7966443076552663e-08	6	7	molecular_function: small ribosomal subunit rRNA binding	b4202,b3165,b3311,b0023,b3297,b4200
GO:0006414	2.7966443076552663e-08	6	7	biological_process: translational elongation	b0170,b2171,b4147,b3980,b3340,b3339
GO:0003924	3.2122011470138055e-07	8	26	molecular_function: GTPase activity	b3871,b3168,b3985,b3590,b3980,b3986,b3340,b3339
GO:0017148	1.5576484000249449e-06	6	14	biological_process: negative regulation of translation	b1716,b2185,b3231,b3985,b3341,b3319
GO:0006417	3.3485813917234262e-06	7	25	biological_process: regulation of translation	b3306,b3984,b3296,b2597,b3165,b3985,b3319
GO:0046677	8.000924124604913e-06	12	101	biological_process: response to antibiotic	b3636,b3988,b3319,b3296,b3987,b3303,b3311,b3980,b3315,b3342,b3305,b3339
GO:0006413	1.702454213869059e-05	4	6	biological_process: translational initiation	b1718,b3168,b3936,b0884
GO:0048027	1.702454213869059e-05	4	6	molecular_function: mRNA 5'-UTR binding	b4202,b3296,b4200,b3297
GO:0003729	2.012369405709353e-05	5	13	molecular_function: mRNA binding	b1716,b0911,b3314,b3231,b3341
GO:0046961	5.180954444908736e-05	4	8	molecular_function: proton-transporting ATPase activity, rotational mechanism	b3736,b3734,b3735,b3732
GO:0008097	6.278330267983314e-05	3	3	molecular_function: 5S rRNA binding	b3308,b2185,b3304
GO:1990145	6.278330267983314e-05	3	3	biological_process: maintenance of translational fidelity	b3342,b3296,b3303
GO:0006754	8.143611292475063e-05	4	9	biological_process: ATP biosynthetic process	b3736,b3734,b3735,b3732
GO:0046933	8.143611292475063e-05	4	9	molecular_function: proton-transporting ATP synthase activity, rotational mechanism	b3736,b3734,b3735,b3732
GO:0015986	8.143611292475063e-05	4	9	biological_process: ATP synthesis coupled proton transport	b3736,b3734,b3735,b3732
GO:0042254	0.00011942371972209634	5	19	biological_process: ribosome biogenesis	b1088,b3985,b2608,b3170,b3871
GO:0003743	0.00014617525192393634	3	4	molecular_function: translation initiation factor activity	b1718,b3168,b0884
GO:0046940	0.00028043053650707534	3	5	biological_process: nucleoside monophosphate phosphorylation	b0171,b0474,b0910
GO:0006353	0.00047599065916749606	3	6	biological_process: DNA-templated transcription, termination	b3319,b3296,b3169
GO:0045261	0.00047599065916749606	3	6	cellular_component: proton-transporting ATP synthase complex, catalytic core F(1)	b3734,b3735,b3732
GO:0005525	0.0006265413947866272	7	58	molecular_function: GTP binding	b3871,b3168,b3590,b3980,b1203,b3340,b3339
GO:0045947	0.0007424653863472062	3	7	biological_process: negative regulation of translational initiation	b3984,b3296,b2597
GO:0003899	0.0007424653863472062	3	7	molecular_function: DNA-directed 5'-3' RNA polymerase activity	b3988,b3987,b3295
GO:0009242	1.3607826321162086e-21	11	19	biological_process: colanic acid biosynthetic process	b2053,b2057,b2049,b2059,b2050,b2061,b2052,b2060,b2058,b2054,b2055
GO:0009103	2.8789769691790035e-15	11	72	biological_process: lipopolysaccharide biosynthetic process	b2051,b2057,b2049,b2059,b2048,b2050,b2056,b2060,b2058,b2054,b2055
GO:0045228	2.5438230043721306e-14	7	10	biological_process: slime layer polysaccharide biosynthetic process	b2057,b2059,b2050,b2056,b2058,b2054,b2055
GO:0000271	2.0057260213239177e-07	4	11	biological_process: polysaccharide biosynthetic process	b2062,b2060,b2061,b2049
GO:0004615	4.138139823494395e-05	2	2	molecular_function: phosphomannomutase activity	b2048,b3176
GO:0042351	4.138139823494395e-05	2	2	biological_process: 'de novo' GDP-L-fucose biosynthetic process	b2053,b2052
GO:0071704	9.284963346887365e-05	2	3	biological_process: organic substance metabolic process	b2048,b3176
GO:0016413	9.284963346887365e-05	2	3	molecular_function: O-acetyltransferase activity	b2058,b2054
GO:0046377	9.284963346887365e-05	2	3	biological_process: colanic acid metabolic process	b2056,b2062
GO:0009298	9.284963346887365e-05	2	3	biological_process: GDP-mannose biosynthetic process	b2048,b2049
GO:0036065	0.00016460778342236026	2	4	biological_process: fucosylation	b2050,b2055
GO:0070401	0.0002564857720503952	2	5	molecular_function: NADP+ binding	b2053,b2052
GO:0015627	8.905214629594693e-23	10	12	cellular_component: type II protein secretion system complex	b3333,b3325,b3327,b3334,b3326,b3331,b3330,b3329,b3324,b3328
GO:0015628	4.152275928941432e-22	10	14	biological_process: protein secretion by the type II secretion system	b3333,b3325,b3327,b3334,b3326,b3331,b3330,b3329,b3324,b3328
GO:0015031	1.60499361049075e-17	11	67	biological_process: protein transport	b3333,b3325,b3327,b3334,b3326,b3331,b3330,b3332,b3329,b3324,b3328
GO:0016021	1.762654988985567e-07	13	966	cellular_component: integral component of membrane	b3333,b3325,b3327,b3334,b3331,b3335,b3322,b3330,b3332,b3329,b3324,b3323,b3328
GO:0016020	2.617055657847966e-07	14	1299	cellular_component: membrane	b3333,b3325,b3327,b3334,b3326,b3331,b3335,b3322,b3330,b3332,b3329,b3324,b3323,b3328
GO:0005886	1.4185773534578414e-06	13	1139	cellular_component: plasma membrane	b3333,b3327,b3334,b3326,b3331,b3335,b3322,b3330,b3332,b3329,b3324,b3323,b3328
GO:0009306	1.3787474096747565e-05	3	13	biological_process: protein secretion	b3325,b3332,b3327
GO:0015976	1.941496376616965e-13	5	11	biological_process: carbon utilization	b3393,b3392,b3391,b3394,b3395
GO:0006308	1.941496376616965e-13	5	11	biological_process: DNA catabolic process	b3393,b3392,b3391,b3394,b3395
GO:0009246	2.3220324121020346e-22	11	13	biological_process: enterobacterial common antigen biosynthetic process	b3788,b3793,b3790,b3785,b3792,b3786,b3784,b3791,b3787,b3794,b3789
GO:0009103	6.365483221329173e-18	13	72	biological_process: lipopolysaccharide biosynthetic process	b2032,b3788,b2038,b3785,b3784,b2033,b2036,b2040,b2039,b2034,b2041,b2037,b2035
GO:0009243	7.799861797723459e-13	6	6	biological_process: O antigen biosynthetic process	b2038,b3784,b2040,b2039,b2041,b2037
GO:0045226	4.892359942782914e-11	6	12	biological_process: extracellular polysaccharide biosynthetic process	b3788,b2038,b2040,b2039,b2041,b3789
GO:0019305	6.9836307159996455e-09	4	4	biological_process: dTDP-rhamnose biosynthetic process	b2039,b2040,b2038,b2041
GO:0000271	3.0193901887752157e-05	3	11	biological_process: polysaccharide biosynthetic process	b3789,b3791,b3787
GO:0008879	5.673882023088496e-05	2	2	molecular_function: glucose-1-phosphate thymidylyltransferase activity	b2039,b3789
GO:0008460	5.673882023088496e-05	2	2	molecular_function: dTDP-glucose 4,6-dehydratase activity	b3788,b2041
GO:0009225	0.00012724161271511492	2	3	biological_process: nucleotide-sugar metabolic process	b3788,b2041
