GO:0006096	4.889046469713615e-16	13	19	biological_process: glycolytic process	b2925,b3612,b1723,b2779,b1779,b0755,b3919,b1854,b4395,b2926,b4025,b1676,b3916
GO:0006094	3.060530954659648e-08	7	14	biological_process: gluconeogenesis	b2925,b4232,b3403,b3919,b0755,b2926,b4025
GO:0008152	3.144591301508165e-07	14	119	biological_process: metabolic process	b3417,b4167,b1676,b1854,b4232,b3428,b3403,b3430,b1767,b3431,b3956,b0403,b3080,b3916
GO:0005737	7.124503922623549e-07	39	848	cellular_component: cytoplasm	b4168,b4232,b3403,b3432,b1807,b4166,b3417,b3612,b1493,b1780,b1913,b1767,b4395,b1084,b0143,b1779,b0687,b1914,b0688,b3813,b3164,b0755,b3919,b0403,b3416,b1854,b3428,b3780,b1676,b4173,b3064,b2779,b2927,b0779,b4058,b2926,b4025,b2518,b3916
GO:0005980	2.136292669392446e-06	4	4	biological_process: glycogen catabolic process	b3416,b3417,b3431,b3428
GO:0005977	2.136292669392446e-06	4	4	biological_process: glycogen metabolic process	b3430,b3432,b3431,b3428
GO:0003824	3.883046529313045e-06	23	375	molecular_function: catalytic activity	b2925,b4232,b3403,b3430,b3432,b3431,b3417,b4167,b3612,b1493,b1780,b1767,b4395,b3614,b3517,b3956,b0755,b3919,b1854,b0403,b3428,b1676,b3916
GO:0005975	6.3197072327125874e-06	14	154	biological_process: carbohydrate metabolic process	b2925,b3417,b3614,b1723,b4232,b1780,b0688,b3428,b3430,b3432,b3431,b3416,b0403,b3080
GO:0006289	1.0460818384729074e-05	4	6	biological_process: nucleotide-excision repair	b0779,b4058,b1913,b3813
GO:0005829	1.534941998211098e-05	41	1032	cellular_component: cytosol	b2925,b1723,b4232,b3403,b4174,b3432,b1807,b1867,b3417,b3612,b1493,b1780,b1767,b0144,b0143,b1779,b0687,b4172,b3407,b3517,b0688,b3813,b3956,b3164,b0755,b3919,b3416,b1854,b2733,b3780,b1676,b4173,b3064,b3429,b2779,b2927,b4058,b2926,b4025,b2518,b3916
GO:0042802	3.485543875113687e-05	23	429	molecular_function: identical protein binding	b2925,b3506,b4168,b1723,b4232,b3430,b1807,b1767,b1084,b0687,b3510,b4170,b3164,b3919,b1854,b1676,b3064,b2733,b2779,b0779,b4058,b4025,b3916
GO:0004619	4.349858457063845e-05	3	3	molecular_function: phosphoglycerate mutase activity	b0755,b3612,b4395
GO:0009381	4.349858457063845e-05	3	3	molecular_function: excinuclease ABC activity	b0779,b4058,b1913
GO:0005978	4.349858457063845e-05	3	3	biological_process: glycogen biosynthetic process	b3429,b3432,b3430
GO:0000287	4.520093499349984e-05	14	184	molecular_function: magnesium ion binding	b0142,b1723,b4232,b0688,b2779,b3403,b3430,b3956,b3164,b1084,b3064,b1854,b1676,b3916
GO:0005524	5.3754235151429376e-05	23	441	molecular_function: ATP binding	b4168,b1723,b3403,b3430,b4167,b0142,b0144,b0143,b4171,b3813,b4170,b0755,b1854,b1676,b3780,b2733,b4173,b2786,b0779,b4058,b2926,b2518,b3916
GO:0006298	7.552380240885857e-05	4	10	biological_process: mismatch repair	b2733,b4170,b1960,b3813
GO:0000166	8.01147792751794e-05	25	517	molecular_function: nucleotide binding	b4168,b1723,b4232,b3403,b3430,b4167,b0142,b0144,b1779,b0143,b4171,b3813,b4170,b1854,b1676,b3780,b2733,b4173,b2786,b2628,b0779,b4058,b2926,b2518,b3916
GO:0009380	0.00010149211658219522	3	4	cellular_component: excinuclease repair complex	b0779,b4058,b1913
GO:0002949	0.00010149211658219522	3	4	biological_process: tRNA threonylcarbamoyladenosine modification	b4168,b3064,b1807
GO:0051454	0.00019512336811228423	3	5	biological_process: intracellular pH elevation	b3517,b1492,b1493
GO:0006974	0.0002993961604584752	15	248	biological_process: cellular response to DNA damage stimulus	b3080,b3429,b1723,b1780,b1913,b3813,b0779,b3432,b4170,b3431,b3515,b3516,b4058,b1960,b2733
GO:0009268	0.0003318990053412239	3	6	biological_process: response to pH	b3509,b0486,b3511
GO:0016868	0.0003318990053412239	3	6	molecular_function: intramolecular transferase activity, phosphotransferases	b4395,b0688,b0755
