GO:0015976	0.0	5	11	biological_process: carbon utilization	b3391,b3393,b3394,b3395,b3392
GO:0006308	0.0	5	11	biological_process: DNA catabolic process	b3391,b3393,b3394,b3395,b3392
GO:0043107	1.9492041391120805e-81	1	2	biological_process: type IV pilus-dependent motility	b3394
GO:0043683	1.9492041391120805e-81	1	2	biological_process: type IV pilus biogenesis	b3394
GO:0009306	1.0777426562195674e-11	1	13	biological_process: protein secretion	b3391
GO:0019867	3.72281750822008e-05	1	28	cellular_component: outer membrane	b3391
