GO:0008652	7.8320013891981e-31	26	100	biological_process: cellular amino acid biosynthetic process	b3671,b3769,b3771,b2025,b3770,b2026,b4054,b2023,b2022,b1264,b2019,b1260,b2020,b3212,b3772,b0674,b1262,b0077,b1261,b3670,b3744,b2021,b2024,b0078,b3213,b1263
GO:0000105	2.0206520624964535e-15	8	9	biological_process: histidine biosynthetic process	b2021,b2022,b2020,b2024,b2019,b2025,b2026,b2023
GO:0009099	3.6394117020947817e-14	8	11	biological_process: valine biosynthetic process	b3671,b3572,b3769,b0078,b3771,b0077,b3670,b3770
GO:0009097	1.0821833139889774e-13	8	12	biological_process: isoleucine biosynthetic process	b3671,b3769,b0078,b3772,b3771,b0077,b3670,b3770
GO:0000162	1.76281851297932e-13	7	8	biological_process: tryptophan biosynthetic process	b3360,b2024,b1264,b1262,b1261,b1260,b1263
GO:0009082	9.070546967670613e-12	8	18	biological_process: branched-chain amino acid biosynthetic process	b3671,b3769,b0078,b3771,b3772,b0077,b3670,b3770
GO:0003984	1.9881393423735143e-10	5	5	molecular_function: acetolactate synthase activity	b3671,b3769,b0078,b0077,b3670
GO:0003824	2.012526329006383e-09	20	375	molecular_function: catalytic activity	b3671,b2290,b2022,b2021,b2147,b3572,b2024,b0928,b1264,b3212,b3771,b1260,b2026,b3772,b1262,b0077,b2025,b3770,b4054,b1263
GO:0009073	3.546647897741774e-08	6	18	biological_process: aromatic amino acid family biosynthetic process	b1264,b1262,b1261,b1260,b4054,b1263
GO:0008483	1.375080103688637e-07	6	22	molecular_function: transaminase activity	b2290,b2021,b3572,b0928,b3770,b4054
GO:0006537	2.672698135550158e-07	4	6	biological_process: glutamate biosynthetic process	b2878,b3213,b1761,b3212
GO:0006541	5.458734974901069e-07	5	15	biological_process: glutamine metabolic process	b3360,b3212,b0674,b1263,b2023
GO:0009058	1.1332801849566455e-06	7	48	biological_process: biosynthetic process	b2290,b1812,b2021,b3572,b0928,b1264,b4054
GO:0030170	3.7531465196124556e-06	7	57	molecular_function: pyridoxal phosphate binding	b2290,b2021,b3572,b0928,b3772,b1261,b4054
GO:0005948	6.409973594217797e-06	3	4	cellular_component: acetolactate synthase complex	b3670,b3671,b0077
GO:0006568	6.409973594217797e-06	3	4	biological_process: tryptophan metabolic process	b1260,b1262,b1261
GO:0006520	1.590165367995143e-05	5	28	biological_process: cellular amino acid metabolic process	b1761,b2957,b0928,b3772,b4054
GO:0016829	2.1760049377874577e-05	10	169	molecular_function: lyase activity	b2022,b1264,b3771,b1260,b3772,b1262,b1261,b2025,b2023,b1263
GO:0051536	4.3353891826398466e-05	9	146	molecular_function: iron-sulfur cluster binding	b2146,b2468,b3212,b2878,b3771,b2881,b3213,b2147,b2887
GO:1990610	0.00014078386004799944	2	2	molecular_function: acetolactate synthase regulator activity	b3670,b0078
GO:0004071	0.00014078386004799944	2	2	molecular_function: aspartate-ammonia ligase activity	b0674,b3744
GO:0070981	0.00014078386004799944	2	2	biological_process: L-asparagine biosynthetic process	b0674,b3744
GO:0006529	0.00014078386004799944	2	2	biological_process: asparagine biosynthetic process	b0674,b3744
GO:0033585	0.00014078386004799944	2	2	biological_process: L-phenylalanine biosynthetic process from chorismate via phenylpyruvate	b4054,b0928
GO:0004838	0.00014078386004799944	2	2	molecular_function: L-tyrosine:2-oxoglutarate aminotransferase activity	b4054,b0928
GO:0004834	0.00014078386004799944	2	2	molecular_function: tryptophan synthase activity	b1260,b1261
GO:0004049	0.00014078386004799944	2	2	molecular_function: anthranilate synthase activity	b1264,b1263
GO:0046820	0.00014078386004799944	2	2	molecular_function: 4-amino-4-deoxychorismate synthase activity	b3360,b1812
GO:0000107	0.00014078386004799944	2	2	molecular_function: imidazoleglycerol-phosphate synthase activity	b2025,b2023
GO:0009382	0.00014078386004799944	2	2	cellular_component: imidazoleglycerol-phosphate synthase complex	b2025,b2023
GO:0004159	0.00014078386004799944	2	2	molecular_function: dihydrouracil dehydrogenase (NAD+) activity	b2146,b2147
GO:0015930	0.00014078386004799944	2	2	molecular_function: glutamate synthase activity	b2878,b3212
GO:0004355	0.00014078386004799944	2	2	molecular_function: glutamate synthase (NADPH) activity	b3213,b3212
GO:0097054	0.00014078386004799944	2	2	biological_process: L-glutamate biosynthetic process	b3213,b3212
GO:0006532	0.00014078386004799944	2	2	biological_process: aspartate biosynthetic process	b3770,b4054
GO:0005737	0.00030899339958965675	21	848	cellular_component: cytoplasm	b3572,b0852,b2025,b2026,b4054,b2023,b2947,b2022,b2019,b1260,b2290,b1812,b2020,b0928,b2946,b0674,b1261,b3744,b1761,b2024,b2147
GO:0019676	0.00041911939134087466	2	3	biological_process: ammonia assimilation cycle	b2878,b3212
GO:0046872	0.0005922683780796221	18	692	molecular_function: metal ion binding	b3671,b2022,b2147,b2468,b2020,b1264,b2019,b3212,b0852,b3771,b2881,b1813,b2878,b0077,b3213,b2879,b2887,b2947
GO:0016740	0.0006647853407923705	16	576	molecular_function: transferase activity	b3671,b2290,b1812,b2021,b3360,b3572,b3769,b0928,b0078,b2019,b2946,b0077,b1263,b3670,b3770,b4054
GO:0009094	0.0008318288090923183	2	4	biological_process: L-phenylalanine biosynthetic process	b4054,b0928
GO:0019628	0.0008318288090923183	2	4	biological_process: urate catabolic process	b2468,b2887
