GO:0006633	1.036512528049605e-11	6	19	biological_process: fatty acid biosynthetic process	b1093,b1095,b1090,b1092,b1288,b1091
GO:0006629	1.1693023218994911e-09	7	74	biological_process: lipid metabolic process	b1093,b1095,b1090,b0736,b1092,b1288,b1091
GO:0043213	9.917905818548828e-09	4	9	biological_process: bacteriocin transport	b0738,b0740,b0739,b0737
GO:0007049	3.5340936390213346e-08	6	67	biological_process: cell cycle	b0738,b0740,b0742,b0741,b0739,b0737
GO:0006631	3.585904895978859e-08	5	32	biological_process: fatty acid metabolic process	b1093,b1095,b1092,b1288,b1091
GO:0032153	3.585904895978859e-08	5	32	cellular_component: cell division site	b0738,b0740,b0741,b0739,b0737
GO:0051301	5.971257075350213e-08	6	73	biological_process: cell division	b0738,b0740,b0742,b0741,b0739,b0737
GO:0017038	3.0329080984224253e-07	3	5	biological_process: protein import	b0740,b0739,b0737
GO:0071237	1.0609798148585003e-05	2	2	biological_process: cellular response to bacteriocin	b0740,b0739
GO:0004315	3.1768498135239774e-05	2	3	molecular_function: 3-oxoacyl-[acyl-carrier-protein] synthase activity	b1095,b1091
GO:0030497	3.1768498135239774e-05	2	3	biological_process: fatty acid elongation	b1288,b1093
