GO:0019700	5.883866557547936e-20	8	8	biological_process: organic phosphonate catabolic process	b4101,b4095,b4097,b4092,b4098,b4100,b4096,b4099
GO:1904176	1.7291501734435382e-12	5	5	cellular_component: carbon phosphorus lyase complex	b4101,b4097,b4098,b4100,b4099
GO:0019634	3.8828887783923057e-10	4	4	biological_process: organic phosphonate metabolic process	b4101,b4094,b4099,b4100
GO:0061694	3.8828887783923057e-10	4	4	cellular_component: alpha-D-ribose 1-methylphosphonate 5-triphosphate synthase complex	b4096,b4099,b4100,b4101
GO:0061693	3.8828887783923057e-10	4	4	molecular_function: alpha-D-ribose 1-methylphosphonate 5-triphosphate synthase activity	b4096,b4099,b4100,b4101
GO:0015716	5.946125309459329e-05	2	4	biological_process: organic phosphonate transport	b4101,b4102
