GO:0015627	8.905214629594693e-23	10	12	cellular_component: type II protein secretion system complex	b3329,b3326,b3330,b3334,b3325,b3328,b3333,b3327,b3331,b3324
GO:0015628	4.152275928941432e-22	10	14	biological_process: protein secretion by the type II secretion system	b3329,b3326,b3330,b3334,b3325,b3328,b3333,b3327,b3331,b3324
GO:0015031	1.60499361049075e-17	11	67	biological_process: protein transport	b3329,b3332,b3326,b3330,b3334,b3325,b3328,b3333,b3327,b3331,b3324
GO:0016021	1.762654988985567e-07	13	966	cellular_component: integral component of membrane	b3329,b3332,b3330,b3323,b3335,b3334,b3325,b3328,b3333,b3327,b3331,b3322,b3324
GO:0016020	2.617055657847966e-07	14	1299	cellular_component: membrane	b3329,b3332,b3326,b3330,b3323,b3335,b3334,b3325,b3328,b3333,b3327,b3331,b3322,b3324
GO:0005886	1.4185773534578414e-06	13	1139	cellular_component: plasma membrane	b3329,b3332,b3326,b3330,b3323,b3335,b3334,b3328,b3333,b3327,b3331,b3322,b3324
GO:0009306	1.3787474096747565e-05	3	13	biological_process: protein secretion	b3325,b3332,b3327
