GO:0009252	3.058244913439292e-10	7	27	biological_process: peptidoglycan biosynthetic process	spr0776,spr0304,spr1823,spr1517,spr1540,spr0305,spr0329
GO:0008658	4.8038808144546115e-08	4	5	molecular_function: penicillin binding	spr0329,spr1823,spr0304,spr1517
GO:0071555	7.048580154632095e-07	5	25	biological_process: cell wall organization	spr0776,spr0304,spr1517,spr0305,spr0329
GO:0046677	7.532178687057533e-07	4	10	biological_process: response to antibiotic	spr0329,spr1823,spr0304,spr1517
GO:0008360	1.2284033251845294e-06	5	28	biological_process: regulation of cell shape	spr0776,spr0304,spr1517,spr0305,spr0329
GO:0004180	3.47627016018691e-06	3	4	molecular_function: carboxypeptidase activity	spr0776,spr1823,spr0329
GO:0009002	3.47627016018691e-06	3	4	molecular_function: serine-type D-Ala-D-Ala carboxypeptidase activity	spr0776,spr1823,spr0329
GO:0008144	0.00023347925401956594	2	3	molecular_function: drug binding	spr1823,spr0329
GO:0008955	0.00023347925401956594	2	3	molecular_function: peptidoglycan glycosyltransferase activity	spr1823,spr0329
GO:0005887	0.00034241960933771625	4	48	cellular_component: integral component of plasma membrane	spr0305,spr1517,spr0303,spr0304
GO:0006310	0.0005355699466598407	3	22	biological_process: DNA recombination	spr1539,spr0330,spr1516
GO:0006508	0.0006138425773699042	4	56	biological_process: proteolysis	spr0776,spr1823,spr1517,spr0329
