GO:0006097	6.176406399205926e-09	4	8	biological_process: glyoxylate cycle	b4016,b2976,b4015,b4014
GO:0019154	7.861634976057186e-08	3	3	molecular_function: glycolate dehydrogenase activity	b2979,b4468,b4467
GO:0046296	6.259843807577015e-07	3	6	biological_process: glycolate catabolic process	b2979,b4468,b4467
GO:0006099	1.034217132347134e-06	4	29	biological_process: tricarboxylic acid cycle	b4016,b2976,b4015,b4014
GO:0004474	1.4911900757922708e-05	2	2	molecular_function: malate synthase activity	b2976,b4014
GO:0030267	3.3499324773293e-05	2	3	molecular_function: glyoxylate reductase (NADP) activity	b3553,b1033
GO:0016618	3.3499324773293e-05	2	3	molecular_function: hydroxypyruvate reductase activity	b3553,b1033
