protein1,protein2,ppi
171101.spr0002,171101.spr0032,927
171101.spr0002,171101.spr0251,920
171101.spr0002,171101.spr0414,748
171101.spr0002,171101.spr0673,958
171101.spr0002,171101.spr0688,737
171101.spr0002,171101.spr0769,941
171101.spr0002,171101.spr0795,929
171101.spr0002,171101.spr0836,919
171101.spr0002,171101.spr0896,881
171101.spr0002,171101.spr1065,737
171101.spr0011,171101.spr1435,920
171101.spr0011,171101.spr1662,831
171101.spr0028,171101.spr1002,800
171101.spr0032,171101.spr0251,920
171101.spr0032,171101.spr0673,920
171101.spr0032,171101.spr0711,756
171101.spr0032,171101.spr0769,920
171101.spr0032,171101.spr0795,920
171101.spr0032,171101.spr0836,920
171101.spr0032,171101.spr0896,920
171101.spr0032,171101.spr1757,767
171101.spr0037,171101.spr0755,879
171101.spr0045,171101.spr0052,802
171101.spr0049,171101.spr0051,972
171101.spr0049,171101.spr0052,856
171101.spr0049,171101.spr1109,860
171101.spr0051,171101.spr0052,856
171101.spr0051,171101.spr0928,772
171101.spr0051,171101.spr1109,850
171101.spr0057,171101.spr1949,807
171101.spr0059,171101.spr0565,882
171101.spr0060,171101.spr0061,866
171101.spr0060,171101.spr0062,866
171101.spr0060,171101.spr0259,850
171101.spr0060,171101.spr0260,850
171101.spr0060,171101.spr1967,850
171101.spr0060,171101.spr1968,850
171101.spr0061,171101.spr0062,863
171101.spr0061,171101.spr0063,863
171101.spr0061,171101.spr0259,823
171101.spr0061,171101.spr0260,800
171101.spr0061,171101.spr0261,880
171101.spr0061,171101.spr1967,827
171101.spr0061,171101.spr1968,800
171101.spr0061,171101.spr1969,850
171101.spr0061,171101.spr1970,850
171101.spr0062,171101.spr0063,863
171101.spr0062,171101.spr0259,800
171101.spr0062,171101.spr0260,822
171101.spr0062,171101.spr0261,880
171101.spr0062,171101.spr1967,800
171101.spr0062,171101.spr1968,822
171101.spr0062,171101.spr1969,850
171101.spr0062,171101.spr1970,850
171101.spr0063,171101.spr0259,850
171101.spr0063,171101.spr0260,850
171101.spr0063,171101.spr1967,850
171101.spr0063,171101.spr1968,850
171101.spr0078,171101.spr0187,869
171101.spr0078,171101.spr0188,867
171101.spr0078,171101.spr0189,867
171101.spr0078,171101.spr0190,867
171101.spr0078,171101.spr0191,867
171101.spr0078,171101.spr0192,869
171101.spr0078,171101.spr0194,867
171101.spr0078,171101.spr0195,869
171101.spr0078,171101.spr0196,867
171101.spr0078,171101.spr0197,867
171101.spr0078,171101.spr0198,869
171101.spr0078,171101.spr0199,867
171101.spr0078,171101.spr0200,867
171101.spr0078,171101.spr0201,867
171101.spr0078,171101.spr0202,869
171101.spr0078,171101.spr0203,869
171101.spr0078,171101.spr0204,867
171101.spr0078,171101.spr0205,867
171101.spr0078,171101.spr0206,869
171101.spr0078,171101.spr0207,867
171101.spr0078,171101.spr0208,867
171101.spr0078,171101.spr0213,869
171101.spr0078,171101.spr0214,869
171101.spr0078,171101.spr0216,867
171101.spr0078,171101.spr0248,869
171101.spr0078,171101.spr0249,869
171101.spr0078,171101.spr0271,867
171101.spr0078,171101.spr0272,869
171101.spr0078,171101.spr0398,867
171101.spr0078,171101.spr0480,737
171101.spr0078,171101.spr0555,867
171101.spr0078,171101.spr0556,867
171101.spr0078,171101.spr0682,869
171101.spr0078,171101.spr0740,869
171101.spr0078,171101.spr0764,737
171101.spr0078,171101.spr0862,867
171101.spr0078,171101.spr0863,867
171101.spr0078,171101.spr1012,867
171101.spr0078,171101.spr1014,867
171101.spr0078,171101.spr1171,867
171101.spr0078,171101.spr1211,819
171101.spr0078,171101.spr1212,867
171101.spr0078,171101.spr1271,869
171101.spr0078,171101.spr1394,869
171101.spr0078,171101.spr1396,869
171101.spr0078,171101.spr1467,869
171101.spr0078,171101.spr1807,867
171101.spr0078,171101.spr1943,867
171101.spr0078,171101.spr2009,867
171101.spr0078,171101.spr2020,869
171101.spr0081,171101.spr0082,864
171101.spr0081,171101.spr0083,868
171101.spr0082,171101.spr0083,868
171101.spr0094,171101.spr0095,920
171101.spr0094,171101.spr0406,826
171101.spr0095,171101.spr0406,888
171101.spr0124,171101.spr0920,867
171101.spr0125,171101.spr0538,800
171101.spr0129,171101.spr0131,837
171101.spr0139,171101.spr0318,800
171101.spr0147,171101.spr0149,893
171101.spr0147,171101.spr0150,915
171101.spr0149,171101.spr0150,953
171101.spr0153,171101.spr0579,800
171101.spr0160,171101.spr0368,756
171101.spr0160,171101.spr0543,801
171101.spr0160,171101.spr1888,853
171101.spr0162,171101.spr0164,870
171101.spr0165,171101.spr0238,869
171101.spr0171,171101.spr0543,745
171101.spr0171,171101.spr1118,803
171101.spr0178,171101.spr0267,800
171101.spr0183,171101.spr0185,711
171101.spr0187,171101.spr0188,867
171101.spr0187,171101.spr0189,867
171101.spr0187,171101.spr0190,867
171101.spr0187,171101.spr0191,867
171101.spr0187,171101.spr0192,869
171101.spr0187,171101.spr0194,867
171101.spr0187,171101.spr0195,869
171101.spr0187,171101.spr0196,867
171101.spr0187,171101.spr0197,867
171101.spr0187,171101.spr0198,869
171101.spr0187,171101.spr0199,867
171101.spr0187,171101.spr0200,867
171101.spr0187,171101.spr0201,867
171101.spr0187,171101.spr0202,869
171101.spr0187,171101.spr0203,869
171101.spr0187,171101.spr0204,867
171101.spr0187,171101.spr0205,867
171101.spr0187,171101.spr0206,869
171101.spr0187,171101.spr0207,867
171101.spr0187,171101.spr0208,867
171101.spr0187,171101.spr0212,856
171101.spr0187,171101.spr0213,869
171101.spr0187,171101.spr0214,869
171101.spr0187,171101.spr0216,867
171101.spr0187,171101.spr0248,869
171101.spr0187,171101.spr0249,869
171101.spr0187,171101.spr0250,830
171101.spr0187,171101.spr0271,867
171101.spr0187,171101.spr0272,869
171101.spr0187,171101.spr0398,867
171101.spr0187,171101.spr0480,746
171101.spr0187,171101.spr0481,754
171101.spr0187,171101.spr0555,867
171101.spr0187,171101.spr0556,839
171101.spr0187,171101.spr0682,869
171101.spr0187,171101.spr0740,869
171101.spr0187,171101.spr0764,817
171101.spr0187,171101.spr0846,813
171101.spr0187,171101.spr0862,867
171101.spr0187,171101.spr0863,867
171101.spr0187,171101.spr0924,801
171101.spr0187,171101.spr1012,867
171101.spr0187,171101.spr1014,867
171101.spr0187,171101.spr1171,867
171101.spr0187,171101.spr1211,825
171101.spr0187,171101.spr1212,867
171101.spr0187,171101.spr1271,869
171101.spr0187,171101.spr1394,869
171101.spr0187,171101.spr1396,869
171101.spr0187,171101.spr1467,869
171101.spr0187,171101.spr1807,867
171101.spr0187,171101.spr1943,867
171101.spr0187,171101.spr2009,867
171101.spr0187,171101.spr2020,869
171101.spr0188,171101.spr0189,869
171101.spr0188,171101.spr0190,869
171101.spr0188,171101.spr0191,869
171101.spr0188,171101.spr0192,867
171101.spr0188,171101.spr0194,869
171101.spr0188,171101.spr0195,867
171101.spr0188,171101.spr0196,869
171101.spr0188,171101.spr0197,869
171101.spr0188,171101.spr0198,867
171101.spr0188,171101.spr0199,869
171101.spr0188,171101.spr0200,869
171101.spr0188,171101.spr0201,869
171101.spr0188,171101.spr0202,867
171101.spr0188,171101.spr0203,867
171101.spr0188,171101.spr0204,869
171101.spr0188,171101.spr0205,869
171101.spr0188,171101.spr0206,867
171101.spr0188,171101.spr0207,869
171101.spr0188,171101.spr0208,869
171101.spr0188,171101.spr0212,868
171101.spr0188,171101.spr0213,867
171101.spr0188,171101.spr0214,867
171101.spr0188,171101.spr0216,869
171101.spr0188,171101.spr0248,867
171101.spr0188,171101.spr0249,867
171101.spr0188,171101.spr0250,816
171101.spr0188,171101.spr0271,869
171101.spr0188,171101.spr0272,867
171101.spr0188,171101.spr0398,869
171101.spr0188,171101.spr0555,869
171101.spr0188,171101.spr0556,869
171101.spr0188,171101.spr0682,867
171101.spr0188,171101.spr0740,867
171101.spr0188,171101.spr0846,813
171101.spr0188,171101.spr0862,869
171101.spr0188,171101.spr0863,869
171101.spr0188,171101.spr0924,801
171101.spr0188,171101.spr1012,869
171101.spr0188,171101.spr1014,869
171101.spr0188,171101.spr1171,869
171101.spr0188,171101.spr1177,868
171101.spr0188,171101.spr1211,869
171101.spr0188,171101.spr1212,869
171101.spr0188,171101.spr1271,867
171101.spr0188,171101.spr1394,867
171101.spr0188,171101.spr1396,867
171101.spr0188,171101.spr1467,867
171101.spr0188,171101.spr1807,869
171101.spr0188,171101.spr1943,869
171101.spr0188,171101.spr2009,869
171101.spr0188,171101.spr2020,867
171101.spr0189,171101.spr0190,869
171101.spr0189,171101.spr0191,869
171101.spr0189,171101.spr0192,867
171101.spr0189,171101.spr0194,869
171101.spr0189,171101.spr0195,867
171101.spr0189,171101.spr0196,869
171101.spr0189,171101.spr0197,869
171101.spr0189,171101.spr0198,867
171101.spr0189,171101.spr0199,869
171101.spr0189,171101.spr0200,869
171101.spr0189,171101.spr0201,870
171101.spr0189,171101.spr0202,867
171101.spr0189,171101.spr0203,867
171101.spr0189,171101.spr0204,869
171101.spr0189,171101.spr0205,869
171101.spr0189,171101.spr0206,867
171101.spr0189,171101.spr0207,869
171101.spr0189,171101.spr0208,869
171101.spr0189,171101.spr0211,737
171101.spr0189,171101.spr0212,868
171101.spr0189,171101.spr0213,867
171101.spr0189,171101.spr0214,867
171101.spr0189,171101.spr0216,869
171101.spr0189,171101.spr0248,867
171101.spr0189,171101.spr0249,867
171101.spr0189,171101.spr0271,869
171101.spr0189,171101.spr0272,867
171101.spr0189,171101.spr0398,869
171101.spr0189,171101.spr0480,737
171101.spr0189,171101.spr0555,869
171101.spr0189,171101.spr0556,869
171101.spr0189,171101.spr0682,867
171101.spr0189,171101.spr0740,867
171101.spr0189,171101.spr0846,789
171101.spr0189,171101.spr0862,869
171101.spr0189,171101.spr0863,869
171101.spr0189,171101.spr0924,792
171101.spr0189,171101.spr1012,869
171101.spr0189,171101.spr1014,869
171101.spr0189,171101.spr1171,869
171101.spr0189,171101.spr1177,868
171101.spr0189,171101.spr1211,869
171101.spr0189,171101.spr1212,869
171101.spr0189,171101.spr1271,867
171101.spr0189,171101.spr1394,867
171101.spr0189,171101.spr1396,867
171101.spr0189,171101.spr1467,867
171101.spr0189,171101.spr1807,869
171101.spr0189,171101.spr1943,869
171101.spr0189,171101.spr2009,869
171101.spr0189,171101.spr2020,867
171101.spr0190,171101.spr0191,937
171101.spr0190,171101.spr0192,867
171101.spr0190,171101.spr0194,937
171101.spr0190,171101.spr0195,867
171101.spr0190,171101.spr0196,937
171101.spr0190,171101.spr0197,937
171101.spr0190,171101.spr0198,867
171101.spr0190,171101.spr0199,937
171101.spr0190,171101.spr0200,937
171101.spr0190,171101.spr0201,937
171101.spr0190,171101.spr0202,867
171101.spr0190,171101.spr0203,867
171101.spr0190,171101.spr0204,937
171101.spr0190,171101.spr0205,937
171101.spr0190,171101.spr0206,867
171101.spr0190,171101.spr0207,937
171101.spr0190,171101.spr0208,937
171101.spr0190,171101.spr0212,868
171101.spr0190,171101.spr0213,867
171101.spr0190,171101.spr0214,867
171101.spr0190,171101.spr0216,937
171101.spr0190,171101.spr0248,867
171101.spr0190,171101.spr0249,867
171101.spr0190,171101.spr0271,870
171101.spr0190,171101.spr0272,867
171101.spr0190,171101.spr0398,870
171101.spr0190,171101.spr0480,800
171101.spr0190,171101.spr0555,937
171101.spr0190,171101.spr0556,937
171101.spr0190,171101.spr0682,867
171101.spr0190,171101.spr0740,867
171101.spr0190,171101.spr0764,815
171101.spr0190,171101.spr0862,937
171101.spr0190,171101.spr0863,937
171101.spr0190,171101.spr1012,869
171101.spr0190,171101.spr1014,937
171101.spr0190,171101.spr1166,808
171101.spr0190,171101.spr1171,937
171101.spr0190,171101.spr1177,868
171101.spr0190,171101.spr1211,869
171101.spr0190,171101.spr1212,937
171101.spr0190,171101.spr1271,867
171101.spr0190,171101.spr1394,867
171101.spr0190,171101.spr1396,867
171101.spr0190,171101.spr1467,867
171101.spr0190,171101.spr1807,869
171101.spr0190,171101.spr1881,766
171101.spr0190,171101.spr1943,869
171101.spr0190,171101.spr2009,937
171101.spr0190,171101.spr2020,867
171101.spr0191,171101.spr0192,867
171101.spr0191,171101.spr0194,937
171101.spr0191,171101.spr0195,867
171101.spr0191,171101.spr0196,937
171101.spr0191,171101.spr0197,937
171101.spr0191,171101.spr0198,867
171101.spr0191,171101.spr0199,937
171101.spr0191,171101.spr0200,937
171101.spr0191,171101.spr0201,937
171101.spr0191,171101.spr0202,867
171101.spr0191,171101.spr0203,867
171101.spr0191,171101.spr0204,937
171101.spr0191,171101.spr0205,937
171101.spr0191,171101.spr0206,867
171101.spr0191,171101.spr0207,937
171101.spr0191,171101.spr0208,937
171101.spr0191,171101.spr0212,868
171101.spr0191,171101.spr0213,867
171101.spr0191,171101.spr0214,867
171101.spr0191,171101.spr0216,937
171101.spr0191,171101.spr0248,867
171101.spr0191,171101.spr0249,867
171101.spr0191,171101.spr0250,720
171101.spr0191,171101.spr0271,870
171101.spr0191,171101.spr0272,867
171101.spr0191,171101.spr0398,870
171101.spr0191,171101.spr0480,782
171101.spr0191,171101.spr0555,937
171101.spr0191,171101.spr0556,937
171101.spr0191,171101.spr0665,753
171101.spr0191,171101.spr0682,867
171101.spr0191,171101.spr0740,867
171101.spr0191,171101.spr0764,737
171101.spr0191,171101.spr0846,813
171101.spr0191,171101.spr0862,937
171101.spr0191,171101.spr0863,937
171101.spr0191,171101.spr0924,801
171101.spr0191,171101.spr1012,869
171101.spr0191,171101.spr1014,937
171101.spr0191,171101.spr1171,937
171101.spr0191,171101.spr1177,868
171101.spr0191,171101.spr1211,869
171101.spr0191,171101.spr1212,937
171101.spr0191,171101.spr1271,867
171101.spr0191,171101.spr1394,867
171101.spr0191,171101.spr1396,867
171101.spr0191,171101.spr1467,867
171101.spr0191,171101.spr1807,869
171101.spr0191,171101.spr1943,869
171101.spr0191,171101.spr2009,937
171101.spr0191,171101.spr2020,867
171101.spr0192,171101.spr0194,867
171101.spr0192,171101.spr0195,937
171101.spr0192,171101.spr0196,867
171101.spr0192,171101.spr0197,867
171101.spr0192,171101.spr0198,937
171101.spr0192,171101.spr0199,867
171101.spr0192,171101.spr0200,867
171101.spr0192,171101.spr0201,867
171101.spr0192,171101.spr0202,869
171101.spr0192,171101.spr0203,937
171101.spr0192,171101.spr0204,867
171101.spr0192,171101.spr0205,867
171101.spr0192,171101.spr0206,937
171101.spr0192,171101.spr0207,867
171101.spr0192,171101.spr0208,867
171101.spr0192,171101.spr0213,869
171101.spr0192,171101.spr0214,937
171101.spr0192,171101.spr0216,867
171101.spr0192,171101.spr0248,869
171101.spr0192,171101.spr0249,937
171101.spr0192,171101.spr0271,867
171101.spr0192,171101.spr0272,937
171101.spr0192,171101.spr0398,867
171101.spr0192,171101.spr0480,800
171101.spr0192,171101.spr0555,867
171101.spr0192,171101.spr0556,812
171101.spr0192,171101.spr0682,869
171101.spr0192,171101.spr0740,869
171101.spr0192,171101.spr0862,867
171101.spr0192,171101.spr0863,867
171101.spr0192,171101.spr1012,867
171101.spr0192,171101.spr1014,867
171101.spr0192,171101.spr1171,867
171101.spr0192,171101.spr1211,813
171101.spr0192,171101.spr1212,867
171101.spr0192,171101.spr1271,869
171101.spr0192,171101.spr1394,937
171101.spr0192,171101.spr1396,937
171101.spr0192,171101.spr1467,937
171101.spr0192,171101.spr1807,867
171101.spr0192,171101.spr1881,776
171101.spr0192,171101.spr1943,867
171101.spr0192,171101.spr2009,867
171101.spr0192,171101.spr2011,870
171101.spr0192,171101.spr2020,937
171101.spr0194,171101.spr0195,867
171101.spr0194,171101.spr0196,937
171101.spr0194,171101.spr0197,937
171101.spr0194,171101.spr0198,867
171101.spr0194,171101.spr0199,937
171101.spr0194,171101.spr0200,937
171101.spr0194,171101.spr0201,937
171101.spr0194,171101.spr0202,867
171101.spr0194,171101.spr0203,867
171101.spr0194,171101.spr0204,937
171101.spr0194,171101.spr0205,937
171101.spr0194,171101.spr0206,867
171101.spr0194,171101.spr0207,937
171101.spr0194,171101.spr0208,937
171101.spr0194,171101.spr0212,868
171101.spr0194,171101.spr0213,867
171101.spr0194,171101.spr0214,867
171101.spr0194,171101.spr0216,937
171101.spr0194,171101.spr0248,867
171101.spr0194,171101.spr0249,867
171101.spr0194,171101.spr0250,774
171101.spr0194,171101.spr0271,870
171101.spr0194,171101.spr0272,867
171101.spr0194,171101.spr0398,870
171101.spr0194,171101.spr0480,738
171101.spr0194,171101.spr0555,937
171101.spr0194,171101.spr0556,937
171101.spr0194,171101.spr0682,867
171101.spr0194,171101.spr0740,867
171101.spr0194,171101.spr0846,801
171101.spr0194,171101.spr0862,937
171101.spr0194,171101.spr0863,937
171101.spr0194,171101.spr0924,789
171101.spr0194,171101.spr1012,869
171101.spr0194,171101.spr1014,937
171101.spr0194,171101.spr1171,937
171101.spr0194,171101.spr1177,868
171101.spr0194,171101.spr1211,869
171101.spr0194,171101.spr1212,937
171101.spr0194,171101.spr1271,867
171101.spr0194,171101.spr1394,867
171101.spr0194,171101.spr1396,867
171101.spr0194,171101.spr1467,867
171101.spr0194,171101.spr1807,869
171101.spr0194,171101.spr1943,869
171101.spr0194,171101.spr2009,937
171101.spr0194,171101.spr2020,867
171101.spr0195,171101.spr0196,867
171101.spr0195,171101.spr0197,867
171101.spr0195,171101.spr0198,937
171101.spr0195,171101.spr0199,867
171101.spr0195,171101.spr0200,867
171101.spr0195,171101.spr0201,867
171101.spr0195,171101.spr0202,869
171101.spr0195,171101.spr0203,937
171101.spr0195,171101.spr0204,867
171101.spr0195,171101.spr0205,867
171101.spr0195,171101.spr0206,937
171101.spr0195,171101.spr0207,867
171101.spr0195,171101.spr0208,867
171101.spr0195,171101.spr0213,869
171101.spr0195,171101.spr0214,937
171101.spr0195,171101.spr0216,867
171101.spr0195,171101.spr0248,869
171101.spr0195,171101.spr0249,937
171101.spr0195,171101.spr0271,867
171101.spr0195,171101.spr0272,937
171101.spr0195,171101.spr0398,867
171101.spr0195,171101.spr0480,802
171101.spr0195,171101.spr0481,754
171101.spr0195,171101.spr0555,867
171101.spr0195,171101.spr0556,830
171101.spr0195,171101.spr0682,869
171101.spr0195,171101.spr0740,869
171101.spr0195,171101.spr0862,867
171101.spr0195,171101.spr0863,867
171101.spr0195,171101.spr1012,867
171101.spr0195,171101.spr1014,867
171101.spr0195,171101.spr1171,867
171101.spr0195,171101.spr1211,867
171101.spr0195,171101.spr1212,867
171101.spr0195,171101.spr1271,869
171101.spr0195,171101.spr1394,937
171101.spr0195,171101.spr1396,937
171101.spr0195,171101.spr1467,937
171101.spr0195,171101.spr1807,867
171101.spr0195,171101.spr1881,747
171101.spr0195,171101.spr1943,867
171101.spr0195,171101.spr2009,867
171101.spr0195,171101.spr2011,870
171101.spr0195,171101.spr2020,937
171101.spr0196,171101.spr0197,937
171101.spr0196,171101.spr0198,867
171101.spr0196,171101.spr0199,937
171101.spr0196,171101.spr0200,937
171101.spr0196,171101.spr0201,937
171101.spr0196,171101.spr0202,867
171101.spr0196,171101.spr0203,867
171101.spr0196,171101.spr0204,937
171101.spr0196,171101.spr0205,937
171101.spr0196,171101.spr0206,867
171101.spr0196,171101.spr0207,937
171101.spr0196,171101.spr0208,937
171101.spr0196,171101.spr0212,868
171101.spr0196,171101.spr0213,867
171101.spr0196,171101.spr0214,867
171101.spr0196,171101.spr0216,937
171101.spr0196,171101.spr0248,867
171101.spr0196,171101.spr0249,867
171101.spr0196,171101.spr0250,713
171101.spr0196,171101.spr0271,870
171101.spr0196,171101.spr0272,867
171101.spr0196,171101.spr0398,870
171101.spr0196,171101.spr0555,937
171101.spr0196,171101.spr0556,926
171101.spr0196,171101.spr0682,867
171101.spr0196,171101.spr0740,867
171101.spr0196,171101.spr0846,773
171101.spr0196,171101.spr0862,937
171101.spr0196,171101.spr0863,937
171101.spr0196,171101.spr0924,773
171101.spr0196,171101.spr1012,869
171101.spr0196,171101.spr1014,937
171101.spr0196,171101.spr1171,937
171101.spr0196,171101.spr1177,868
171101.spr0196,171101.spr1211,869
171101.spr0196,171101.spr1212,937
171101.spr0196,171101.spr1271,867
171101.spr0196,171101.spr1394,867
171101.spr0196,171101.spr1396,867
171101.spr0196,171101.spr1467,867
171101.spr0196,171101.spr1807,869
171101.spr0196,171101.spr1943,869
171101.spr0196,171101.spr2009,937
171101.spr0196,171101.spr2020,867
171101.spr0197,171101.spr0198,867
171101.spr0197,171101.spr0199,937
171101.spr0197,171101.spr0200,937
171101.spr0197,171101.spr0201,937
171101.spr0197,171101.spr0202,867
171101.spr0197,171101.spr0203,867
171101.spr0197,171101.spr0204,937
171101.spr0197,171101.spr0205,937
171101.spr0197,171101.spr0206,867
171101.spr0197,171101.spr0207,937
171101.spr0197,171101.spr0208,937
171101.spr0197,171101.spr0212,868
171101.spr0197,171101.spr0213,867
171101.spr0197,171101.spr0214,867
171101.spr0197,171101.spr0216,937
171101.spr0197,171101.spr0248,867
171101.spr0197,171101.spr0249,867
171101.spr0197,171101.spr0271,870
171101.spr0197,171101.spr0272,867
171101.spr0197,171101.spr0398,870
171101.spr0197,171101.spr0480,776
171101.spr0197,171101.spr0555,937
171101.spr0197,171101.spr0556,937
171101.spr0197,171101.spr0682,867
171101.spr0197,171101.spr0740,867
171101.spr0197,171101.spr0862,937
171101.spr0197,171101.spr0863,937
171101.spr0197,171101.spr1012,869
171101.spr0197,171101.spr1014,937
171101.spr0197,171101.spr1171,937
171101.spr0197,171101.spr1177,868
171101.spr0197,171101.spr1211,846
171101.spr0197,171101.spr1212,937
171101.spr0197,171101.spr1271,867
171101.spr0197,171101.spr1394,867
171101.spr0197,171101.spr1396,867
171101.spr0197,171101.spr1467,867
171101.spr0197,171101.spr1807,869
171101.spr0197,171101.spr1881,759
171101.spr0197,171101.spr1943,869
171101.spr0197,171101.spr2009,937
171101.spr0197,171101.spr2020,867
171101.spr0198,171101.spr0199,867
171101.spr0198,171101.spr0200,867
171101.spr0198,171101.spr0201,867
171101.spr0198,171101.spr0202,869
171101.spr0198,171101.spr0203,937
171101.spr0198,171101.spr0204,867
171101.spr0198,171101.spr0205,867
171101.spr0198,171101.spr0206,937
171101.spr0198,171101.spr0207,867
171101.spr0198,171101.spr0208,867
171101.spr0198,171101.spr0213,869
171101.spr0198,171101.spr0214,937
171101.spr0198,171101.spr0216,867
171101.spr0198,171101.spr0248,869
171101.spr0198,171101.spr0249,937
171101.spr0198,171101.spr0271,867
171101.spr0198,171101.spr0272,937
171101.spr0198,171101.spr0398,867
171101.spr0198,171101.spr0480,800
171101.spr0198,171101.spr0555,867
171101.spr0198,171101.spr0556,812
171101.spr0198,171101.spr0682,869
171101.spr0198,171101.spr0740,869
171101.spr0198,171101.spr0764,707
171101.spr0198,171101.spr0862,867
171101.spr0198,171101.spr0863,867
171101.spr0198,171101.spr1012,867
171101.spr0198,171101.spr1014,867
171101.spr0198,171101.spr1171,867
171101.spr0198,171101.spr1211,846
171101.spr0198,171101.spr1212,867
171101.spr0198,171101.spr1271,869
171101.spr0198,171101.spr1394,937
171101.spr0198,171101.spr1396,937
171101.spr0198,171101.spr1467,937
171101.spr0198,171101.spr1807,867
171101.spr0198,171101.spr1881,738
171101.spr0198,171101.spr1943,867
171101.spr0198,171101.spr2009,867
171101.spr0198,171101.spr2011,870
171101.spr0198,171101.spr2020,937
171101.spr0199,171101.spr0200,937
171101.spr0199,171101.spr0201,937
171101.spr0199,171101.spr0202,867
171101.spr0199,171101.spr0203,867
171101.spr0199,171101.spr0204,937
171101.spr0199,171101.spr0205,937
171101.spr0199,171101.spr0206,867
171101.spr0199,171101.spr0207,937
171101.spr0199,171101.spr0208,937
171101.spr0199,171101.spr0212,868
171101.spr0199,171101.spr0213,867
171101.spr0199,171101.spr0214,867
171101.spr0199,171101.spr0216,937
171101.spr0199,171101.spr0248,867
171101.spr0199,171101.spr0249,867
171101.spr0199,171101.spr0271,870
171101.spr0199,171101.spr0272,867
171101.spr0199,171101.spr0398,870
171101.spr0199,171101.spr0480,781
171101.spr0199,171101.spr0555,937
171101.spr0199,171101.spr0556,937
171101.spr0199,171101.spr0682,867
171101.spr0199,171101.spr0740,867
171101.spr0199,171101.spr0862,937
171101.spr0199,171101.spr0863,937
171101.spr0199,171101.spr1012,869
171101.spr0199,171101.spr1014,937
171101.spr0199,171101.spr1171,937
171101.spr0199,171101.spr1177,868
171101.spr0199,171101.spr1211,869
171101.spr0199,171101.spr1212,937
171101.spr0199,171101.spr1271,867
171101.spr0199,171101.spr1394,867
171101.spr0199,171101.spr1396,867
171101.spr0199,171101.spr1467,867
171101.spr0199,171101.spr1807,869
171101.spr0199,171101.spr1881,773
171101.spr0199,171101.spr1943,869
171101.spr0199,171101.spr2009,937
171101.spr0199,171101.spr2020,867
171101.spr0200,171101.spr0201,937
171101.spr0200,171101.spr0202,867
171101.spr0200,171101.spr0203,867
171101.spr0200,171101.spr0204,937
171101.spr0200,171101.spr0205,937
171101.spr0200,171101.spr0206,867
171101.spr0200,171101.spr0207,937
171101.spr0200,171101.spr0208,937
171101.spr0200,171101.spr0212,868
171101.spr0200,171101.spr0213,867
171101.spr0200,171101.spr0214,867
171101.spr0200,171101.spr0216,937
171101.spr0200,171101.spr0248,867
171101.spr0200,171101.spr0249,867
171101.spr0200,171101.spr0250,726
171101.spr0200,171101.spr0271,870
171101.spr0200,171101.spr0272,867
171101.spr0200,171101.spr0398,870
171101.spr0200,171101.spr0480,746
171101.spr0200,171101.spr0555,937
171101.spr0200,171101.spr0556,937
171101.spr0200,171101.spr0682,867
171101.spr0200,171101.spr0740,867
171101.spr0200,171101.spr0846,774
171101.spr0200,171101.spr0862,937
171101.spr0200,171101.spr0863,937
171101.spr0200,171101.spr0924,754
171101.spr0200,171101.spr1012,869
171101.spr0200,171101.spr1014,937
171101.spr0200,171101.spr1171,937
171101.spr0200,171101.spr1177,868
171101.spr0200,171101.spr1211,869
171101.spr0200,171101.spr1212,937
171101.spr0200,171101.spr1271,867
171101.spr0200,171101.spr1394,867
171101.spr0200,171101.spr1396,867
171101.spr0200,171101.spr1467,867
171101.spr0200,171101.spr1807,869
171101.spr0200,171101.spr1943,869
171101.spr0200,171101.spr2009,937
171101.spr0200,171101.spr2020,867
171101.spr0201,171101.spr0202,867
171101.spr0201,171101.spr0203,867
171101.spr0201,171101.spr0204,937
171101.spr0201,171101.spr0205,937
171101.spr0201,171101.spr0206,867
171101.spr0201,171101.spr0207,937
171101.spr0201,171101.spr0208,937
171101.spr0201,171101.spr0212,868
171101.spr0201,171101.spr0213,867
171101.spr0201,171101.spr0214,867
171101.spr0201,171101.spr0216,937
171101.spr0201,171101.spr0248,867
171101.spr0201,171101.spr0249,867
171101.spr0201,171101.spr0271,870
171101.spr0201,171101.spr0272,867
171101.spr0201,171101.spr0398,870
171101.spr0201,171101.spr0480,800
171101.spr0201,171101.spr0555,937
171101.spr0201,171101.spr0556,937
171101.spr0201,171101.spr0682,867
171101.spr0201,171101.spr0740,867
171101.spr0201,171101.spr0862,937
171101.spr0201,171101.spr0863,937
171101.spr0201,171101.spr1012,869
171101.spr0201,171101.spr1014,937
171101.spr0201,171101.spr1171,937
171101.spr0201,171101.spr1177,868
171101.spr0201,171101.spr1211,869
171101.spr0201,171101.spr1212,937
171101.spr0201,171101.spr1271,867
171101.spr0201,171101.spr1394,867
171101.spr0201,171101.spr1396,867
171101.spr0201,171101.spr1467,867
171101.spr0201,171101.spr1807,869
171101.spr0201,171101.spr1881,737
171101.spr0201,171101.spr1943,869
171101.spr0201,171101.spr2009,937
171101.spr0201,171101.spr2020,867
171101.spr0202,171101.spr0203,869
171101.spr0202,171101.spr0204,867
171101.spr0202,171101.spr0205,867
171101.spr0202,171101.spr0206,869
171101.spr0202,171101.spr0207,867
171101.spr0202,171101.spr0208,867
171101.spr0202,171101.spr0212,806
171101.spr0202,171101.spr0213,869
171101.spr0202,171101.spr0214,869
171101.spr0202,171101.spr0216,867
171101.spr0202,171101.spr0248,869
171101.spr0202,171101.spr0249,869
171101.spr0202,171101.spr0250,812
171101.spr0202,171101.spr0271,867
171101.spr0202,171101.spr0272,869
171101.spr0202,171101.spr0398,867
171101.spr0202,171101.spr0480,724
171101.spr0202,171101.spr0481,754
171101.spr0202,171101.spr0555,867
171101.spr0202,171101.spr0556,808
171101.spr0202,171101.spr0682,869
171101.spr0202,171101.spr0740,869
171101.spr0202,171101.spr0846,801
171101.spr0202,171101.spr0862,867
171101.spr0202,171101.spr0863,867
171101.spr0202,171101.spr0924,801
171101.spr0202,171101.spr1012,867
171101.spr0202,171101.spr1014,867
171101.spr0202,171101.spr1171,867
171101.spr0202,171101.spr1211,867
171101.spr0202,171101.spr1212,867
171101.spr0202,171101.spr1271,869
171101.spr0202,171101.spr1394,869
171101.spr0202,171101.spr1396,869
171101.spr0202,171101.spr1467,869
171101.spr0202,171101.spr1807,867
171101.spr0202,171101.spr1881,778
171101.spr0202,171101.spr1943,867
171101.spr0202,171101.spr2009,867
171101.spr0202,171101.spr2020,869
171101.spr0203,171101.spr0204,867
171101.spr0203,171101.spr0205,867
171101.spr0203,171101.spr0206,937
171101.spr0203,171101.spr0207,867
171101.spr0203,171101.spr0208,867
171101.spr0203,171101.spr0213,869
171101.spr0203,171101.spr0214,937
171101.spr0203,171101.spr0216,867
171101.spr0203,171101.spr0248,869
171101.spr0203,171101.spr0249,937
171101.spr0203,171101.spr0271,867
171101.spr0203,171101.spr0272,937
171101.spr0203,171101.spr0398,867
171101.spr0203,171101.spr0480,788
171101.spr0203,171101.spr0555,867
171101.spr0203,171101.spr0556,843
171101.spr0203,171101.spr0682,869
171101.spr0203,171101.spr0740,869
171101.spr0203,171101.spr0764,707
171101.spr0203,171101.spr0862,867
171101.spr0203,171101.spr0863,867
171101.spr0203,171101.spr1012,867
171101.spr0203,171101.spr1014,867
171101.spr0203,171101.spr1171,867
171101.spr0203,171101.spr1211,825
171101.spr0203,171101.spr1212,867
171101.spr0203,171101.spr1271,869
171101.spr0203,171101.spr1394,937
171101.spr0203,171101.spr1396,937
171101.spr0203,171101.spr1467,937
171101.spr0203,171101.spr1807,867
171101.spr0203,171101.spr1943,867
171101.spr0203,171101.spr2009,867
171101.spr0203,171101.spr2011,870
171101.spr0203,171101.spr2020,937
171101.spr0204,171101.spr0205,937
171101.spr0204,171101.spr0206,867
171101.spr0204,171101.spr0207,937
171101.spr0204,171101.spr0208,937
171101.spr0204,171101.spr0212,868
171101.spr0204,171101.spr0213,867
171101.spr0204,171101.spr0214,867
171101.spr0204,171101.spr0216,937
171101.spr0204,171101.spr0248,867
171101.spr0204,171101.spr0249,867
171101.spr0204,171101.spr0271,870
171101.spr0204,171101.spr0272,867
171101.spr0204,171101.spr0398,870
171101.spr0204,171101.spr0480,791
171101.spr0204,171101.spr0555,937
171101.spr0204,171101.spr0556,937
171101.spr0204,171101.spr0682,867
171101.spr0204,171101.spr0740,867
171101.spr0204,171101.spr0862,937
171101.spr0204,171101.spr0863,937
171101.spr0204,171101.spr1012,869
171101.spr0204,171101.spr1014,937
171101.spr0204,171101.spr1171,937
171101.spr0204,171101.spr1177,868
171101.spr0204,171101.spr1211,869
171101.spr0204,171101.spr1212,937
171101.spr0204,171101.spr1271,867
171101.spr0204,171101.spr1394,867
171101.spr0204,171101.spr1396,867
171101.spr0204,171101.spr1467,867
171101.spr0204,171101.spr1807,869
171101.spr0204,171101.spr1881,737
171101.spr0204,171101.spr1943,869
171101.spr0204,171101.spr2009,937
171101.spr0204,171101.spr2020,867
171101.spr0205,171101.spr0206,867
171101.spr0205,171101.spr0207,937
171101.spr0205,171101.spr0208,937
171101.spr0205,171101.spr0212,868
171101.spr0205,171101.spr0213,867
171101.spr0205,171101.spr0214,867
171101.spr0205,171101.spr0216,937
171101.spr0205,171101.spr0248,867
171101.spr0205,171101.spr0249,867
171101.spr0205,171101.spr0271,870
171101.spr0205,171101.spr0272,867
171101.spr0205,171101.spr0398,870
171101.spr0205,171101.spr0480,800
171101.spr0205,171101.spr0555,937
171101.spr0205,171101.spr0556,937
171101.spr0205,171101.spr0682,867
171101.spr0205,171101.spr0740,867
171101.spr0205,171101.spr0764,707
171101.spr0205,171101.spr0862,937
171101.spr0205,171101.spr0863,937
171101.spr0205,171101.spr1012,869
171101.spr0205,171101.spr1014,937
171101.spr0205,171101.spr1171,937
171101.spr0205,171101.spr1177,868
171101.spr0205,171101.spr1211,869
171101.spr0205,171101.spr1212,937
171101.spr0205,171101.spr1271,867
171101.spr0205,171101.spr1394,867
171101.spr0205,171101.spr1396,867
171101.spr0205,171101.spr1467,867
171101.spr0205,171101.spr1807,869
171101.spr0205,171101.spr1943,869
171101.spr0205,171101.spr2009,937
171101.spr0205,171101.spr2020,867
171101.spr0206,171101.spr0207,867
171101.spr0206,171101.spr0208,867
171101.spr0206,171101.spr0212,849
171101.spr0206,171101.spr0213,869
171101.spr0206,171101.spr0214,937
171101.spr0206,171101.spr0216,867
171101.spr0206,171101.spr0248,869
171101.spr0206,171101.spr0249,937
171101.spr0206,171101.spr0250,817
171101.spr0206,171101.spr0271,867
171101.spr0206,171101.spr0272,937
171101.spr0206,171101.spr0398,867
171101.spr0206,171101.spr0480,738
171101.spr0206,171101.spr0481,737
171101.spr0206,171101.spr0555,867
171101.spr0206,171101.spr0556,867
171101.spr0206,171101.spr0682,869
171101.spr0206,171101.spr0740,869
171101.spr0206,171101.spr0764,738
171101.spr0206,171101.spr0846,789
171101.spr0206,171101.spr0862,867
171101.spr0206,171101.spr0863,867
171101.spr0206,171101.spr0924,789
171101.spr0206,171101.spr1012,867
171101.spr0206,171101.spr1014,867
171101.spr0206,171101.spr1171,867
171101.spr0206,171101.spr1211,867
171101.spr0206,171101.spr1212,867
171101.spr0206,171101.spr1271,869
171101.spr0206,171101.spr1394,937
171101.spr0206,171101.spr1396,937
171101.spr0206,171101.spr1467,937
171101.spr0206,171101.spr1807,867
171101.spr0206,171101.spr1943,867
171101.spr0206,171101.spr2009,867
171101.spr0206,171101.spr2011,870
171101.spr0206,171101.spr2020,937
171101.spr0207,171101.spr0208,937
171101.spr0207,171101.spr0212,868
171101.spr0207,171101.spr0213,867
171101.spr0207,171101.spr0214,867
171101.spr0207,171101.spr0216,937
171101.spr0207,171101.spr0248,867
171101.spr0207,171101.spr0249,867
171101.spr0207,171101.spr0271,870
171101.spr0207,171101.spr0272,867
171101.spr0207,171101.spr0398,870
171101.spr0207,171101.spr0480,778
171101.spr0207,171101.spr0555,937
171101.spr0207,171101.spr0556,937
171101.spr0207,171101.spr0682,867
171101.spr0207,171101.spr0740,867
171101.spr0207,171101.spr0764,707
171101.spr0207,171101.spr0862,937
171101.spr0207,171101.spr0863,937
171101.spr0207,171101.spr1012,869
171101.spr0207,171101.spr1014,937
171101.spr0207,171101.spr1171,937
171101.spr0207,171101.spr1177,868
171101.spr0207,171101.spr1211,869
171101.spr0207,171101.spr1212,937
171101.spr0207,171101.spr1271,867
171101.spr0207,171101.spr1394,867
171101.spr0207,171101.spr1396,867
171101.spr0207,171101.spr1467,867
171101.spr0207,171101.spr1807,869
171101.spr0207,171101.spr1943,869
171101.spr0207,171101.spr2009,937
171101.spr0207,171101.spr2020,867
171101.spr0208,171101.spr0212,868
171101.spr0208,171101.spr0213,867
171101.spr0208,171101.spr0214,867
171101.spr0208,171101.spr0216,937
171101.spr0208,171101.spr0248,867
171101.spr0208,171101.spr0249,867
171101.spr0208,171101.spr0271,870
171101.spr0208,171101.spr0272,867
171101.spr0208,171101.spr0398,870
171101.spr0208,171101.spr0555,937
171101.spr0208,171101.spr0556,937
171101.spr0208,171101.spr0682,867
171101.spr0208,171101.spr0740,867
171101.spr0208,171101.spr0862,937
171101.spr0208,171101.spr0863,937
171101.spr0208,171101.spr1012,869
171101.spr0208,171101.spr1014,937
171101.spr0208,171101.spr1171,937
171101.spr0208,171101.spr1177,868
171101.spr0208,171101.spr1211,837
171101.spr0208,171101.spr1212,937
171101.spr0208,171101.spr1271,867
171101.spr0208,171101.spr1394,867
171101.spr0208,171101.spr1396,867
171101.spr0208,171101.spr1467,867
171101.spr0208,171101.spr1807,869
171101.spr0208,171101.spr1943,869
171101.spr0208,171101.spr2009,937
171101.spr0208,171101.spr2020,867
171101.spr0209,171101.spr0296,827
171101.spr0209,171101.spr0877,972
171101.spr0209,171101.spr1123,920
171101.spr0209,171101.spr1166,920
171101.spr0209,171101.spr1544,972
171101.spr0209,171101.spr1790,920
171101.spr0209,171101.spr1821,972
171101.spr0209,171101.spr1840,827
171101.spr0209,171101.spr1852,900
171101.spr0211,171101.spr0213,856
171101.spr0211,171101.spr0214,830
171101.spr0212,171101.spr0214,842
171101.spr0212,171101.spr0216,868
171101.spr0212,171101.spr0248,736
171101.spr0212,171101.spr0271,868
171101.spr0212,171101.spr0272,856
171101.spr0212,171101.spr0398,868
171101.spr0212,171101.spr0555,868
171101.spr0212,171101.spr0556,774
171101.spr0212,171101.spr0682,833
171101.spr0212,171101.spr0862,868
171101.spr0212,171101.spr0863,868
171101.spr0212,171101.spr1012,868
171101.spr0212,171101.spr1014,868
171101.spr0212,171101.spr1171,868
171101.spr0212,171101.spr1177,815
171101.spr0212,171101.spr1211,868
171101.spr0212,171101.spr1212,868
171101.spr0212,171101.spr1396,856
171101.spr0212,171101.spr1467,848
171101.spr0212,171101.spr1807,867
171101.spr0212,171101.spr1943,868
171101.spr0212,171101.spr2009,868
171101.spr0212,171101.spr2020,848
171101.spr0213,171101.spr0214,869
171101.spr0213,171101.spr0216,867
171101.spr0213,171101.spr0248,869
171101.spr0213,171101.spr0249,869
171101.spr0213,171101.spr0271,867
171101.spr0213,171101.spr0272,869
171101.spr0213,171101.spr0398,867
171101.spr0213,171101.spr0480,792
171101.spr0213,171101.spr0481,827
171101.spr0213,171101.spr0555,867
171101.spr0213,171101.spr0556,820
171101.spr0213,171101.spr0682,869
171101.spr0213,171101.spr0740,869
171101.spr0213,171101.spr0764,737
171101.spr0213,171101.spr0862,867
171101.spr0213,171101.spr0863,867
171101.spr0213,171101.spr1012,867
171101.spr0213,171101.spr1014,867
171101.spr0213,171101.spr1171,867
171101.spr0213,171101.spr1211,801
171101.spr0213,171101.spr1212,867
171101.spr0213,171101.spr1271,869
171101.spr0213,171101.spr1394,869
171101.spr0213,171101.spr1396,869
171101.spr0213,171101.spr1467,869
171101.spr0213,171101.spr1807,867
171101.spr0213,171101.spr1881,778
171101.spr0213,171101.spr1943,867
171101.spr0213,171101.spr2009,867
171101.spr0213,171101.spr2020,869
171101.spr0214,171101.spr0216,867
171101.spr0214,171101.spr0248,869
171101.spr0214,171101.spr0249,937
171101.spr0214,171101.spr0250,797
171101.spr0214,171101.spr0271,867
171101.spr0214,171101.spr0272,937
171101.spr0214,171101.spr0398,867
171101.spr0214,171101.spr0481,754
171101.spr0214,171101.spr0555,867
171101.spr0214,171101.spr0556,810
171101.spr0214,171101.spr0682,869
171101.spr0214,171101.spr0740,869
171101.spr0214,171101.spr0764,707
171101.spr0214,171101.spr0846,813
171101.spr0214,171101.spr0862,867
171101.spr0214,171101.spr0863,867
171101.spr0214,171101.spr0924,801
171101.spr0214,171101.spr1012,867
171101.spr0214,171101.spr1014,867
171101.spr0214,171101.spr1171,867
171101.spr0214,171101.spr1211,825
171101.spr0214,171101.spr1212,867
171101.spr0214,171101.spr1271,869
171101.spr0214,171101.spr1394,937
171101.spr0214,171101.spr1396,937
171101.spr0214,171101.spr1467,937
171101.spr0214,171101.spr1807,867
171101.spr0214,171101.spr1943,867
171101.spr0214,171101.spr2009,867
171101.spr0214,171101.spr2011,870
171101.spr0214,171101.spr2020,937
171101.spr0215,171101.spr0250,851
171101.spr0215,171101.spr0437,831
171101.spr0215,171101.spr1582,972
171101.spr0215,171101.spr1776,972
171101.spr0215,171101.spr1777,972
171101.spr0216,171101.spr0248,867
171101.spr0216,171101.spr0249,867
171101.spr0216,171101.spr0250,789
171101.spr0216,171101.spr0271,870
171101.spr0216,171101.spr0272,867
171101.spr0216,171101.spr0398,870
171101.spr0216,171101.spr0555,937
171101.spr0216,171101.spr0556,937
171101.spr0216,171101.spr0682,867
171101.spr0216,171101.spr0740,867
171101.spr0216,171101.spr0764,728
171101.spr0216,171101.spr0846,813
171101.spr0216,171101.spr0862,937
171101.spr0216,171101.spr0863,937
171101.spr0216,171101.spr0924,801
171101.spr0216,171101.spr1012,869
171101.spr0216,171101.spr1014,937
171101.spr0216,171101.spr1171,937
171101.spr0216,171101.spr1177,868
171101.spr0216,171101.spr1211,869
171101.spr0216,171101.spr1212,937
171101.spr0216,171101.spr1271,867
171101.spr0216,171101.spr1394,867
171101.spr0216,171101.spr1396,867
171101.spr0216,171101.spr1467,867
171101.spr0216,171101.spr1807,869
171101.spr0216,171101.spr1943,869
171101.spr0216,171101.spr2009,937
171101.spr0216,171101.spr2020,867
171101.spr0219,171101.spr0887,800
171101.spr0219,171101.spr1499,828
171101.spr0220,171101.spr0221,800
171101.spr0220,171101.spr0222,810
171101.spr0220,171101.spr1643,800
171101.spr0220,171101.spr1644,810
171101.spr0220,171101.spr1645,810
171101.spr0221,171101.spr0222,809
171101.spr0221,171101.spr1643,800
171101.spr0221,171101.spr1644,809
171101.spr0221,171101.spr1645,810
171101.spr0222,171101.spr1643,810
171101.spr0222,171101.spr1644,800
171101.spr0222,171101.spr1645,810
171101.spr0229,171101.spr0230,879
171101.spr0229,171101.spr0231,883
171101.spr0229,171101.spr0278,879
171101.spr0229,171101.spr0280,800
171101.spr0229,171101.spr0282,883
171101.spr0229,171101.spr0421,883
171101.spr0229,171101.spr0425,800
171101.spr0229,171101.spr1070,800
171101.spr0229,171101.spr1834,883
171101.spr0229,171101.spr1835,884
171101.spr0229,171101.spr1836,800
171101.spr0230,171101.spr0231,863
171101.spr0230,171101.spr0278,800
171101.spr0230,171101.spr0280,879
171101.spr0230,171101.spr0282,818
171101.spr0230,171101.spr0421,818
171101.spr0230,171101.spr1834,818
171101.spr0230,171101.spr1835,800
171101.spr0230,171101.spr1836,852
171101.spr0231,171101.spr0278,818
171101.spr0231,171101.spr0280,883
171101.spr0231,171101.spr0282,800
171101.spr0231,171101.spr0421,812
171101.spr0231,171101.spr1834,800
171101.spr0231,171101.spr1835,824
171101.spr0231,171101.spr1836,883
171101.spr0232,171101.spr0415,807
171101.spr0232,171101.spr1048,879
171101.spr0232,171101.spr1049,827
171101.spr0232,171101.spr1050,801
171101.spr0232,171101.spr1051,813
171101.spr0233,171101.spr1841,773
171101.spr0244,171101.spr0276,813
171101.spr0244,171101.spr0506,813
171101.spr0245,171101.spr1272,920
171101.spr0247,171101.spr0948,826
171101.spr0247,171101.spr1239,824
171101.spr0248,171101.spr0249,869
171101.spr0248,171101.spr0250,722
171101.spr0248,171101.spr0271,867
171101.spr0248,171101.spr0272,869
171101.spr0248,171101.spr0398,867
171101.spr0248,171101.spr0480,760
171101.spr0248,171101.spr0481,754
171101.spr0248,171101.spr0555,867
171101.spr0248,171101.spr0556,808
171101.spr0248,171101.spr0682,869
171101.spr0248,171101.spr0740,869
171101.spr0248,171101.spr0846,790
171101.spr0248,171101.spr0862,867
171101.spr0248,171101.spr0863,867
171101.spr0248,171101.spr0924,789
171101.spr0248,171101.spr1012,867
171101.spr0248,171101.spr1014,867
171101.spr0248,171101.spr1171,867
171101.spr0248,171101.spr1211,801
171101.spr0248,171101.spr1212,867
171101.spr0248,171101.spr1271,869
171101.spr0248,171101.spr1394,869
171101.spr0248,171101.spr1396,869
171101.spr0248,171101.spr1467,869
171101.spr0248,171101.spr1807,867
171101.spr0248,171101.spr1943,867
171101.spr0248,171101.spr2009,867
171101.spr0248,171101.spr2020,869
171101.spr0249,171101.spr0271,867
171101.spr0249,171101.spr0272,937
171101.spr0249,171101.spr0398,867
171101.spr0249,171101.spr0480,778
171101.spr0249,171101.spr0481,754
171101.spr0249,171101.spr0555,867
171101.spr0249,171101.spr0556,829
171101.spr0249,171101.spr0682,869
171101.spr0249,171101.spr0740,869
171101.spr0249,171101.spr0764,707
171101.spr0249,171101.spr0862,867
171101.spr0249,171101.spr0863,867
171101.spr0249,171101.spr0924,801
171101.spr0249,171101.spr1012,867
171101.spr0249,171101.spr1014,867
171101.spr0249,171101.spr1171,867
171101.spr0249,171101.spr1211,867
171101.spr0249,171101.spr1212,867
171101.spr0249,171101.spr1271,869
171101.spr0249,171101.spr1394,937
171101.spr0249,171101.spr1396,937
171101.spr0249,171101.spr1467,937
171101.spr0249,171101.spr1807,867
171101.spr0249,171101.spr1943,867
171101.spr0249,171101.spr2009,867
171101.spr0249,171101.spr2011,870
171101.spr0249,171101.spr2020,937
171101.spr0250,171101.spr0271,801
171101.spr0250,171101.spr0272,813
171101.spr0250,171101.spr0555,724
171101.spr0250,171101.spr0556,802
171101.spr0250,171101.spr0682,756
171101.spr0250,171101.spr0863,789
171101.spr0250,171101.spr1012,801
171101.spr0250,171101.spr1014,789
171101.spr0250,171101.spr1171,789
171101.spr0250,171101.spr1211,749
171101.spr0250,171101.spr1396,842
171101.spr0250,171101.spr1467,789
171101.spr0250,171101.spr1777,775
171101.spr0250,171101.spr1943,801
171101.spr0250,171101.spr2009,723
171101.spr0250,171101.spr2020,815
171101.spr0251,171101.spr0673,896
171101.spr0251,171101.spr0769,920
171101.spr0251,171101.spr0795,858
171101.spr0251,171101.spr0836,892
171101.spr0251,171101.spr0896,824
171101.spr0252,171101.spr1103,756
171101.spr0259,171101.spr0260,920
171101.spr0259,171101.spr0261,920
171101.spr0259,171101.spr1967,800
171101.spr0259,171101.spr1968,822
171101.spr0259,171101.spr1969,850
171101.spr0259,171101.spr1970,850
171101.spr0260,171101.spr0261,920
171101.spr0260,171101.spr1967,822
171101.spr0260,171101.spr1968,800
171101.spr0260,171101.spr1969,850
171101.spr0260,171101.spr1970,850
171101.spr0261,171101.spr0647,759
171101.spr0261,171101.spr1063,870
171101.spr0261,171101.spr1967,880
171101.spr0261,171101.spr1968,880
171101.spr0262,171101.spr1670,830
171101.spr0262,171101.spr1837,920
171101.spr0262,171101.spr1866,830
171101.spr0271,171101.spr0272,867
171101.spr0271,171101.spr0398,870
171101.spr0271,171101.spr0555,870
171101.spr0271,171101.spr0556,870
171101.spr0271,171101.spr0682,867
171101.spr0271,171101.spr0740,867
171101.spr0271,171101.spr0846,789
171101.spr0271,171101.spr0862,870
171101.spr0271,171101.spr0863,870
171101.spr0271,171101.spr0924,801
171101.spr0271,171101.spr1012,869
171101.spr0271,171101.spr1014,870
171101.spr0271,171101.spr1171,870
171101.spr0271,171101.spr1177,868
171101.spr0271,171101.spr1211,869
171101.spr0271,171101.spr1212,870
171101.spr0271,171101.spr1271,867
171101.spr0271,171101.spr1394,867
171101.spr0271,171101.spr1396,867
171101.spr0271,171101.spr1467,867
171101.spr0271,171101.spr1807,869
171101.spr0271,171101.spr1943,869
171101.spr0271,171101.spr2009,870
171101.spr0271,171101.spr2020,867
171101.spr0272,171101.spr0398,867
171101.spr0272,171101.spr0555,867
171101.spr0272,171101.spr0556,794
171101.spr0272,171101.spr0682,869
171101.spr0272,171101.spr0740,869
171101.spr0272,171101.spr0846,789
171101.spr0272,171101.spr0862,867
171101.spr0272,171101.spr0863,867
171101.spr0272,171101.spr0924,773
171101.spr0272,171101.spr1012,867
171101.spr0272,171101.spr1014,867
171101.spr0272,171101.spr1171,867
171101.spr0272,171101.spr1211,812
171101.spr0272,171101.spr1212,867
171101.spr0272,171101.spr1271,869
171101.spr0272,171101.spr1394,937
171101.spr0272,171101.spr1396,937
171101.spr0272,171101.spr1467,937
171101.spr0272,171101.spr1807,867
171101.spr0272,171101.spr1943,867
171101.spr0272,171101.spr2009,867
171101.spr0272,171101.spr2011,870
171101.spr0272,171101.spr2020,937
171101.spr0276,171101.spr0506,800
171101.spr0278,171101.spr0280,879
171101.spr0278,171101.spr0282,818
171101.spr0278,171101.spr0421,818
171101.spr0278,171101.spr1834,818
171101.spr0278,171101.spr1835,800
171101.spr0278,171101.spr1836,879
171101.spr0280,171101.spr0282,883
171101.spr0280,171101.spr0421,883
171101.spr0280,171101.spr0425,800
171101.spr0280,171101.spr1070,800
171101.spr0280,171101.spr1834,883
171101.spr0280,171101.spr1835,879
171101.spr0280,171101.spr1836,800
171101.spr0282,171101.spr0421,800
171101.spr0282,171101.spr1834,800
171101.spr0282,171101.spr1835,824
171101.spr0282,171101.spr1836,883
171101.spr0291,171101.spr0293,862
171101.spr0291,171101.spr0294,858
171101.spr0291,171101.spr0295,850
171101.spr0293,171101.spr0294,850
171101.spr0293,171101.spr0295,854
171101.spr0294,171101.spr0295,863
171101.spr0296,171101.spr0877,827
171101.spr0296,171101.spr1123,827
171101.spr0296,171101.spr1166,827
171101.spr0296,171101.spr1544,827
171101.spr0296,171101.spr1790,819
171101.spr0296,171101.spr1821,827
171101.spr0296,171101.spr1840,800
171101.spr0296,171101.spr1852,819
171101.spr0304,171101.spr0329,869
171101.spr0304,171101.spr0554,801
171101.spr0304,171101.spr0776,919
171101.spr0304,171101.spr1517,904
171101.spr0304,171101.spr1823,869
171101.spr0327,171101.spr1191,819
171101.spr0327,171101.spr1192,817
171101.spr0327,171101.spr1193,820
171101.spr0327,171101.spr1194,819
171101.spr0329,171101.spr0554,808
171101.spr0329,171101.spr0776,830
171101.spr0329,171101.spr1517,869
171101.spr0329,171101.spr1823,820
171101.spr0329,171101.spr1909,811
171101.spr0356,171101.spr0358,900
171101.spr0358,171101.spr0780,738
171101.spr0363,171101.spr1040,749
171101.spr0365,171101.spr1044,815
171101.spr0368,171101.spr1888,831
171101.spr0377,171101.spr0382,800
171101.spr0380,171101.spr0381,958
171101.spr0380,171101.spr0701,832
171101.spr0381,171101.spr0701,829
171101.spr0382,171101.spr0387,783
171101.spr0383,171101.spr0385,972
171101.spr0383,171101.spr0386,919
171101.spr0383,171101.spr0387,868
171101.spr0385,171101.spr0386,920
171101.spr0385,171101.spr0387,884
171101.spr0386,171101.spr0387,967
171101.spr0393,171101.spr0394,972
171101.spr0393,171101.spr0395,972
171101.spr0394,171101.spr0395,972
171101.spr0398,171101.spr0555,870
171101.spr0398,171101.spr0556,840
171101.spr0398,171101.spr0682,867
171101.spr0398,171101.spr0740,867
171101.spr0398,171101.spr0862,870
171101.spr0398,171101.spr0863,870
171101.spr0398,171101.spr1012,869
171101.spr0398,171101.spr1014,870
171101.spr0398,171101.spr1171,870
171101.spr0398,171101.spr1177,868
171101.spr0398,171101.spr1211,846
171101.spr0398,171101.spr1212,870
171101.spr0398,171101.spr1271,867
171101.spr0398,171101.spr1394,867
171101.spr0398,171101.spr1396,867
171101.spr0398,171101.spr1467,867
171101.spr0398,171101.spr1807,869
171101.spr0398,171101.spr1943,869
171101.spr0398,171101.spr2009,870
171101.spr0398,171101.spr2020,867
171101.spr0401,171101.spr0402,899
171101.spr0408,171101.spr0409,860
171101.spr0413,171101.spr0434,876
171101.spr0415,171101.spr1048,879
171101.spr0415,171101.spr1049,827
171101.spr0415,171101.spr1050,801
171101.spr0415,171101.spr1051,813
171101.spr0421,171101.spr1834,801
171101.spr0421,171101.spr1835,824
171101.spr0421,171101.spr1836,883
171101.spr0423,171101.spr0425,958
171101.spr0423,171101.spr1070,958
171101.spr0423,171101.spr1071,800
171101.spr0424,171101.spr1069,800
171101.spr0425,171101.spr1070,839
171101.spr0425,171101.spr1071,958
171101.spr0425,171101.spr1836,800
171101.spr0430,171101.spr0431,863
171101.spr0430,171101.spr0632,800
171101.spr0430,171101.spr0633,863
171101.spr0430,171101.spr0691,814
171101.spr0430,171101.spr1292,863
171101.spr0430,171101.spr1293,800
171101.spr0430,171101.spr2024,873
171101.spr0430,171101.spr2025,800
171101.spr0430,171101.spr2026,802
171101.spr0431,171101.spr0632,863
171101.spr0431,171101.spr0633,800
171101.spr0431,171101.spr0691,819
171101.spr0431,171101.spr1292,800
171101.spr0431,171101.spr1293,863
171101.spr0431,171101.spr2024,800
171101.spr0431,171101.spr2025,863
171101.spr0431,171101.spr2026,863
171101.spr0437,171101.spr1582,823
171101.spr0437,171101.spr1776,880
171101.spr0437,171101.spr1777,831
171101.spr0438,171101.spr1777,711
171101.spr0441,171101.spr1432,812
171101.spr0441,171101.spr1499,769
171101.spr0441,171101.spr1825,808
171101.spr0454,171101.spr0455,817
171101.spr0478,171101.spr1777,806
171101.spr0480,171101.spr0555,737
171101.spr0480,171101.spr0556,736
171101.spr0480,171101.spr1212,738
171101.spr0480,171101.spr1467,736
171101.spr0480,171101.spr2020,740
171101.spr0481,171101.spr2020,754
171101.spr0505,171101.spr0668,870
171101.spr0505,171101.spr1528,870
171101.spr0505,171101.spr1566,870
171101.spr0505,171101.spr1699,870
171101.spr0507,171101.spr0509,972
171101.spr0514,171101.spr0671,738
171101.spr0530,171101.spr0797,738
171101.spr0530,171101.spr1432,793
171101.spr0532,171101.spr0533,863
171101.spr0532,171101.spr0534,864
171101.spr0533,171101.spr0534,861
171101.spr0543,171101.spr1118,745
171101.spr0554,171101.spr0776,832
171101.spr0554,171101.spr1517,800
171101.spr0554,171101.spr1823,808
171101.spr0555,171101.spr0556,937
171101.spr0555,171101.spr0665,753
171101.spr0555,171101.spr0682,867
171101.spr0555,171101.spr0740,867
171101.spr0555,171101.spr0862,937
171101.spr0555,171101.spr0863,937
171101.spr0555,171101.spr1012,869
171101.spr0555,171101.spr1014,937
171101.spr0555,171101.spr1171,937
171101.spr0555,171101.spr1177,868
171101.spr0555,171101.spr1211,869
171101.spr0555,171101.spr1212,937
171101.spr0555,171101.spr1271,835
171101.spr0555,171101.spr1394,867
171101.spr0555,171101.spr1396,867
171101.spr0555,171101.spr1467,867
171101.spr0555,171101.spr1807,869
171101.spr0555,171101.spr1943,869
171101.spr0555,171101.spr2009,937
171101.spr0555,171101.spr2020,867
171101.spr0556,171101.spr0682,803
171101.spr0556,171101.spr0740,774
171101.spr0556,171101.spr0846,773
171101.spr0556,171101.spr0862,919
171101.spr0556,171101.spr0863,937
171101.spr0556,171101.spr1012,869
171101.spr0556,171101.spr1014,923
171101.spr0556,171101.spr1171,937
171101.spr0556,171101.spr1177,752
171101.spr0556,171101.spr1211,845
171101.spr0556,171101.spr1212,937
171101.spr0556,171101.spr1394,867
171101.spr0556,171101.spr1396,858
171101.spr0556,171101.spr1467,802
171101.spr0556,171101.spr1807,869
171101.spr0556,171101.spr1943,869
171101.spr0556,171101.spr2009,937
171101.spr0556,171101.spr2020,843
171101.spr0562,171101.spr0563,819
171101.spr0562,171101.spr0564,839
171101.spr0562,171101.spr1080,819
171101.spr0562,171101.spr1081,800
171101.spr0563,171101.spr0564,813
171101.spr0563,171101.spr1080,800
171101.spr0563,171101.spr1081,819
171101.spr0564,171101.spr1080,813
171101.spr0564,171101.spr1081,808
171101.spr0582,171101.spr1636,738
171101.spr0613,171101.spr0614,870
171101.spr0629,171101.spr0636,800
171101.spr0630,171101.spr0637,800
171101.spr0632,171101.spr0633,863
171101.spr0632,171101.spr0691,814
171101.spr0632,171101.spr1292,863
171101.spr0632,171101.spr1293,800
171101.spr0632,171101.spr2024,873
171101.spr0632,171101.spr2025,800
171101.spr0632,171101.spr2026,802
171101.spr0633,171101.spr0691,819
171101.spr0633,171101.spr1292,800
171101.spr0633,171101.spr1293,863
171101.spr0633,171101.spr2024,800
171101.spr0633,171101.spr2025,863
171101.spr0633,171101.spr2026,863
171101.spr0655,171101.spr1156,911
171101.spr0659,171101.spr0660,879
171101.spr0659,171101.spr0661,879
171101.spr0659,171101.spr0662,879
171101.spr0659,171101.spr0663,879
171101.spr0660,171101.spr0661,952
171101.spr0660,171101.spr0662,879
171101.spr0660,171101.spr0663,879
171101.spr0661,171101.spr0662,888
171101.spr0661,171101.spr0663,883
171101.spr0662,171101.spr0663,892
171101.spr0665,171101.spr0682,764
171101.spr0665,171101.spr1012,767
171101.spr0665,171101.spr1396,753
171101.spr0668,171101.spr1528,972
171101.spr0668,171101.spr1566,870
171101.spr0668,171101.spr1699,972
171101.spr0672,171101.spr0865,881
171101.spr0672,171101.spr0866,806
171101.spr0673,171101.spr0769,949
171101.spr0673,171101.spr0795,880
171101.spr0673,171101.spr0836,948
171101.spr0673,171101.spr0896,828
171101.spr0682,171101.spr0740,869
171101.spr0682,171101.spr0846,801
171101.spr0682,171101.spr0862,867
171101.spr0682,171101.spr0863,867
171101.spr0682,171101.spr0924,801
171101.spr0682,171101.spr1012,867
171101.spr0682,171101.spr1014,867
171101.spr0682,171101.spr1171,867
171101.spr0682,171101.spr1211,825
171101.spr0682,171101.spr1212,867
171101.spr0682,171101.spr1271,869
171101.spr0682,171101.spr1394,869
171101.spr0682,171101.spr1396,869
171101.spr0682,171101.spr1467,869
171101.spr0682,171101.spr1807,867
171101.spr0682,171101.spr1943,867
171101.spr0682,171101.spr2009,867
171101.spr0682,171101.spr2020,869
171101.spr0691,171101.spr1292,819
171101.spr0691,171101.spr1293,814
171101.spr0691,171101.spr2024,819
171101.spr0691,171101.spr2025,814
171101.spr0691,171101.spr2026,814
171101.spr0734,171101.spr0738,889
171101.spr0740,171101.spr0862,867
171101.spr0740,171101.spr0863,867
171101.spr0740,171101.spr1012,867
171101.spr0740,171101.spr1014,867
171101.spr0740,171101.spr1171,867
171101.spr0740,171101.spr1211,801
171101.spr0740,171101.spr1212,867
171101.spr0740,171101.spr1271,869
171101.spr0740,171101.spr1394,869
171101.spr0740,171101.spr1396,869
171101.spr0740,171101.spr1467,869
171101.spr0740,171101.spr1807,867
171101.spr0740,171101.spr1943,867
171101.spr0740,171101.spr2009,867
171101.spr0740,171101.spr2020,869
171101.spr0746,171101.spr1188,800
171101.spr0758,171101.spr1808,826
171101.spr0764,171101.spr0862,803
171101.spr0764,171101.spr1212,867
171101.spr0764,171101.spr1271,707
171101.spr0764,171101.spr1394,817
171101.spr0764,171101.spr2009,707
171101.spr0764,171101.spr2020,779
171101.spr0769,171101.spr0795,902
171101.spr0769,171101.spr0836,949
171101.spr0769,171101.spr0896,871
171101.spr0774,171101.spr0783,800
171101.spr0774,171101.spr1001,800
171101.spr0776,171101.spr1517,920
171101.spr0776,171101.spr1823,830
171101.spr0779,171101.spr0780,870
171101.spr0780,171101.spr1074,870
171101.spr0783,171101.spr1001,800
171101.spr0795,171101.spr0836,879
171101.spr0795,171101.spr0896,882
171101.spr0796,171101.spr1074,831
171101.spr0796,171101.spr1882,800
171101.spr0797,171101.spr1036,807
171101.spr0797,171101.spr1775,815
171101.spr0797,171101.spr1882,800
171101.spr0836,171101.spr0896,830
171101.spr0845,171101.spr1456,900
171101.spr0846,171101.spr0863,801
171101.spr0846,171101.spr1012,801
171101.spr0846,171101.spr1014,774
171101.spr0846,171101.spr1171,813
171101.spr0846,171101.spr1396,792
171101.spr0846,171101.spr1467,801
171101.spr0846,171101.spr1943,790
171101.spr0846,171101.spr2009,801
171101.spr0846,171101.spr2020,801
171101.spr0862,171101.spr0863,937
171101.spr0862,171101.spr1012,869
171101.spr0862,171101.spr1014,937
171101.spr0862,171101.spr1171,937
171101.spr0862,171101.spr1177,868
171101.spr0862,171101.spr1211,869
171101.spr0862,171101.spr1212,937
171101.spr0862,171101.spr1271,867
171101.spr0862,171101.spr1394,867
171101.spr0862,171101.spr1396,867
171101.spr0862,171101.spr1467,867
171101.spr0862,171101.spr1807,869
171101.spr0862,171101.spr1943,869
171101.spr0862,171101.spr2009,937
171101.spr0862,171101.spr2020,867
171101.spr0863,171101.spr0924,789
171101.spr0863,171101.spr1012,869
171101.spr0863,171101.spr1014,937
171101.spr0863,171101.spr1171,937
171101.spr0863,171101.spr1177,868
171101.spr0863,171101.spr1211,869
171101.spr0863,171101.spr1212,937
171101.spr0863,171101.spr1271,867
171101.spr0863,171101.spr1394,867
171101.spr0863,171101.spr1396,867
171101.spr0863,171101.spr1467,867
171101.spr0863,171101.spr1807,869
171101.spr0863,171101.spr1943,869
171101.spr0863,171101.spr2009,937
171101.spr0863,171101.spr2020,867
171101.spr0865,171101.spr0866,920
171101.spr0876,171101.spr1822,800
171101.spr0876,171101.spr1944,800
171101.spr0877,171101.spr1123,879
171101.spr0877,171101.spr1166,888
171101.spr0877,171101.spr1544,889
171101.spr0877,171101.spr1790,827
171101.spr0877,171101.spr1821,972
171101.spr0877,171101.spr1840,827
171101.spr0877,171101.spr1852,827
171101.spr0887,171101.spr1499,828
171101.spr0906,171101.spr1975,820
171101.spr0906,171101.spr1976,832
171101.spr0906,171101.spr1977,831
171101.spr0924,171101.spr1012,789
171101.spr0924,171101.spr1014,774
171101.spr0924,171101.spr1171,789
171101.spr0924,171101.spr1396,789
171101.spr0924,171101.spr1467,789
171101.spr0924,171101.spr1943,774
171101.spr0924,171101.spr2009,789
171101.spr0924,171101.spr2020,789
171101.spr0934,171101.spr0935,863
171101.spr0934,171101.spr0936,838
171101.spr0934,171101.spr0938,919
171101.spr0934,171101.spr1684,823
171101.spr0934,171101.spr1685,805
171101.spr0934,171101.spr1686,813
171101.spr0934,171101.spr1687,826
171101.spr0935,171101.spr0936,828
171101.spr0935,171101.spr0938,958
171101.spr0935,171101.spr1684,829
171101.spr0935,171101.spr1685,808
171101.spr0935,171101.spr1686,810
171101.spr0935,171101.spr1687,812
171101.spr0936,171101.spr0938,958
171101.spr0936,171101.spr1684,829
171101.spr0936,171101.spr1685,808
171101.spr0936,171101.spr1686,810
171101.spr0936,171101.spr1687,812
171101.spr0938,171101.spr1684,810
171101.spr0938,171101.spr1685,809
171101.spr0938,171101.spr1686,801
171101.spr0938,171101.spr1687,809
171101.spr0948,171101.spr1239,825
171101.spr0978,171101.spr2008,738
171101.spr0989,171101.spr1781,800
171101.spr1004,171101.spr1487,920
171101.spr1012,171101.spr1014,869
171101.spr1012,171101.spr1171,869
171101.spr1012,171101.spr1177,868
171101.spr1012,171101.spr1211,869
171101.spr1012,171101.spr1212,869
171101.spr1012,171101.spr1271,867
171101.spr1012,171101.spr1394,867
171101.spr1012,171101.spr1396,867
171101.spr1012,171101.spr1467,867
171101.spr1012,171101.spr1807,869
171101.spr1012,171101.spr1943,869
171101.spr1012,171101.spr2009,869
171101.spr1012,171101.spr2020,867
171101.spr1014,171101.spr1171,937
171101.spr1014,171101.spr1177,868
171101.spr1014,171101.spr1211,869
171101.spr1014,171101.spr1212,937
171101.spr1014,171101.spr1271,867
171101.spr1014,171101.spr1394,867
171101.spr1014,171101.spr1396,867
171101.spr1014,171101.spr1467,867
171101.spr1014,171101.spr1807,869
171101.spr1014,171101.spr1943,869
171101.spr1014,171101.spr2009,937
171101.spr1014,171101.spr2020,867
171101.spr1025,171101.spr1916,831
171101.spr1029,171101.spr1916,810
171101.spr1030,171101.spr1031,920
171101.spr1036,171101.spr1499,769
171101.spr1036,171101.spr1882,808
171101.spr1048,171101.spr1049,887
171101.spr1048,171101.spr1050,972
171101.spr1048,171101.spr1051,945
171101.spr1049,171101.spr1050,909
171101.spr1049,171101.spr1051,958
171101.spr1050,171101.spr1051,962
171101.spr1062,171101.spr1063,823
171101.spr1065,171101.spr1066,920
171101.spr1070,171101.spr1071,968
171101.spr1070,171101.spr1836,800
171101.spr1075,171101.spr1076,832
171101.spr1080,171101.spr1081,819
171101.spr1088,171101.spr1089,972
171101.spr1123,171101.spr1166,960
171101.spr1123,171101.spr1544,920
171101.spr1123,171101.spr1790,920
171101.spr1123,171101.spr1821,879
171101.spr1123,171101.spr1840,827
171101.spr1123,171101.spr1852,920
171101.spr1128,171101.spr1300,867
171101.spr1133,171101.spr1135,800
171101.spr1153,171101.spr1154,972
171101.spr1153,171101.spr1155,870
171101.spr1154,171101.spr1155,867
171101.spr1166,171101.spr1544,920
171101.spr1166,171101.spr1790,919
171101.spr1166,171101.spr1821,888
171101.spr1166,171101.spr1840,827
171101.spr1166,171101.spr1852,920
171101.spr1171,171101.spr1177,868
171101.spr1171,171101.spr1211,869
171101.spr1171,171101.spr1212,937
171101.spr1171,171101.spr1271,867
171101.spr1171,171101.spr1394,867
171101.spr1171,171101.spr1396,867
171101.spr1171,171101.spr1467,867
171101.spr1171,171101.spr1807,869
171101.spr1171,171101.spr1943,869
171101.spr1171,171101.spr2009,937
171101.spr1171,171101.spr2020,867
171101.spr1177,171101.spr1211,752
171101.spr1177,171101.spr1212,868
171101.spr1177,171101.spr1807,867
171101.spr1177,171101.spr1943,868
171101.spr1177,171101.spr2009,868
171101.spr1191,171101.spr1192,864
171101.spr1191,171101.spr1193,830
171101.spr1191,171101.spr1194,854
171101.spr1192,171101.spr1193,919
171101.spr1192,171101.spr1194,827
171101.spr1193,171101.spr1194,884
171101.spr1196,171101.spr1529,801
171101.spr1211,171101.spr1212,869
171101.spr1211,171101.spr1394,867
171101.spr1211,171101.spr1396,813
171101.spr1211,171101.spr1467,801
171101.spr1211,171101.spr1807,869
171101.spr1211,171101.spr1943,869
171101.spr1211,171101.spr2009,869
171101.spr1211,171101.spr2020,867
171101.spr1212,171101.spr1271,867
171101.spr1212,171101.spr1394,867
171101.spr1212,171101.spr1396,867
171101.spr1212,171101.spr1467,867
171101.spr1212,171101.spr1807,869
171101.spr1212,171101.spr1943,869
171101.spr1212,171101.spr2009,937
171101.spr1212,171101.spr2020,867
171101.spr1243,171101.spr1244,920
171101.spr1243,171101.spr1245,887
171101.spr1243,171101.spr1246,827
171101.spr1244,171101.spr1245,891
171101.spr1244,171101.spr1246,847
171101.spr1245,171101.spr1246,920
171101.spr1253,171101.spr1254,800
171101.spr1253,171101.spr1255,880
171101.spr1253,171101.spr1256,824
171101.spr1253,171101.spr1257,827
171101.spr1253,171101.spr1895,827
171101.spr1253,171101.spr1896,824
171101.spr1253,171101.spr1897,880
171101.spr1253,171101.spr1898,800
171101.spr1254,171101.spr1255,880
171101.spr1254,171101.spr1256,824
171101.spr1254,171101.spr1257,827
171101.spr1254,171101.spr1895,827
171101.spr1254,171101.spr1896,824
171101.spr1254,171101.spr1897,880
171101.spr1254,171101.spr1898,800
171101.spr1255,171101.spr1256,919
171101.spr1255,171101.spr1257,883
171101.spr1255,171101.spr1895,883
171101.spr1255,171101.spr1896,919
171101.spr1255,171101.spr1897,800
171101.spr1255,171101.spr1898,880
171101.spr1256,171101.spr1257,902
171101.spr1256,171101.spr1895,902
171101.spr1256,171101.spr1896,800
171101.spr1256,171101.spr1897,919
171101.spr1256,171101.spr1898,824
171101.spr1257,171101.spr1895,800
171101.spr1257,171101.spr1896,902
171101.spr1257,171101.spr1897,883
171101.spr1257,171101.spr1898,827
171101.spr1271,171101.spr1394,869
171101.spr1271,171101.spr1396,869
171101.spr1271,171101.spr1467,869
171101.spr1271,171101.spr1807,867
171101.spr1271,171101.spr1943,867
171101.spr1271,171101.spr2009,805
171101.spr1271,171101.spr2020,869
171101.spr1292,171101.spr1293,863
171101.spr1292,171101.spr2024,800
171101.spr1292,171101.spr2025,863
171101.spr1292,171101.spr2026,863
171101.spr1293,171101.spr2024,873
171101.spr1293,171101.spr2025,800
171101.spr1293,171101.spr2026,802
171101.spr1300,171101.spr2033,867
171101.spr1321,171101.spr1322,972
171101.spr1328,171101.spr1329,920
171101.spr1343,171101.spr2019,868
171101.spr1359,171101.spr1360,972
171101.spr1359,171101.spr1361,972
171101.spr1359,171101.spr1362,972
171101.spr1359,171101.spr1363,972
171101.spr1359,171101.spr1364,966
171101.spr1359,171101.spr1365,964
171101.spr1359,171101.spr1366,952
171101.spr1360,171101.spr1361,972
171101.spr1360,171101.spr1362,972
171101.spr1360,171101.spr1363,972
171101.spr1360,171101.spr1364,972
171101.spr1360,171101.spr1365,961
171101.spr1360,171101.spr1366,957
171101.spr1361,171101.spr1362,972
171101.spr1361,171101.spr1363,972
171101.spr1361,171101.spr1364,972
171101.spr1361,171101.spr1365,936
171101.spr1361,171101.spr1366,958
171101.spr1362,171101.spr1363,972
171101.spr1362,171101.spr1364,972
171101.spr1362,171101.spr1365,965
171101.spr1362,171101.spr1366,960
171101.spr1363,171101.spr1364,972
171101.spr1363,171101.spr1365,966
171101.spr1363,171101.spr1366,958
171101.spr1364,171101.spr1365,948
171101.spr1364,171101.spr1366,960
171101.spr1365,171101.spr1366,958
171101.spr1382,171101.spr1703,819
171101.spr1382,171101.spr1704,819
171101.spr1382,171101.spr1705,817
171101.spr1382,171101.spr1706,820
171101.spr1382,171101.spr1707,800
171101.spr1394,171101.spr1396,937
171101.spr1394,171101.spr1467,937
171101.spr1394,171101.spr1807,867
171101.spr1394,171101.spr1943,867
171101.spr1394,171101.spr2009,867
171101.spr1394,171101.spr2011,870
171101.spr1394,171101.spr2020,937
171101.spr1395,171101.spr1724,810
171101.spr1396,171101.spr1467,937
171101.spr1396,171101.spr1807,867
171101.spr1396,171101.spr1943,867
171101.spr1396,171101.spr2009,867
171101.spr1396,171101.spr2011,870
171101.spr1396,171101.spr2020,937
171101.spr1432,171101.spr1499,761
171101.spr1432,171101.spr1825,806
171101.spr1432,171101.spr1882,812
171101.spr1435,171101.spr1662,920
171101.spr1437,171101.spr1710,869
171101.spr1437,171101.spr1711,859
171101.spr1437,171101.spr1712,847
171101.spr1437,171101.spr1918,900
171101.spr1437,171101.spr1919,891
171101.spr1437,171101.spr1920,900
171101.spr1460,171101.spr1647,806
171101.spr1460,171101.spr1683,800
171101.spr1467,171101.spr1807,867
171101.spr1467,171101.spr1943,867
171101.spr1467,171101.spr2009,867
171101.spr1467,171101.spr2011,870
171101.spr1467,171101.spr2020,937
171101.spr1487,171101.spr1582,708
171101.spr1487,171101.spr1776,701
171101.spr1487,171101.spr1777,703
171101.spr1492,171101.spr1493,920
171101.spr1492,171101.spr1494,920
171101.spr1493,171101.spr1494,900
171101.spr1498,171101.spr1954,810
171101.spr1510,171101.spr1511,783
171101.spr1517,171101.spr1823,869
171101.spr1528,171101.spr1566,870
171101.spr1528,171101.spr1699,870
171101.spr1531,171101.spr1536,800
171101.spr1542,171101.spr1543,800
171101.spr1544,171101.spr1790,900
171101.spr1544,171101.spr1821,889
171101.spr1544,171101.spr1840,827
171101.spr1544,171101.spr1852,900
171101.spr1566,171101.spr1699,870
171101.spr1568,171101.spr1617,800
171101.spr1582,171101.spr1776,972
171101.spr1582,171101.spr1777,972
171101.spr1588,171101.spr1664,800
171101.spr1588,171101.spr1717,814
171101.spr1631,171101.spr1632,972
171101.spr1631,171101.spr1633,828
171101.spr1631,171101.spr1634,800
171101.spr1632,171101.spr1634,738
171101.spr1636,171101.spr1637,919
171101.spr1643,171101.spr1644,824
171101.spr1643,171101.spr1645,867
171101.spr1644,171101.spr1645,824
171101.spr1647,171101.spr1683,800
171101.spr1648,171101.spr1667,800
171101.spr1648,171101.spr1903,824
171101.spr1656,171101.spr1657,800
171101.spr1664,171101.spr1717,800
171101.spr1667,171101.spr1903,824
171101.spr1670,171101.spr1837,884
171101.spr1670,171101.spr1866,800
171101.spr1677,171101.spr1678,920
171101.spr1684,171101.spr1685,897
171101.spr1684,171101.spr1686,920
171101.spr1684,171101.spr1687,890
171101.spr1685,171101.spr1687,891
171101.spr1685,171101.spr1686,892
171101.spr1686,171101.spr1687,919
171101.spr1703,171101.spr1705,863
171101.spr1703,171101.spr1706,863
171101.spr1703,171101.spr1707,819
171101.spr1703,171101.spr1704,895
171101.spr1704,171101.spr1705,882
171101.spr1704,171101.spr1706,882
171101.spr1704,171101.spr1707,819
171101.spr1705,171101.spr1706,881
171101.spr1705,171101.spr1707,817
171101.spr1706,171101.spr1707,820
171101.spr1710,171101.spr1712,864
171101.spr1710,171101.spr1711,864
171101.spr1711,171101.spr1712,863
171101.spr1722,171101.spr1723,870
171101.spr1776,171101.spr1777,972
171101.spr1785,171101.spr1812,820
171101.spr1790,171101.spr1852,880
171101.spr1790,171101.spr1840,824
171101.spr1790,171101.spr1821,881
171101.spr1807,171101.spr1943,869
171101.spr1807,171101.spr2009,869
171101.spr1807,171101.spr2020,867
171101.spr1821,171101.spr1840,827
171101.spr1821,171101.spr1852,867
171101.spr1822,171101.spr1944,800
171101.spr1823,171101.spr1909,800
171101.spr1825,171101.spr1882,776
171101.spr1834,171101.spr1835,824
171101.spr1834,171101.spr1836,883
171101.spr1835,171101.spr1836,879
171101.spr1837,171101.spr1866,884
171101.spr1840,171101.spr1852,824
171101.spr1841,171101.spr1936,827
171101.spr1841,171101.spr1937,812
171101.spr1847,171101.spr1939,819
171101.spr1847,171101.spr1938,809
171101.spr1847,171101.spr1849,824
171101.spr1847,171101.spr1848,819
171101.spr1848,171101.spr1849,888
171101.spr1848,171101.spr1938,888
171101.spr1848,171101.spr1939,800
171101.spr1849,171101.spr1938,800
171101.spr1849,171101.spr1939,945
171101.spr1885,171101.spr1887,826
171101.spr1895,171101.spr1896,902
171101.spr1895,171101.spr1897,883
171101.spr1895,171101.spr1898,827
171101.spr1896,171101.spr1897,919
171101.spr1896,171101.spr1898,824
171101.spr1897,171101.spr1898,880
171101.spr1918,171101.spr1919,920
171101.spr1918,171101.spr1920,947
171101.spr1919,171101.spr1920,920
171101.spr1936,171101.spr1937,878
171101.spr1938,171101.spr1939,945
171101.spr1943,171101.spr2009,869
171101.spr1943,171101.spr2020,867
171101.spr1967,171101.spr1970,850
171101.spr1967,171101.spr1968,822
171101.spr1967,171101.spr1969,850
171101.spr1968,171101.spr1969,850
171101.spr1968,171101.spr1970,850
171101.spr1975,171101.spr1976,920
171101.spr1975,171101.spr1977,920
171101.spr1976,171101.spr1977,920
171101.spr1979,171101.spr1981,968
171101.spr1980,171101.spr1982,967
171101.spr2002,171101.spr2003,800
171101.spr2009,171101.spr2020,867
171101.spr2011,171101.spr2020,870
171101.spr2024,171101.spr2026,972
171101.spr2024,171101.spr2025,972
171101.spr2025,171101.spr2026,972
