GO:1990077	1.144034945563991e-112	2	3	cellular_component: primosome complex	spr2008,spr0978
GO:0006269	1.144034945563991e-112	2	3	biological_process: DNA replication, synthesis of RNA primer	spr2008,spr0978
GO:0006352	1.7650391588170442e-41	1	2	biological_process: DNA-templated transcription, initiation	spr0979
GO:0046467	1.7650391588170442e-41	1	2	biological_process: membrane lipid biosynthetic process	spr0981
GO:0016758	2.80335042229084e-27	1	3	molecular_function: transferase activity, transferring hexosyl groups	spr0981
GO:0006268	3.245123806104558e-20	1	4	biological_process: DNA unwinding involved in DNA replication	spr2008
GO:0006071	3.3389404267536957e-13	1	6	biological_process: glycerol metabolic process	spr0981
GO:0003899	3.23967905518493e-11	1	7	molecular_function: DNA-directed 5'-3' RNA polymerase activity	spr0978
GO:0006260	1.5155649029709478e-10	2	29	biological_process: DNA replication	spr2008,spr0978
GO:0003678	1.379757219432925e-08	1	9	molecular_function: DNA helicase activity	spr2008
GO:0046677	1.12849275284044e-07	1	10	biological_process: response to antibiotic	spr0981
GO:0004386	0.0002365830823566684	1	17	molecular_function: helicase activity	spr2008
GO:0003677	0.000631362198506609	3	154	molecular_function: DNA binding	spr2008,spr0978,spr0979
