GO:0004590	1.6644461489289172e-14	1	2	molecular_function: orotidine-5'-phosphate decarboxylase activity	spr1846
GO:0009401	2.7340213139287096e-13	5	50	biological_process: phosphoenolpyruvate-dependent sugar phosphotransferase system	spr1938,spr1849,spr1940,spr1939,spr1848
GO:0016861	1.9747252527688514e-09	1	3	molecular_function: intramolecular oxidoreductase activity, interconverting aldoses and ketoses	spr1845
GO:0019323	1.9747252527688514e-09	1	3	biological_process: pentose catabolic process	spr1844
GO:0016832	6.241586213616668e-07	1	4	molecular_function: aldehyde-lyase activity	spr1844
GO:0008982	1.0278204984147175e-06	3	34	molecular_function: protein-N(PI)-phosphohistidine-sugar phosphotransferase activity	spr1940,spr1939,spr1848
GO:0034219	1.7207286429986298e-06	3	35	biological_process: carbohydrate transmembrane transport	spr1940,spr1939,spr1848
GO:0006207	0.00017503392274179847	1	6	biological_process: 'de novo' pyrimidine nucleobase biosynthetic process	spr1846
