GO:0046940	5.3302721031154384e-170	2	4	biological_process: nucleoside monophosphate phosphorylation	spr1456,spr0845
GO:0044210	2.956128003411842e-84	1	2	biological_process: 'de novo' CTP biosynthetic process	spr0845
GO:0009041	2.956128003411842e-84	1	2	molecular_function: uridylate kinase activity	spr0845
GO:0006220	1.0294483695347428e-55	1	3	biological_process: pyrimidine nucleotide metabolic process	spr1456
GO:0006139	3.053998735633671e-20	1	8	biological_process: nucleobase-containing compound metabolic process	spr1456
GO:0006221	1.6644461489289172e-14	1	11	biological_process: pyrimidine nucleotide biosynthetic process	spr0845
GO:0016301	3.206533634833349e-07	2	84	molecular_function: kinase activity	spr1456,spr0845
GO:0016310	5.939207165481154e-07	2	87	biological_process: phosphorylation	spr1456,spr0845
