GO:0006633	3.025581213862992e-217	12	15	biological_process: fatty acid biosynthetic process	spr0380,spr0387,spr0037,spr0377,spr0378,spr0385,spr0381,spr0386,spr0038,spr0384,spr0383,spr0382
GO:0006631	5.917335240695935e-166	9	11	biological_process: fatty acid metabolic process	spr0387,spr0377,spr0378,spr0385,spr0381,spr0386,spr0038,spr0382,spr0383
GO:0006629	2.1699438560391596e-107	11	25	biological_process: lipid metabolic process	spr0387,spr0037,spr0377,spr0378,spr0385,spr0381,spr0386,spr0038,spr0384,spr0383,spr0382
GO:0003989	1.5194155676146717e-89	4	4	molecular_function: acetyl-CoA carboxylase activity	spr0383,spr0385,spr0387,spr0386
GO:0009317	7.690258689281559e-67	3	3	cellular_component: acetyl-CoA carboxylase complex	spr0383,spr0387,spr0386
GO:2001295	7.690258689281559e-67	3	3	biological_process: malonyl-CoA biosynthetic process	spr0385,spr0387,spr0386
GO:0000035	3.2426121660259234e-44	2	2	molecular_function: acyl binding	spr0038,spr0378
GO:0004315	3.2426121660259234e-44	2	2	molecular_function: 3-oxoacyl-[acyl-carrier-protein] synthase activity	spr0382,spr0377
GO:0102132	3.2426121660259234e-44	2	2	molecular_function: 3-oxo-pimeloyl-[acp] methyl ester reductase activity	spr0381,spr0701
GO:0004316	3.2426121660259234e-44	2	2	molecular_function: 3-oxoacyl-[acyl-carrier-protein] reductase (NADPH) activity	spr0381,spr0701
GO:0102131	3.2426121660259234e-44	2	2	molecular_function: 3-oxo-glutaryl-[acp] methyl ester reductase activity	spr0381,spr0701
GO:0009245	5.94871372364508e-29	2	3	biological_process: lipid A biosynthetic process	spr0038,spr0384
GO:0000036	5.94871372364508e-29	2	3	molecular_function: acyl carrier activity	spr0038,spr0378
GO:0016743	2.3314544045030916e-21	2	4	molecular_function: carboxyl- or carbamoyltransferase activity	spr0387,spr0386
GO:0016836	1.8387464347001644e-10	1	2	molecular_function: hydro-lyase activity	spr0384
GO:0016746	2.3558423093794837e-07	3	23	molecular_function: transferase activity, transferring acyl groups	spr0382,spr0377,spr0380
GO:0006644	8.865928387631236e-07	1	3	biological_process: phospholipid metabolic process	spr0037
GO:0016747	2.027554430915588e-06	2	12	molecular_function: transferase activity, transferring acyl groups other than amino-acyl groups	spr0037,spr0382
