GO:0042128	3.7848818589363337e-146	14	20	biological_process: nitrate assimilation	b1227,b2206,b1466,b4070,b1465,b1224,b1467,b3366,b1468,b1223,b1226,b1225,b3367,b3365
GO:0008940	5.846839842797172e-105	7	7	molecular_function: nitrate reductase activity	b1227,b2206,b1465,b1224,b1467,b1468,b1225
GO:0017004	3.038849398625936e-92	9	13	biological_process: cytochrome complex assembly	b2195,b2194,b2199,b4074,b2198,b2197,b2196,b2200,b2201
GO:0009325	9.039716939998287e-90	6	6	cellular_component: nitrate reductase complex	b1227,b1465,b1224,b1467,b1468,b1225
GO:0015886	9.590133622386826e-81	7	9	biological_process: heme transport	b2199,b4074,b2198,b2197,b2196,b2200,b2201
GO:0019645	4.560793395668476e-62	8	15	biological_process: anaerobic electron transport chain	b4071,b1227,b4073,b4070,b4072,b1465,b1467,b1468
GO:0042126	1.8576784242810348e-59	4	4	biological_process: nitrate metabolic process	b1225,b1468,b1224,b1467
GO:0018378	1.8576784242810348e-59	4	4	biological_process: cytochrome c-heme linkage via heme-L-cysteine	b4075,b4076,b4074,b2194
GO:0008695	1.8576784242810348e-59	4	4	molecular_function: 3-phenylpropionate dioxygenase activity	b2542,b2540,b2539,b2538
GO:0006779	6.331908236127558e-47	7	15	biological_process: porphyrin-containing compound biosynthetic process	b3368,b2436,b3805,b3802,b3867,b3997,b3804
GO:0044799	2.3826620548556283e-44	3	3	cellular_component: NarGHI complex	b1225,b1224,b1227
GO:0042279	2.3826620548556283e-44	3	3	molecular_function: nitrite reductase (cytochrome, ammonia-forming) activity	b4072,b4071,b4070
GO:0006782	4.089818306277924e-40	5	9	biological_process: protoporphyrinogen IX biosynthetic process	b2436,b3805,b3867,b3997,b3804
GO:0015232	8.685218705663677e-39	4	6	molecular_function: heme transporter activity	b2196,b2199,b2200,b4074
GO:0020037	5.432364500441369e-35	10	39	molecular_function: heme binding	b4071,b1227,b4070,b2199,b1465,b4074,b2202,b2197,b2196,b3365
GO:0009061	3.4097623078870624e-33	11	49	biological_process: anaerobic respiration	b1227,b2206,b1465,b1224,b3366,b1467,b1468,b2202,b2203,b1225,b3365
GO:0019380	2.6033723613455886e-32	5	11	biological_process: 3-phenylpropionate catabolic process	b2540,b2539,b2538,b2542,b2541
GO:0051131	2.673449464156031e-29	2	2	biological_process: chaperone-mediated protein complex assembly	b1466,b1226
GO:0018063	2.673449464156031e-29	2	2	biological_process: cytochrome c-heme linkage	b2196,b2197
GO:0016966	2.673449464156031e-29	2	2	molecular_function: nitric oxide reductase activity	b2710,b4070
GO:0009344	2.673449464156031e-29	2	2	cellular_component: nitrite reductase complex [NAD(P)H]	b3366,b3365
GO:0008942	2.673449464156031e-29	2	2	molecular_function: nitrite reductase [NAD(P)H] activity	b3366,b3365
GO:0006780	2.673449464156031e-29	2	2	biological_process: uroporphyrinogen III biosynthetic process	b3804,b3997
GO:0019439	6.356645858731611e-27	5	13	biological_process: aromatic compound catabolic process	b2540,b2539,b2538,b2542,b2541
GO:0031235	8.213015550095608e-26	3	5	cellular_component: intrinsic component of the cytoplasmic side of the plasma membrane	b1225,b1224,b2198
GO:0016530	4.709555443943959e-19	2	3	molecular_function: metallochaperone activity	b1466,b1226
GO:0004109	4.709555443943959e-19	2	3	molecular_function: coproporphyrinogen oxidase activity	b3867,b2436
GO:0031237	6.337410781672066e-18	3	7	cellular_component: intrinsic component of periplasmic side of plasma membrane	b2197,b2195,b2194
GO:0055114	1.097261923780155e-17	28	448	biological_process: oxidation-reduction process	b2206,b2539,b2194,b2538,b4072,b1465,b1224,b2542,b2205,b2202,b3365,b4071,b2540,b3368,b2195,b2436,b1468,b2203,b1227,b4070,b3366,b2204,b2711,b1225,b2541,b1467,b3867,b2710
GO:0006783	1.7880534180050975e-15	3	8	biological_process: heme biosynthetic process	b3805,b3997,b2436
GO:0046210	5.70363900484974e-14	2	4	biological_process: nitric oxide catabolic process	b2711,b2710
GO:0016491	3.504744772183681e-13	22	356	molecular_function: oxidoreductase activity	b2206,b2539,b2538,b4072,b1465,b1224,b2542,b3365,b4071,b3368,b2195,b2436,b1468,b1227,b4070,b3366,b2711,b1225,b2541,b1467,b3867,b2710
GO:0051536	1.4496694757447472e-12	13	146	molecular_function: iron-sulfur cluster binding	b2540,b2206,b2538,b2208,b4072,b1224,b1467,b2204,b1468,b3867,b2205,b1225,b3365
GO:0051539	2.495380935856461e-11	11	117	molecular_function: 4 iron, 4 sulfur cluster binding	b2206,b2208,b4072,b1224,b1467,b2204,b1468,b3867,b2205,b1225,b3365
GO:0009055	4.333589774726078e-11	9	83	molecular_function: electron transfer activity	b4071,b1227,b2206,b1465,b1224,b1467,b2202,b2710,b1225
GO:0031224	6.050759594902055e-11	2	5	cellular_component: intrinsic component of membrane	b1225,b1224
GO:0033014	6.050759594902055e-11	2	5	biological_process: tetrapyrrole biosynthetic process	b3805,b3804
GO:0004325	7.332678215122769e-07	1	2	molecular_function: ferrochelatase activity	b3368
GO:0019353	7.332678215122769e-07	1	2	biological_process: protoporphyrinogen IX biosynthetic process from glutamate	b3997
GO:0015514	7.332678215122769e-07	1	2	molecular_function: nitrite efflux transmembrane transporter activity	b1223
GO:0015113	7.332678215122769e-07	1	2	molecular_function: nitrite transmembrane transporter activity	b1223
GO:0015706	7.332678215122769e-07	1	2	biological_process: nitrate transport	b1223
GO:0015112	7.332678215122769e-07	1	2	molecular_function: nitrate transmembrane transporter activity	b1223
GO:0015707	7.332678215122769e-07	1	2	biological_process: nitrite transport	b1223
GO:0071731	7.332678215122769e-07	1	2	biological_process: response to nitric oxide	b2710
GO:0034661	7.332678215122769e-07	1	2	biological_process: ncRNA catabolic process	b3996
GO:0046872	9.154100792482352e-07	26	692	molecular_function: metal ion binding	b2206,b2194,b2538,b4072,b1465,b1224,b2205,b2202,b3996,b3365,b4071,b2540,b2208,b2436,b1468,b3998,b2197,b2203,b1227,b4070,b2204,b1225,b1467,b4075,b3867,b2710
GO:0051538	1.7906210767811724e-06	2	8	molecular_function: 3 iron, 4 sulfur cluster binding	b1225,b1467
GO:0043546	4.1924809134720055e-06	3	18	molecular_function: molybdopterin cofactor binding	b1468,b1224,b2206
GO:0051213	5.1157504442894775e-05	2	10	molecular_function: dioxygenase activity	b2539,b2538
GO:0016891	0.0001965575922960877	1	3	molecular_function: endoribonuclease activity, producing 5'-phosphomonoesters	b3998
GO:0016661	0.0001965575922960877	1	3	molecular_function: oxidoreductase activity, acting on other nitrogenous compounds as donors	b2710
GO:0035529	0.0001965575922960877	1	3	molecular_function: NADH pyrophosphatase activity	b3996
GO:0048255	0.0001965575922960877	1	3	biological_process: mRNA stabilization	b3996
GO:0022900	0.0005816223281924466	5	63	biological_process: electron transport chain	b2206,b1224,b2202,b2710,b1225
