GO:0043165	5.805934225527733e-14	11	13	biological_process: Gram-negative-bacterium-type cell outer membrane assembly	b0177,b0641,b0053,b2477,b0054,b3200,b2595,b3199,b0178,b2512,b2617
GO:0004812	2.8493957448615814e-12	12	25	molecular_function: aminoacyl-tRNA ligase activity	b0642,b2514,b2890,b1719,b1714,b1876,b2697,b4129,b0026,b2400,b0526,b1713
GO:1990351	8.075917904405155e-10	7	7	cellular_component: transporter complex	b0641,b0054,b4262,b3200,b3199,b4261,b3201
GO:0016874	2.3896182023893667e-09	16	94	molecular_function: ligase activity	b0642,b2507,b2514,b2890,b4475,b1719,b1714,b1876,b2697,b4129,b0026,b2400,b0526,b3421,b1713,b2780
GO:0015920	4.499703474979754e-09	7	9	biological_process: lipopolysaccharide transport	b0641,b0054,b4262,b3200,b3199,b4261,b3201
GO:0006418	2.5465051067650182e-08	8	18	biological_process: tRNA aminoacylation for protein translation	b0642,b2890,b1719,b1876,b4129,b0026,b2400,b0526
GO:0000049	3.177115786327573e-08	11	46	molecular_function: tRNA binding	b3282,b2890,b2474,b1719,b1714,b3166,b2697,b4129,b0026,b2400,b1713
GO:0006412	9.888670891744705e-08	15	107	biological_process: translation	b0642,b2514,b2890,b1719,b3288,b1714,b2891,b1876,b2697,b4129,b3287,b0026,b0526,b2400,b1713
GO:1990063	2.3127003503131978e-07	5	5	cellular_component: Bam protein complex	b0177,b2477,b2595,b2512,b2617
GO:0051205	1.1946612579025675e-06	5	7	biological_process: protein insertion into membrane	b0177,b2477,b2595,b2512,b2617
GO:0005829	1.7527894004716516e-05	46	1032	cellular_component: cytosol	b0642,b2507,b1719,b3198,b1712,b2697,b4129,b0026,b3287,b3281,b0174,b2780,b0125,b2593,b2508,b3289,b3290,b2891,b0121,b0051,b0104,b3179,b3167,b1778,b3282,b2890,b2594,b0844,b3288,b3203,b3166,b2400,b0526,b0178,b3180,b2959,b0469,b2514,b0238,b1714,b0179,b1876,b2478,b0912,b1713,b0120
GO:0043039	3.4964486295884955e-05	4	7	biological_process: tRNA aminoacylation	b2697,b1719,b2400,b1714
GO:0048473	6.886791994438388e-05	3	3	biological_process: D-methionine transport	b0199,b0197,b0198
GO:0006364	6.937392171571841e-05	7	39	biological_process: rRNA processing	b3167,b3289,b3282,b2594,b0051,b1835,b3179
GO:0002161	9.188763112499215e-05	4	9	molecular_function: aminoacyl-tRNA editing activity	b0642,b0026,b2697,b1719
GO:0106074	9.188763112499215e-05	4	9	biological_process: aminoacyl-tRNA metabolism involved in translational fidelity	b0642,b0026,b2697,b1719
GO:0044877	0.0001602484632744916	3	4	molecular_function: protein-containing complex binding	b2782,b2513,b2783
GO:0001530	0.0001602484632744916	3	4	molecular_function: lipopolysaccharide binding	b3200,b0641,b0178
GO:0015437	0.0001602484632744916	3	4	molecular_function: lipopolysaccharide-transporting ATPase activity	b4261,b4262,b3201
GO:0000166	0.00018017567936014133	27	517	molecular_function: nucleotide binding	b0642,b2507,b0025,b1719,b2697,b4129,b0026,b3281,b4475,b3201,b2780,b0125,b2508,b2781,b1804,b0199,b3282,b0639,b2474,b2890,b2400,b0526,b3421,b2514,b1714,b1876,b1713
GO:0006417	0.0004835477051963233	5	25	biological_process: regulation of translation	b1719,b3203,b2782,b1712,b0912
GO:0001510	0.0005212122845979132	3	6	biological_process: RNA methylation	b3289,b3179,b1835
