GO:0008652	2.2393194045384486e-29	26	100	biological_process: cellular amino acid biosynthetic process	b0077,b0674,b2019,b3744,b2024,b0078,b3770,b1264,b2023,b2021,b2025,b3670,b4054,b2022,b1261,b3212,b2026,b3213,b3671,b1263,b1260,b3771,b3769,b3772,b1262,b2020
GO:0000105	2.2176864452658746e-13	8	9	biological_process: histidine biosynthetic process	b2022,b2019,b2026,b2023,b2021,b2024,b2020,b2025
GO:0009099	1.0850300370613928e-12	8	11	biological_process: valine biosynthetic process	b3670,b3770,b0077,b3769,b3572,b3671,b0078,b3771
GO:0009097	2.1573452427850904e-12	8	12	biological_process: isoleucine biosynthetic process	b3670,b3770,b0077,b3769,b3671,b3772,b0078,b3771
GO:0000162	8.56839402487891e-12	7	8	biological_process: tryptophan biosynthetic process	b1261,b1264,b3360,b1263,b2024,b1262,b1260
GO:0009082	5.243923448739188e-11	8	18	biological_process: branched-chain amino acid biosynthetic process	b3670,b3770,b0077,b3769,b3671,b3772,b0078,b3771
GO:0003824	2.8443020938516133e-09	20	375	molecular_function: catalytic activity	b0928,b4054,b2022,b3770,b0077,b2290,b3212,b3572,b1264,b2026,b1263,b3671,b2021,b3772,b2024,b1262,b1260,b2025,b2147,b3771
GO:0003984	4.938991052774854e-09	5	5	molecular_function: acetolactate synthase activity	b3670,b0077,b3769,b3671,b0078
GO:0009073	8.525540173346745e-08	6	18	biological_process: aromatic amino acid family biosynthetic process	b4054,b1261,b1264,b1263,b1262,b1260
GO:0008483	2.742082831860242e-07	6	22	molecular_function: transaminase activity	b0928,b4054,b3770,b2290,b3572,b2021
GO:0006537	9.27692048939859e-07	4	6	biological_process: glutamate biosynthetic process	b2878,b1761,b3213,b3212
GO:0006541	1.0979077955786066e-06	5	15	biological_process: glutamine metabolic process	b3212,b0674,b3360,b1263,b2023
GO:0009058	1.67883443109422e-06	7	48	biological_process: biosynthetic process	b0928,b4054,b2290,b1812,b3572,b1264,b2021
GO:0030170	5.158364015893029e-06	7	57	molecular_function: pyridoxal phosphate binding	b0928,b4054,b2290,b1261,b3572,b2021,b3772
GO:0005948	1.6655488849598235e-05	3	4	cellular_component: acetolactate synthase complex	b3670,b0077,b3671
GO:0006568	1.6655488849598235e-05	3	4	biological_process: tryptophan metabolic process	b1262,b1260,b1261
GO:0006520	2.2163667243914354e-05	5	28	biological_process: cellular amino acid metabolic process	b0928,b4054,b1761,b3772,b2957
GO:0016829	2.6090947554045362e-05	10	169	molecular_function: lyase activity	b2022,b1261,b1264,b1263,b2023,b3772,b1262,b1260,b2025,b3771
GO:0051536	5.140942046235604e-05	9	146	molecular_function: iron-sulfur cluster binding	b2887,b3212,b2468,b2146,b3213,b2881,b2878,b2147,b3771
GO:1990610	0.00027722408721338724	2	2	molecular_function: acetolactate synthase regulator activity	b0078,b3670
GO:0004071	0.00027722408721338724	2	2	molecular_function: aspartate-ammonia ligase activity	b3744,b0674
GO:0070981	0.00027722408721338724	2	2	biological_process: L-asparagine biosynthetic process	b3744,b0674
GO:0006529	0.00027722408721338724	2	2	biological_process: asparagine biosynthetic process	b3744,b0674
GO:0033585	0.00027722408721338724	2	2	biological_process: L-phenylalanine biosynthetic process from chorismate via phenylpyruvate	b0928,b4054
GO:0004838	0.00027722408721338724	2	2	molecular_function: L-tyrosine:2-oxoglutarate aminotransferase activity	b0928,b4054
GO:0004834	0.00027722408721338724	2	2	molecular_function: tryptophan synthase activity	b1260,b1261
GO:0004049	0.00027722408721338724	2	2	molecular_function: anthranilate synthase activity	b1264,b1263
GO:0046820	0.00027722408721338724	2	2	molecular_function: 4-amino-4-deoxychorismate synthase activity	b1812,b3360
GO:0000107	0.00027722408721338724	2	2	molecular_function: imidazoleglycerol-phosphate synthase activity	b2025,b2023
GO:0009382	0.00027722408721338724	2	2	cellular_component: imidazoleglycerol-phosphate synthase complex	b2025,b2023
GO:0004159	0.00027722408721338724	2	2	molecular_function: dihydrouracil dehydrogenase (NAD+) activity	b2146,b2147
GO:0015930	0.00027722408721338724	2	2	molecular_function: glutamate synthase activity	b2878,b3212
GO:0004355	0.00027722408721338724	2	2	molecular_function: glutamate synthase (NADPH) activity	b3213,b3212
GO:0097054	0.00027722408721338724	2	2	biological_process: L-glutamate biosynthetic process	b3213,b3212
GO:0006532	0.00027722408721338724	2	2	biological_process: aspartate biosynthetic process	b4054,b3770
GO:0005737	0.0003370534211403714	21	848	cellular_component: cytoplasm	b0674,b2019,b3572,b3744,b2024,b2290,b1812,b2023,b2946,b2947,b2025,b2147,b4054,b2022,b1261,b1761,b2026,b1260,b0928,b2020,b0852
GO:0019676	0.0006190104313067371	2	3	biological_process: ammonia assimilation cycle	b2878,b3212
GO:0046872	0.0006419453418453548	18	692	molecular_function: metal ion binding	b2879,b2887,b0077,b2022,b3212,b2019,b2468,b1264,b3213,b3671,b2881,b2878,b2947,b1813,b2020,b0852,b2147,b3771
GO:0016740	0.0007210612318369813	16	576	molecular_function: transferase activity	b0928,b3670,b4054,b0077,b2290,b3770,b2019,b1812,b3572,b3769,b3360,b1263,b3671,b2021,b0078,b2946
