GO:0006096	8.186996295352023e-60	8	10	biological_process: glycolytic process	spr0796,spr0441,spr0797,spr1499,spr1882,spr1432,spr1036,spr0530
GO:0005978	2.4538673714261706e-37	4	4	biological_process: glycogen biosynthetic process	spr1030,spr1031,spr1032,spr1029
GO:0044205	1.3419359090940244e-36	6	9	biological_process: 'de novo' UMP biosynthetic process	spr0613,spr0614,spr1155,spr1154,spr1153,spr1053
GO:0004022	2.1393266628808206e-29	4	5	molecular_function: alcohol dehydrogenase (NAD) activity	spr1670,spr1866,spr1837,spr0262
GO:0006221	2.198396501091355e-29	6	11	biological_process: pyrimidine nucleotide biosynthetic process	spr0613,spr0614,spr1155,spr1154,spr1153,spr1053
GO:0005977	8.421397065336527e-28	3	3	biological_process: glycogen metabolic process	spr1030,spr1917,spr1029
GO:0006094	4.0448057077265454e-24	4	6	biological_process: gluconeogenesis	spr1499,spr1432,spr1882,spr0441
GO:0006526	2.3091043693700927e-20	4	7	biological_process: arginine biosynthetic process	spr0102,spr0103,spr1154,spr1153
GO:0030388	2.507013355340695e-18	2	2	biological_process: fructose 1,6-bisphosphate metabolic process	spr0796,spr0530
GO:0004845	2.507013355340695e-18	2	2	molecular_function: uracil phosphoribosyltransferase activity	spr1156,spr0655
GO:0004088	2.507013355340695e-18	2	2	molecular_function: carbamoyl-phosphate synthase (glutamine-hydrolyzing) activity	spr1154,spr1153
GO:0016757	1.7561346360330548e-13	7	29	molecular_function: transferase activity, transferring glycosyl groups	spr0614,spr0655,spr1156,spr1916,spr1032,spr1917,spr1029
GO:0006807	4.825029265037747e-13	3	6	biological_process: nitrogen compound metabolic process	spr1155,spr1154,spr1153
GO:0016868	4.825029265037747e-13	3	6	molecular_function: intramolecular transferase activity, phosphotransferases	spr0887,spr1499,spr0219
GO:0006207	4.825029265037747e-13	3	6	biological_process: 'de novo' pyrimidine nucleobase biosynthetic process	spr0613,spr1155,spr1154
GO:0048029	8.279364389963101e-12	2	3	molecular_function: monosaccharide binding	spr0796,spr1882
GO:0016620	1.1004660111844983e-06	2	5	molecular_function: oxidoreductase activity, acting on the aldehyde or oxo group of donors, NAD or NADP as acceptor	spr1825,spr1837
GO:0009116	0.00018300334162264662	3	15	biological_process: nucleoside metabolic process	spr1156,spr0614,spr0655
GO:0043169	0.0002915623464746434	1	2	molecular_function: cation binding	spr1029
GO:0042450	0.0002915623464746434	1	2	biological_process: arginine biosynthetic process via ornithine	spr0103
GO:0004550	0.0002915623464746434	1	2	molecular_function: nucleoside diphosphate kinase activity	spr1775
GO:0006165	0.0002915623464746434	1	2	biological_process: nucleoside diphosphate phosphorylation	spr1775
GO:0006002	0.0002915623464746434	1	2	biological_process: fructose 6-phosphate metabolic process	spr0796
GO:0051156	0.0002915623464746434	1	2	biological_process: glucose 6-phosphate metabolic process	spr1882
GO:0019856	0.0002915623464746434	1	2	biological_process: pyrimidine nucleobase biosynthetic process	spr0614
GO:0006241	0.0002915623464746434	1	2	biological_process: CTP biosynthetic process	spr1775
GO:0043531	0.0002915623464746434	1	2	molecular_function: ADP binding	spr0441
GO:0004590	0.0002915623464746434	1	2	molecular_function: orotidine-5'-phosphate decarboxylase activity	spr0613
GO:0008655	0.0002915623464746434	1	2	biological_process: pyrimidine-containing compound salvage	spr0655
GO:0044206	0.0002915623464746434	1	2	biological_process: UMP salvage	spr0655
GO:0016208	0.0002915623464746434	1	2	molecular_function: AMP binding	spr0796
GO:0019563	0.0002915623464746434	1	2	biological_process: glycerol catabolic process	spr1432
GO:0006183	0.0002915623464746434	1	2	biological_process: GTP biosynthetic process	spr1775
GO:0005737	0.0003738180917858391	17	299	cellular_component: cytoplasm	spr0796,spr1155,spr1154,spr1153,spr0797,spr0441,spr0102,spr0887,spr0219,spr1916,spr1775,spr1917,spr1882,spr1432,spr1036,spr0103,spr1029
