GO:0055114	3.6207083153709986e-31	64	448	biological_process: oxidation-reduction process	b2278,b2482,b2485,b2484,b2277,b0723,b0726,b2285,b4153,b0734,b3236,b2288,b2276,b3003,b0430,b1136,b2281,b4211,b2770,b1697,b0429,b2488,b2463,b3962,b2284,b2279,b1415,b2283,b2287,b2210,b2280,b2286,b0721,b2481,b2486,b0073,b0041,b2490,b1378,b1698,b0979,b0431,b0733,b1656,b1800,b1479,b2487,b1387,b0978,b0722,b4154,b2483,b3908,b2769,b4515,b0307,b1109,b2282,b3152,b0306,b0042,b0724,b0432,b2489
GO:0009060	9.048661628031483e-19	17	24	biological_process: aerobic respiration	b0429,b2488,b2284,b1109,b2283,b2277,b2287,b2282,b0723,b0721,b2276,b0724,b0432,b0722,b0430,b2281,b0431
GO:0003954	1.0526152288434227e-17	15	18	molecular_function: NADH dehydrogenase activity	b2278,b2488,b2279,b2284,b2283,b2484,b2277,b2282,b2287,b2280,b2286,b2285,b2276,b2288,b2281
GO:0030964	1.1274432537749268e-17	14	14	cellular_component: NADH dehydrogenase complex	b2278,b2284,b2279,b1109,b2283,b2277,b2282,b2287,b2280,b2286,b2285,b2276,b2288,b2281
GO:0006099	2.0102957266254776e-17	17	29	biological_process: tricarboxylic acid cycle	b1612,b0722,b0729,b2210,b0320,b0723,b0726,b4122,b4153,b0721,b1611,b3236,b0724,b0728,b0727,b1136,b0518
GO:0048038	4.877411410354466e-17	15	20	molecular_function: quinone binding	b2278,b2279,b2284,b2283,b2277,b2282,b2287,b2280,b2286,b2285,b2487,b2276,b2288,b2489,b2281
GO:0045272	6.97324610066189e-17	14	16	cellular_component: plasma membrane respiratory chain complex I	b2278,b2488,b2279,b2284,b2283,b2277,b2282,b2287,b2280,b2286,b2285,b2276,b2288,b2281
GO:0008137	1.5913459103637326e-16	14	17	molecular_function: NADH dehydrogenase (ubiquinone) activity	b2278,b2482,b2284,b2279,b1109,b2283,b2277,b2287,b2280,b2286,b2487,b2276,b2288,b2489
GO:0009055	3.919831937169155e-14	21	83	molecular_function: electron transfer activity	b0723,b4153,b0734,b0430,b2770,b1697,b0429,b2283,b0721,b0041,b1698,b0733,b0431,b0979,b0978,b0722,b4154,b2769,b0042,b0724,b0432
GO:0015990	8.796036305539247e-12	9	9	biological_process: electron transport coupled proton transport	b2278,b0429,b2484,b2287,b2277,b2276,b0432,b0430,b0431
GO:0019646	8.796036305539247e-12	9	9	biological_process: aerobic electron transport chain	b0429,b1109,b0733,b0978,b0734,b0432,b0430,b0979,b0431
GO:0016491	5.180258072211807e-11	35	356	molecular_function: oxidoreductase activity	b2482,b2485,b2484,b0723,b0726,b2285,b4153,b3236,b3003,b0430,b1136,b4211,b0429,b3962,b2463,b1415,b2283,b2210,b2481,b2486,b0073,b2490,b1378,b1656,b1800,b1479,b2487,b1387,b4154,b2483,b3908,b1109,b0724,b0432,b2489
GO:0016651	1.5558552864502247e-09	8	11	molecular_function: oxidoreductase activity, acting on NAD(P)H	b2488,b2279,b2284,b2283,b2286,b2487,b2288,b2281
GO:0042773	4.829406568589674e-09	7	8	biological_process: ATP synthesis coupled electron transport	b2278,b2482,b2279,b2283,b2277,b2276,b0432
GO:0022900	4.922075504253997e-09	14	63	biological_process: electron transport chain	b2769,b1378,b0723,b0721,b4153,b4154,b0042,b0432,b1697,b0041,b0722,b1136,b1698,b2770
GO:0044569	5.644898458269397e-09	8	13	cellular_component: [Ni-Fe] hydrogenase complex	b2482,b2488,b2485,b2484,b2481,b2486,b2487,b2483
GO:0000104	2.8849273045162986e-08	6	6	molecular_function: succinate dehydrogenase activity	b0722,b4152,b0723,b0721,b4154,b4151
GO:0050136	2.8849273045162986e-08	6	6	molecular_function: NADH dehydrogenase (quinone) activity	b2279,b2287,b2286,b2276,b2288,b2281
GO:0016682	1.5467557405891992e-07	6	8	molecular_function: oxidoreductase activity, acting on diphenols and related substances as donors, oxygen as acceptor	b0733,b0978,b0734,b0431,b0432,b0979
GO:0006119	4.303583333031613e-07	5	5	biological_process: oxidative phosphorylation	b4515,b0978,b0734,b0733,b0979
GO:0015078	9.744088639371136e-07	6	11	molecular_function: proton transmembrane transporter activity	b0429,b3738,b0431,b0432,b0430,b3737
GO:0006108	1.0465443043094856e-06	5	6	biological_process: malate metabolic process	b2463,b1800,b1479,b1611,b3236
GO:0051539	1.5749311348541019e-06	15	117	molecular_function: 4 iron, 4 sulfur cluster binding	b2488,b0307,b2284,b0072,b2283,b2287,b4122,b2481,b2487,b4153,b0724,b1612,b2489,b1378,b2281
GO:0051287	4.192452779607877e-06	9	42	molecular_function: NAD binding	b2463,b1800,b2284,b3152,b1479,b2286,b2487,b0073,b1136
GO:0006113	4.212184651786519e-06	5	8	biological_process: fermentation	b4152,b4153,b3236,b4154,b4151
GO:0051536	5.081050867294973e-06	16	146	molecular_function: iron-sulfur cluster binding	b2488,b0307,b2284,b0072,b2283,b2287,b4122,b2481,b2487,b2285,b4153,b0724,b1612,b2489,b1378,b2281
GO:0004775	6.483565766213575e-06	4	4	molecular_function: succinate-CoA ligase (ADP-forming) activity	b0728,b0320,b0518,b0729
GO:0009361	6.483565766213575e-06	4	4	cellular_component: succinate-CoA ligase complex (ADP-forming)	b0728,b0320,b0518,b0729
GO:0015453	6.483565766213575e-06	4	4	molecular_function: oxidoreduction-driven active transmembrane transporter activity	b0432,b0429,b0430,b0431
GO:0009486	6.483565766213575e-06	4	4	molecular_function: cytochrome bo3 ubiquinol oxidase activity	b0432,b0429,b0430,b0431
GO:0009319	6.483565766213575e-06	4	4	cellular_component: cytochrome o ubiquinol oxidase complex	b0432,b0429,b0430,b0431
GO:0070069	6.483565766213575e-06	4	4	cellular_component: cytochrome complex	b0733,b0978,b0734,b0979
GO:0102040	6.483565766213575e-06	4	4	molecular_function: fumarate reductase (menaquinone)	b4152,b4154,b4153,b4151
GO:0045284	6.483565766213575e-06	4	4	cellular_component: plasma membrane fumarate reductase complex	b4152,b4154,b4153,b4151
GO:0009098	9.491362881337358e-05	4	8	biological_process: leucine biosynthetic process	b0073,b0071,b0074,b0072
GO:0004776	9.967583527633118e-05	3	3	molecular_function: succinate-CoA ligase (GDP-forming) activity	b0320,b0518,b0729
GO:0008827	9.967583527633118e-05	3	3	molecular_function: cytochrome o ubiquinol oxidase activity	b0432,b0429,b0430
GO:0004129	9.967583527633118e-05	3	3	molecular_function: cytochrome-c oxidase activity	b0432,b0430,b0431
GO:0008177	9.967583527633118e-05	3	3	molecular_function: succinate dehydrogenase (ubiquinone) activity	b0724,b0723,b0721
GO:0006754	0.00014869814040537093	4	9	biological_process: ATP biosynthetic process	b3733,b3738,b3731,b3737
GO:0046933	0.00014869814040537093	4	9	molecular_function: proton-transporting ATP synthase activity, rotational mechanism	b3733,b3738,b3731,b3737
GO:0015986	0.00014869814040537093	4	9	biological_process: ATP synthesis coupled proton transport	b3733,b3738,b3731,b3737
GO:0016627	0.00022167144755928835	4	10	molecular_function: oxidoreductase activity, acting on the CH-CH group of donors	b0722,b0723,b0721,b4154
GO:0016655	0.00023135144293612455	3	4	molecular_function: oxidoreductase activity, acting on NAD(P)H, quinone or similar compound as acceptor	b2286,b2282,b4211
GO:0015765	0.00023135144293612455	3	4	biological_process: methylgalactoside transport	b2150,b2148,b2149
GO:0045263	0.00023135144293612455	3	4	cellular_component: proton-transporting ATP synthase complex, coupling factor F(o)	b3738,b3739,b3737
GO:0050660	0.0004234900001812514	8	61	molecular_function: flavin adenine dinucleotide binding	b3962,b1109,b2210,b2769,b0723,b0042,b4154,b1698
GO:0048039	0.00044246575869328177	3	5	molecular_function: ubiquinone binding	b0721,b2277,b0431
GO:0004333	0.00044246575869328177	3	5	molecular_function: fumarate hydratase activity	b4122,b1612,b1611
GO:0005886	0.0004486368914531626	50	1139	cellular_component: plasma membrane	b2278,b2482,b0321,b1496,b2485,b2484,b2277,b3731,b0723,b2285,b4153,b0734,b2276,b2288,b0430,b2281,b0429,b3739,b2284,b2279,b2283,b2287,b2280,b2286,b0721,b2486,b4151,b0979,b0431,b0733,b2148,b3738,b4123,b0428,b3733,b2149,b4152,b0978,b0518,b0722,b4154,b3528,b2483,b0869,b4515,b1109,b2282,b0724,b0432,b3737
GO:0009061	0.0005932972922243402	7	49	biological_process: anaerobic respiration	b1109,b4152,b0723,b4153,b3236,b4154,b4151
GO:0020037	0.0010081555378619858	6	39	molecular_function: heme binding	b0721,b0978,b0734,b0431,b0722,b0733
GO:0015757	0.001164267547326499	3	7	biological_process: galactose transmembrane transport	b2150,b2148,b2149
