GO:0019402	7.950923172640228e-164	5	5	biological_process: galactitol metabolic process	b2091,b2095,b2094,b2093,b2096
GO:0019854	5.0005213433853886e-104	4	5	biological_process: L-ascorbic acid catabolic process	b4196,b4198,b4197,b3581
GO:0019852	1.0089450251548094e-97	3	3	biological_process: L-ascorbic acid metabolic process	b3582,b4198,b4197
GO:0019404	1.0089450251548094e-97	3	3	biological_process: galactitol catabolic process	b2096,b2091,b2095
GO:0015796	1.0089450251548094e-97	3	3	biological_process: galactitol transport	b2094,b2093,b4304
GO:0015882	1.0089450251548094e-97	3	3	biological_process: L-ascorbic acid transmembrane transport	b4195,b4194,b4193
GO:0090585	1.0089450251548094e-97	3	3	molecular_function: protein-phosphocysteine-L-ascorbate-phosphotransferase system transporter activity	b4195,b4194,b4193
GO:0090584	9.226485659076646e-65	2	2	molecular_function: protein-phosphocysteine-galactitol-phosphotransferase system transporter activity	b2094,b2093
GO:0033982	9.226485659076646e-65	2	2	molecular_function: 3-dehydro-L-gulonate-6-phosphate decarboxylase activity	b4196,b3581
GO:0034015	9.226485659076646e-65	2	2	molecular_function: L-ribulose-5-phosphate 3-epimerase activity	b3582,b4197
GO:0019324	1.0286342155755782e-57	3	5	biological_process: L-lyxose metabolic process	b3582,b3583,b3580
GO:0009401	3.633206256454532e-43	9	57	biological_process: phosphoenolpyruvate-dependent sugar phosphotransferase system	b2095,b4304,b4195,b2094,b2093,b4302,b4565,b4194,b4193
GO:0008742	1.3774472230469866e-42	2	3	molecular_function: L-ribulose-phosphate 4-epimerase activity	b4198,b3583
GO:0004590	1.3774472230469866e-42	2	3	molecular_function: orotidine-5'-phosphate decarboxylase activity	b4196,b3581
GO:2001059	1.5415226442289112e-31	2	4	biological_process: D-tagatose 6-phosphate catabolic process	b2096,b2095
GO:0019323	3.725068121439129e-31	3	9	biological_process: pentose catabolic process	b4301,b4198,b3583
GO:0016861	1.5246731046399674e-20	2	6	molecular_function: intramolecular oxidoreductase activity, interconverting aldoses and ketoses	b3582,b4197
GO:0015144	1.5246731046399674e-20	2	6	molecular_function: carbohydrate transmembrane transporter activity	b3577,b3578
GO:0016832	2.200861653055145e-19	3	14	molecular_function: aldehyde-lyase activity	b2096,b4198,b3583
GO:0005975	1.900993568046567e-17	10	154	biological_process: carbohydrate metabolic process	b3582,b2095,b4196,b3583,b3581,b3580,b4301,b2096,b4198,b4197
GO:0034219	3.974136852953992e-17	5	42	biological_process: carbohydrate transmembrane transport	b3577,b2094,b2093,b4565,b3578
GO:0032412	1.7706008166431293e-15	1	2	biological_process: regulation of ion transmembrane transporter activity	b2094
GO:0008868	1.7706008166431293e-15	1	2	molecular_function: galactitol-1-phosphate 5-dehydrogenase activity	b2091
GO:0006207	2.821562182186427e-13	2	9	biological_process: 'de novo' pyrimidine nucleobase biosynthetic process	b4196,b3581
GO:0008643	1.793156599944829e-12	7	104	biological_process: carbohydrate transport	b4304,b2094,b2093,b4302,b4565,b3579,b4193
GO:0019572	4.5607440904747553e-10	1	3	biological_process: L-arabinose catabolic process	b3583
GO:0009025	4.5607440904747553e-10	1	3	molecular_function: tagatose-bisphosphate aldolase activity	b2096
GO:0032147	4.5607440904747553e-10	1	3	biological_process: activation of protein kinase activity	b2094
GO:0030295	4.5607440904747553e-10	1	3	molecular_function: protein kinase activator activity	b2094
GO:0004750	4.5607440904747553e-10	1	3	molecular_function: ribulose-phosphate 3-epimerase activity	b4301
GO:0008982	2.9586624733369584e-08	3	30	molecular_function: protein-N(PI)-phosphohistidine-sugar phosphotransferase activity	b4565,b4194,b2093
GO:0044262	2.123521553389152e-07	1	4	biological_process: cellular carbohydrate metabolic process	b4301
GO:0015740	8.044659969786548e-06	1	5	biological_process: C4-dicarboxylate transport	b3577
GO:0016853	1.853886403461653e-05	5	108	molecular_function: isomerase activity	b3582,b3583,b4301,b4198,b4197
GO:0016301	9.993845980667114e-05	6	166	molecular_function: kinase activity	b4195,b2094,b4302,b3580,b4565,b4194
GO:0016831	0.0001200106126588916	2	23	molecular_function: carboxy-lyase activity	b4196,b3581
GO:0016310	0.0001306438074956965	6	169	biological_process: phosphorylation	b4195,b2094,b4302,b3580,b4565,b4194
GO:0009052	0.00047124427253297265	1	7	biological_process: pentose-phosphate shunt, non-oxidative branch	b4301
GO:0016052	0.00047124427253297265	1	7	biological_process: carbohydrate catabolic process	b3581
