GO:0006096	2.4955607982610625e-83	13	19	biological_process: glycolytic process	b1723,b0755,b4025,b3919,b4395,b3916,b3612,b1676,b2926,b2779,b1779,b1854,b2925
GO:0005980	1.3460175465669368e-37	4	4	biological_process: glycogen catabolic process	b3431,b3428,b3416,b3417
GO:0005977	1.3460175465669368e-37	4	4	biological_process: glycogen metabolic process	b3431,b3428,b3430,b3432
GO:0006094	2.120519730662497e-31	7	14	biological_process: gluconeogenesis	b4232,b0755,b3919,b4025,b2926,b3403,b2925
GO:0004619	5.247841414379894e-28	3	3	molecular_function: phosphoglycerate mutase activity	b0755,b4395,b3612
GO:0009381	5.247841414379894e-28	3	3	molecular_function: excinuclease ABC activity	b0779,b4058,b1913
GO:0005978	5.247841414379894e-28	3	3	biological_process: glycogen biosynthetic process	b3432,b3429,b3430
GO:0006289	2.8283744695407366e-24	4	6	biological_process: nucleotide-excision repair	b3813,b0779,b4058,b1913
GO:0009380	1.5425075037413125e-20	3	4	cellular_component: excinuclease repair complex	b0779,b4058,b1913
GO:0002949	1.5425075037413125e-20	3	4	biological_process: tRNA threonylcarbamoyladenosine modification	b4168,b1807,b3064
GO:0030983	1.804146716446046e-18	2	2	molecular_function: mismatched DNA binding	b4170,b2733
GO:0006536	1.804146716446046e-18	2	2	biological_process: glutamate metabolic process	b1493,b3517
GO:0061621	1.804146716446046e-18	2	2	biological_process: canonical glycolysis	b0755,b3916
GO:0006538	1.804146716446046e-18	2	2	biological_process: glutamate catabolic process	b1493,b3517
GO:0004351	1.804146716446046e-18	2	2	molecular_function: glutamate decarboxylase activity	b1493,b3517
GO:1902912	1.804146716446046e-18	2	2	cellular_component: pyruvate kinase complex	b1854,b1676
GO:0004743	1.804146716446046e-18	2	2	molecular_function: pyruvate kinase activity	b1854,b1676
GO:0003872	1.804146716446046e-18	2	2	molecular_function: 6-phosphofructokinase activity	b1723,b3916
GO:0004365	1.804146716446046e-18	2	2	molecular_function: glyceraldehyde-3-phosphate dehydrogenase (NAD+) (phosphorylating) activity	b2927,b1779
GO:0102499	1.804146716446046e-18	2	2	molecular_function: SHG alpha-glucan phosphorylase activity	b3428,b3417
GO:0008184	1.804146716446046e-18	2	2	molecular_function: glycogen phosphorylase activity	b3428,b3417
GO:0102250	1.804146716446046e-18	2	2	molecular_function: linear malto-oligosaccharide phosphorylase activity	b3428,b3417
GO:0051454	4.4031235594212215e-16	3	5	biological_process: intracellular pH elevation	b1493,b3517,b1492
GO:0006298	1.0220485804800047e-13	4	10	biological_process: mismatch repair	b3813,b2733,b4170,b1960
GO:0009268	3.9505214341793095e-13	3	6	biological_process: response to pH	b3509,b3511,b0486
GO:0016868	3.9505214341793095e-13	3	6	molecular_function: intramolecular transferase activity, phosphotransferases	b0755,b0688,b4395
GO:0098796	6.731770154401606e-12	2	3	cellular_component: membrane protein complex	b4174,b4175
GO:0030980	6.731770154401606e-12	2	3	biological_process: alpha-glucan catabolic process	b0403,b3417
GO:0006007	6.731770154401606e-12	2	3	biological_process: glucose catabolic process	b3916,b3612
GO:0004645	6.731770154401606e-12	2	3	molecular_function: phosphorylase activity	b3428,b3417
GO:0008443	6.731770154401606e-12	2	3	molecular_function: phosphofructokinase activity	b1723,b3916
GO:0032300	6.731770154401606e-12	2	3	cellular_component: mismatch repair complex	b4170,b2733
GO:0008152	1.0592542794015586e-10	14	119	biological_process: metabolic process	b3428,b3080,b3417,b4232,b3916,b3431,b0403,b3956,b1676,b1854,b4167,b3403,b3430,b1767
GO:1990451	1.1819136798009347e-08	2	4	biological_process: cellular stress response to acidic pH	b3509,b3510
GO:0000018	1.1819136798009347e-08	2	4	biological_process: regulation of DNA recombination	b4170,b2733
GO:0030388	1.1819136798009347e-08	2	4	biological_process: fructose 1,6-bisphosphate metabolic process	b4232,b3916
GO:0006002	1.1819136798009347e-08	2	4	biological_process: fructose 6-phosphate metabolic process	b4232,b3916
GO:0006401	2.640358039214646e-07	3	10	biological_process: RNA catabolic process	b3164,b1084,b3780
GO:0005975	3.397687789701017e-07	14	154	biological_process: carbohydrate metabolic process	b3432,b3428,b3080,b3417,b4232,b1723,b0688,b3614,b3431,b0403,b3416,b1780,b3430,b2925
GO:0016208	9.855597265012368e-07	2	5	molecular_function: AMP binding	b3430,b3916
GO:0003824	4.53436809775994e-06	23	375	molecular_function: catalytic activity	b4232,b0755,b4395,b0403,b1676,b2925,b3432,b3614,b3431,b3956,b1854,b3517,b1780,b1767,b3417,b3919,b1493,b3430,b3428,b3916,b3612,b4167,b3403
GO:0005737	6.230716188310226e-06	39	848	cellular_component: cytoplasm	b4232,b1913,b0755,b4395,b0403,b1676,b2926,b2779,b3064,b3432,b4173,b2927,b3780,b1779,b0143,b0687,b1854,b4166,b1767,b3417,b4168,b3919,b4025,b1493,b0779,b4058,b3428,b1084,b0688,b3813,b1807,b3916,b3612,b3416,b1780,b3403,b2518,b3164,b1914
GO:0043531	7.007692099850637e-06	3	12	molecular_function: ADP binding	b2926,b4168,b2733
GO:0006006	7.007692099850637e-06	3	12	biological_process: glucose metabolic process	b2927,b0688,b1779
GO:0019752	1.8065263267124146e-05	2	6	biological_process: carboxylic acid metabolic process	b1493,b3517
GO:0000287	2.525413531092775e-05	14	184	molecular_function: magnesium ion binding	b1723,b4232,b1084,b0688,b3916,b3956,b1676,b2779,b3403,b1854,b0142,b3430,b3064,b3164
GO:0009314	0.00014171208135744915	6	50	biological_process: response to radiation	b1913,b3813,b0779,b0687,b4058,b3613
GO:0042802	0.00014733330571949397	23	429	molecular_function: identical protein binding	b4232,b1676,b2779,b2925,b3064,b3506,b1854,b0687,b1767,b4168,b3919,b4025,b0779,b4170,b4058,b3430,b3510,b1723,b2733,b1084,b1807,b3916,b3164
GO:0009273	0.0002699109201047	1	2	biological_process: peptidoglycan-based cell wall biogenesis	b3613
GO:0006165	0.0002699109201047	1	2	biological_process: nucleoside diphosphate phosphorylation	b2518
GO:0004818	0.0002699109201047	1	2	molecular_function: glutamate-tRNA ligase activity	b0144
GO:0042578	0.0002699109201047	1	2	molecular_function: phosphoric ester hydrolase activity	b4232
GO:0005618	0.0002699109201047	1	2	cellular_component: cell wall	b2925
GO:0006241	0.0002699109201047	1	2	biological_process: CTP biosynthetic process	b2518
GO:0045926	0.0002699109201047	1	2	biological_process: negative regulation of growth	b0485
GO:0044275	0.0002699109201047	1	2	biological_process: cellular carbohydrate catabolic process	b3916
GO:0051692	0.0002699109201047	1	2	biological_process: cellular oligosaccharide catabolic process	b0403
GO:0004550	0.0002699109201047	1	2	molecular_function: nucleoside diphosphate kinase activity	b2518
GO:0006543	0.0002699109201047	1	2	biological_process: glutamine catabolic process	b0485
GO:0006107	0.0002699109201047	1	2	biological_process: oxaloacetate metabolic process	b3956
GO:0051345	0.0002699109201047	1	2	biological_process: positive regulation of hydrolase activity	b3613
GO:0003688	0.0002699109201047	1	2	molecular_function: DNA replication origin binding	b0687
GO:0033202	0.0002699109201047	1	2	cellular_component: DNA helicase complex	b3813
GO:0008312	0.0002699109201047	1	2	molecular_function: 7S RNA binding	b1084
GO:0036289	0.0002699109201047	1	2	biological_process: peptidyl-serine autophosphorylation	b4173
GO:0008444	0.0002699109201047	1	2	molecular_function: CDP-diacylglycerol-glycerol-3-phosphate 3-phosphatidyltransferase activity	b1912
GO:0043765	0.0002699109201047	1	2	molecular_function: T/G mismatch-specific endonuclease activity	b1960
GO:0006183	0.0002699109201047	1	2	biological_process: GTP biosynthetic process	b2518
GO:0008301	0.0002699109201047	1	2	molecular_function: DNA binding, bending	b2733
GO:0005524	0.0002780580435264767	23	441	molecular_function: ATP binding	b2786,b0755,b1676,b2926,b4173,b3780,b4171,b0143,b1854,b0142,b4168,b0779,b4170,b4058,b3430,b1723,b2733,b0144,b3813,b3916,b4167,b3403,b2518
GO:0005829	0.0003253427249447158	41	1032	cellular_component: cytosol	b4232,b0755,b1676,b3407,b2926,b2779,b3064,b2925,b3432,b4173,b2927,b3956,b3780,b1779,b0143,b0687,b1854,b3517,b4172,b1767,b3429,b3417,b3919,b4025,b4174,b1493,b4058,b1867,b1723,b2733,b0144,b0688,b3813,b1807,b3916,b3612,b3416,b1780,b3403,b2518,b3164
GO:0000166	0.0006218506142052583	25	517	molecular_function: nucleotide binding	b4232,b2786,b1676,b2926,b2628,b4173,b3780,b0143,b4171,b1779,b1854,b0142,b4168,b0779,b4170,b4058,b3430,b1723,b2733,b0144,b3813,b3916,b4167,b3403,b2518
GO:0048029	0.0006356061482239505	2	8	molecular_function: monosaccharide binding	b4025,b3916
GO:0008033	0.0008732653934784006	6	57	biological_process: tRNA processing	b4168,b1084,b1807,b4171,b4166,b3064
GO:0006974	0.001020707362105838	15	248	biological_process: cellular response to DNA damage stimulus	b3432,b1723,b3080,b3429,b1960,b1913,b2733,b3516,b3813,b3515,b3431,b0779,b4170,b1780,b4058
GO:0009432	0.001528284078161531	4	30	biological_process: SOS response	b3813,b0779,b4058,b1913
