GO:0009432	2.548090451633307e-09	5	30	biological_process: SOS response	b2699,b2698,b0958,b1848,b2616
GO:0006740	4.896829914711671e-06	2	2	biological_process: NADPH regeneration	b1603,b1602
GO:0008750	4.896829914711671e-06	2	2	molecular_function: NAD(P)+ transhydrogenase (AB-specific) activity	b1603,b1602
GO:0008746	1.4672604114382335e-05	2	3	molecular_function: NAD(P)+ transhydrogenase activity	b1603,b1602
GO:0006281	2.0444873657808366e-05	4	80	biological_process: DNA repair	b1848,b2616,b2699,b2698
