GO:0006189	1.6268598427470529e-19	11	12	biological_process: 'de novo' IMP biosynthetic process	b1849,b1131,b2499,b2557,b4006,b2500,b2476,b4005,b0522,b0523,b2312
GO:0006164	3.3327252733364188e-18	12	18	biological_process: purine nucleotide biosynthetic process	b1849,b1131,b2499,b2557,b4006,b2500,b2476,b4005,b0522,b0523,b0529,b2312
GO:0006221	3.495402194500204e-15	9	11	biological_process: pyrimidine nucleotide biosynthetic process	b3642,b1281,b0033,b0032,b4244,b1062,b4245,b4246,b0945
GO:0044205	2.8918820648546347e-13	7	7	biological_process: 'de novo' UMP biosynthetic process	b3642,b1281,b0032,b1062,b4245,b0945,b0033
GO:0006207	1.0136559450574475e-11	7	9	biological_process: 'de novo' pyrimidine nucleobase biosynthetic process	b3642,b1281,b0032,b4244,b1062,b4245,b0945
GO:0005829	7.938637728884367e-10	41	1032	cellular_component: cytosol	b1849,b2154,b4006,b0528,b2476,b1133,b4243,b1241,b2453,b1281,b0356,b0903,b3113,b0522,b0355,b2905,b0945,b2551,b3642,b1131,b2499,b0032,b2904,b2500,b3117,b4245,b2903,b0116,b0823,b0529,b0337,b3589,b3114,b2557,b3951,b0114,b1062,b2498,b0523,b2312,b0033
GO:0004022	7.094237642656342e-09	5	6	molecular_function: alcohol dehydrogenase (NAD) activity	b0356,b3589,b1478,b1241,b2453
GO:0019464	7.52391313839463e-08	4	4	biological_process: glycine decarboxylation via glycine cleavage system	b2905,b2904,b2903,b0116
GO:0070689	2.5340444876540055e-06	4	7	biological_process: L-threonine catabolic process to propionate	b3113,b3114,b3115,b3117
GO:0006546	4.650263733280484e-06	3	3	biological_process: glycine catabolic process	b2905,b2551,b2903
GO:0046294	4.650263733280484e-06	3	3	biological_process: formaldehyde catabolic process	b2154,b0356,b0355
GO:0006567	1.4631345938328733e-05	4	10	biological_process: threonine catabolic process	b0903,b3114,b3115,b3117
GO:0019856	1.8375337538951382e-05	3	4	biological_process: pyrimidine nucleobase biosynthetic process	b1062,b4246,b0033
GO:0006541	8.921396454894701e-05	4	15	biological_process: glutamine metabolic process	b2312,b0033,b2557,b0032
GO:0016597	8.921396454894701e-05	4	15	molecular_function: amino acid binding	b0033,b2551,b4245,b3117
GO:0003824	0.00010805318789003787	17	375	molecular_function: catalytic activity	b3952,b1281,b1131,b3114,b3951,b4006,b0903,b0114,b3117,b0824,b2498,b2903,b0945,b0823,b1241,b2551,b0529
GO:0005737	0.00011337232488032784	28	848	cellular_component: cytoplasm	b0824,b1133,b4243,b1281,b2873,b0356,b4244,b0903,b3953,b0357,b0945,b2551,b3642,b3952,b2499,b0032,b2904,b2500,b4245,b0116,b0512,b3114,b2557,b1062,b1132,b0115,b2312,b0033
GO:0046336	0.00011744223323528225	4	16	biological_process: ethanolamine catabolic process	b2456,b2454,b2455,b2453
GO:0042802	0.0001757511278301396	18	429	molecular_function: identical protein binding	b0904,b2154,b0337,b2873,b0356,b0116,b2456,b3113,b0114,b3117,b2498,b0523,b2903,b4243,b4245,b1241,b2551,b2312
GO:0005951	0.0002829279506279358	2	2	cellular_component: carbamoyl-phosphate synthase complex	b0032,b0033
GO:0004088	0.0002829279506279358	2	2	molecular_function: carbamoyl-phosphate synthase (glutamine-hydrolyzing) activity	b0032,b0033
GO:0006544	0.0002829279506279358	2	2	biological_process: glycine metabolic process	b2551,b2903
GO:0045250	0.0002829279506279358	2	2	cellular_component: cytosolic pyruvate dehydrogenase complex	b0114,b0116
GO:0004738	0.0002829279506279358	2	2	molecular_function: pyruvate dehydrogenase activity	b0114,b0115
GO:0009113	0.0002829279506279358	2	2	biological_process: purine nucleobase biosynthetic process	b4005,b2312
GO:0019858	0.0002829279506279358	2	2	biological_process: cytosine metabolic process	b0336,b0337
GO:0018738	0.0002829279506279358	2	2	molecular_function: S-formylglutathione hydrolase activity	b2154,b0355
GO:0016812	0.0002829279506279358	2	2	molecular_function: hydrolase activity, acting on carbon-nitrogen (but not peptide) bonds, in cyclic amides	b1062,b2873
GO:0004644	0.0002829279506279358	2	2	molecular_function: phosphoribosylglycinamide formyltransferase activity	b1849,b2500
GO:0004637	0.0002829279506279358	2	2	molecular_function: phosphoribosylamine-glycine ligase activity	b4005,b2499
GO:0005960	0.0002829279506279358	2	2	cellular_component: glycine cleavage complex	b2904,b2903
