GO:0019402	7.705966443314316e-12	5	5	biological_process: galactitol metabolic process	b2096,b2091,b2094,b2093,b2095
GO:0009401	3.128326330295067e-11	9	57	biological_process: phosphoenolpyruvate-dependent sugar phosphotransferase system	b4302,b4195,b2094,b2093,b4565,b4193,b4304,b2095,b4194
GO:0019854	6.998118382874844e-09	4	5	biological_process: L-ascorbic acid catabolic process	b4197,b4196,b3581,b4198
GO:0005975	1.5873964111321916e-08	10	154	biological_process: carbohydrate metabolic process	b4197,b2096,b3582,b4301,b3583,b4198,b4196,b2095,b3580,b3581
GO:0019852	2.4486278815294634e-07	3	3	biological_process: L-ascorbic acid metabolic process	b4197,b3582,b4198
GO:0019404	2.4486278815294634e-07	3	3	biological_process: galactitol catabolic process	b2096,b2091,b2095
GO:0015796	2.4486278815294634e-07	3	3	biological_process: galactitol transport	b2094,b2093,b4304
GO:0015882	2.4486278815294634e-07	3	3	biological_process: L-ascorbic acid transmembrane transport	b4195,b4194,b4193
GO:0090585	2.4486278815294634e-07	3	3	molecular_function: protein-phosphocysteine-L-ascorbate-phosphotransferase system transporter activity	b4195,b4194,b4193
GO:0019324	2.427587290568944e-06	3	5	biological_process: L-lyxose metabolic process	b3580,b3583,b3582
GO:0008643	2.834525606075606e-06	7	104	biological_process: carbohydrate transport	b4302,b2094,b2093,b4565,b4193,b4304,b3579
GO:0034219	5.576818325000321e-06	5	42	biological_process: carbohydrate transmembrane transport	b3577,b2094,b2093,b4565,b3578
GO:0019323	2.0042878187427636e-05	3	9	biological_process: pentose catabolic process	b4301,b3583,b4198
GO:0090584	4.080691595602486e-05	2	2	molecular_function: protein-phosphocysteine-galactitol-phosphotransferase system transporter activity	b2094,b2093
GO:0033982	4.080691595602486e-05	2	2	molecular_function: 3-dehydro-L-gulonate-6-phosphate decarboxylase activity	b4196,b3581
GO:0034015	4.080691595602486e-05	2	2	molecular_function: L-ribulose-5-phosphate 3-epimerase activity	b4197,b3582
GO:0016832	8.499983805362276e-05	3	14	molecular_function: aldehyde-lyase activity	b2096,b3583,b4198
GO:0008742	0.00012193102229199772	2	3	molecular_function: L-ribulose-phosphate 4-epimerase activity	b3583,b4198
GO:0004590	0.00012193102229199772	2	3	molecular_function: orotidine-5'-phosphate decarboxylase activity	b4196,b3581
GO:2001059	0.00024288681079591033	2	4	biological_process: D-tagatose 6-phosphate catabolic process	b2096,b2095
