GO:0003887	1.3743243775998796e-134	10	10	molecular_function: DNA-directed DNA polymerase activity	spr0795,spr0002,spr0836,spr0711,spr0769,spr0251,spr0896,spr0032,spr0673,spr0414
GO:0071897	2.2222310153184625e-108	9	10	biological_process: DNA biosynthetic process	spr0795,spr0002,spr0836,spr0711,spr0769,spr0251,spr0896,spr0032,spr0673
GO:0008408	1.7804723726195925e-81	7	8	molecular_function: 3'-5' exonuclease activity	spr0795,spr0002,spr0836,spr0711,spr0251,spr0896,spr0032
GO:0006261	5.194946416848973e-72	7	9	biological_process: DNA-dependent DNA replication	spr0836,spr0769,spr0251,spr0032,spr0673,spr0414,spr0715
GO:0006260	5.260558623132922e-64	12	29	biological_process: DNA replication	spr1066,spr1065,spr0795,spr0002,spr0836,spr0711,spr0769,spr0251,spr0414,spr0032,spr0673,spr0837
GO:0009360	1.7768707175100245e-39	3	3	cellular_component: DNA polymerase III complex	spr0769,spr0673,spr0002
GO:0009263	4.660307125908786e-26	2	2	biological_process: deoxyribonucleotide biosynthetic process	spr1065,spr1066
GO:0006235	4.660307125908786e-26	2	2	biological_process: dTTP biosynthetic process	spr0585,spr0835
GO:0044776	4.660307125908786e-26	2	2	cellular_component: DNA polymerase III, core complex	spr0711,spr0896
GO:0045004	4.660307125908786e-26	2	2	biological_process: DNA replication proofreading	spr0711,spr0896
GO:0004748	4.660307125908786e-26	2	2	molecular_function: ribonucleoside-diphosphate reductase activity, thioredoxin disulfide as acceptor	spr1065,spr1066
GO:0005971	4.660307125908786e-26	2	2	cellular_component: ribonucleoside-diphosphate reductase complex	spr1065,spr1066
GO:0016779	6.609608952598741e-25	8	31	molecular_function: nucleotidyltransferase activity	spr0795,spr0002,spr0836,spr0769,spr0896,spr0251,spr0414,spr0032
GO:0090305	5.638942207646106e-21	8	36	biological_process: nucleic acid phosphodiester bond hydrolysis	spr1044,spr0795,spr0002,spr0836,spr0711,spr0896,spr0251,spr0032
GO:0003684	8.19914642471793e-19	3	6	molecular_function: damaged DNA binding	spr1757,spr0025,spr0414
GO:0008094	1.0902982227715333e-09	2	5	molecular_function: DNA-dependent ATPase activity	spr1757,spr0025
GO:0009165	1.0902982227715333e-09	2	5	biological_process: nucleotide biosynthetic process	spr0585,spr0835
GO:0003676	6.773513333286596e-08	6	47	molecular_function: nucleic acid binding	spr1044,spr0795,spr0711,spr0896,spr0251,spr0032
GO:0004527	6.874312736110036e-08	3	13	molecular_function: exonuclease activity	spr0711,spr0032,spr0251
GO:0006271	4.360879425343949e-06	1	2	biological_process: DNA strand elongation involved in DNA replication	spr0002
GO:0043137	4.360879425343949e-06	1	2	biological_process: DNA replication, removal of RNA primer	spr1044
GO:0032299	4.360879425343949e-06	1	2	cellular_component: ribonuclease H2 complex	spr1044
GO:0004523	4.360879425343949e-06	1	2	molecular_function: RNA-DNA hybrid ribonuclease activity	spr1044
GO:0009041	4.360879425343949e-06	1	2	molecular_function: uridylate kinase activity	spr0835
GO:0006139	1.0273298330094984e-05	2	8	biological_process: nucleobase-containing compound metabolic process	spr0711,spr0032
GO:0006974	1.036766709836038e-05	4	29	biological_process: cellular response to DNA damage stimulus	spr1757,spr0414,spr0032,spr0025
GO:0003677	2.4437352993409757e-05	10	154	molecular_function: DNA binding	spr0002,spr0025,spr0711,spr0769,spr0251,spr0414,spr0032,spr1757,spr0673,spr0715
GO:0004518	2.983839848805399e-05	4	31	molecular_function: nuclease activity	spr1044,spr0032,spr0251,spr0711
GO:0009432	5.391240751969825e-05	2	9	biological_process: SOS response	spr1757,spr0414
GO:0006281	0.00034597977868849335	4	37	biological_process: DNA repair	spr1757,spr0414,spr0032,spr0025
GO:0000725	0.0006196054849068233	1	3	biological_process: recombinational repair	spr0025
GO:0008409	0.0006196054849068233	1	3	molecular_function: 5'-3' exonuclease activity	spr0032
GO:0005737	0.0011169988880185414	13	299	cellular_component: cytoplasm	spr1044,spr0835,spr0795,spr0002,spr0251,spr1043,spr0585,spr0414,spr0032,spr1757,spr0838,spr0024,spr0715
GO:0003735	6.668714272074049e-215	53	56	molecular_function: structural constituent of ribosome	spr0198,spr1171,spr0187,spr0190,spr0191,spr0204,spr1394,spr0195,spr2009,spr1467,spr0203,spr1212,spr1396,spr0194,spr0764,spr0205,spr0862,spr0200,spr1944,spr0248,spr0555,spr1014,spr0556,spr0199,spr0208,spr1807,spr0682,spr0213,spr1211,spr0272,spr0398,spr0078,spr0740,spr0197,spr2020,spr1943,spr0188,spr0206,spr1012,spr0271,spr0249,spr0189,spr0216,spr0192,spr0207,spr1177,spr0214,spr0196,spr0201,spr0863,spr1271,spr0202,spr0212
GO:0005840	1.5715552144805936e-207	54	60	cellular_component: ribosome	spr0198,spr1171,spr0187,spr0190,spr0191,spr0204,spr1394,spr0195,spr2009,spr1467,spr0203,spr1212,spr1396,spr0194,spr0764,spr0205,spr0862,spr0200,spr1944,spr0248,spr0555,spr1014,spr0556,spr0199,spr0208,spr1807,spr0682,spr0213,spr1211,spr0272,spr0398,spr0078,spr0740,spr0197,spr2020,spr1943,spr0188,spr0206,spr1012,spr0271,spr0249,spr0189,spr0216,spr0192,spr0207,spr1177,spr0214,spr0196,spr0686,spr0201,spr0863,spr1271,spr0202,spr0212
GO:0006412	4.399824839339745e-167	63	99	biological_process: translation	spr0198,spr1171,spr0187,spr0204,spr0190,spr0191,spr2009,spr1394,spr0195,spr1467,spr0861,spr0203,spr1212,spr1396,spr0194,spr0764,spr0846,spr0205,spr0862,spr0392,spr0665,spr1944,spr0200,spr0248,spr0250,spr1014,spr0555,spr0556,spr0924,spr0199,spr0208,spr1807,spr0682,spr0213,spr1211,spr0272,spr0398,spr0078,spr0740,spr0197,spr2020,spr1943,spr0188,spr0206,spr1012,spr0271,spr0211,spr0249,spr0189,spr0216,spr0192,spr0207,spr1177,spr2019,spr0214,spr0196,spr0201,spr0863,spr1343,spr1271,spr0202,spr0212,spr1881
GO:0019843	2.1203226262431785e-120	34	40	molecular_function: rRNA binding	spr0198,spr0204,spr0190,spr0191,spr1394,spr0195,spr2009,spr1467,spr0203,spr1212,spr1396,spr0194,spr0205,spr0200,spr0248,spr0555,spr0556,spr0199,spr0208,spr0213,spr0078,spr0740,spr0188,spr0206,spr1012,spr0211,spr0249,spr0189,spr0192,spr0214,spr0196,spr0201,spr0863,spr0202
GO:0022625	1.3679964439979028e-100	24	24	cellular_component: cytosolic large ribosomal subunit	spr1171,spr0204,spr0190,spr0191,spr2009,spr1212,spr0194,spr0205,spr0862,spr0200,spr0555,spr1014,spr0556,spr0199,spr0208,spr1211,spr0197,spr0188,spr0271,spr0216,spr0207,spr0196,spr0201,spr0863
GO:0003723	8.41807976382115e-62	40	97	molecular_function: RNA binding	spr0198,spr0187,spr0204,spr0190,spr0191,spr2009,spr1394,spr0195,spr1467,spr0203,spr1212,spr1396,spr0194,spr0764,spr0205,spr0200,spr0248,spr0555,spr0556,spr0199,spr0208,spr0213,spr0683,spr0272,spr0078,spr0740,spr0188,spr0206,spr1012,spr0211,spr0249,spr0189,spr0192,spr0214,spr0480,spr0390,spr0196,spr0201,spr0863,spr0202
GO:0022627	1.3024008238824139e-53	13	13	cellular_component: cytosolic small ribosomal subunit	spr0198,spr0249,spr0192,spr0214,spr0195,spr1394,spr0272,spr2020,spr1467,spr2011,spr0203,spr1396,spr0764
GO:0015935	2.1996483277718623e-49	12	12	cellular_component: small ribosomal subunit	spr0249,spr0187,spr0192,spr0682,spr0213,spr0272,spr0078,spr0740,spr2020,spr0202,spr0248,spr0206
GO:0015934	3.643940952095472e-45	11	11	cellular_component: large ribosomal subunit	spr0199,spr0208,spr0191,spr0216,spr0207,spr0862,spr1943,spr1212,spr0194,spr0555,spr0556
GO:0070181	2.359758151103484e-12	4	5	molecular_function: small ribosomal subunit rRNA binding	spr1396,spr0740,spr0214,spr1394
GO:0003746	2.359758151103484e-12	4	5	molecular_function: translation elongation factor activity	spr0392,spr0250,spr1343,spr2019
GO:0006414	2.359758151103484e-12	4	5	biological_process: translational elongation	spr0392,spr0250,spr1343,spr2019
GO:0070180	7.37194978901056e-12	3	3	molecular_function: large ribosomal subunit rRNA binding	spr0199,spr0555,spr1212
GO:0003729	5.632249064053486e-10	4	6	molecular_function: mRNA binding	spr0195,spr0249,spr0271,spr0764
GO:0043022	7.382728919017894e-09	5	10	molecular_function: ribosome binding	spr0362,spr0686,spr2011,spr0861,spr0211
GO:0000049	4.7456908014108965e-08	8	25	molecular_function: tRNA binding	spr0249,spr0187,spr0213,spr0196,spr0201,spr1881,spr0248,spr0556
GO:0002181	8.073517928267102e-08	2	2	biological_process: cytoplasmic translation	spr0204,spr0191
GO:0032790	8.073517928267102e-08	2	2	biological_process: ribosome disassembly	spr0861,spr0250
GO:0003747	8.073517928267102e-08	2	2	molecular_function: translation release factor activity	spr0924,spr0665
GO:0016020	1.7700272552819084e-07	0	493	cellular_component: membrane	
GO:0000027	4.822652268118586e-07	4	8	biological_process: ribosomal large subunit assembly	spr0863,spr0190,spr0555,spr0201
GO:0016021	1.4936093578362237e-06	0	450	cellular_component: integral component of membrane	
GO:0000028	1.4970090210871627e-06	3	5	biological_process: ribosomal small subunit assembly	spr0249,spr0192,spr0214
GO:0006415	1.4970090210871627e-06	3	5	biological_process: translational termination	spr0924,spr0846,spr0665
GO:0006417	6.366835592267191e-05	2	3	biological_process: regulation of translation	spr2011,spr0556
GO:0003743	6.366835592267191e-05	2	3	molecular_function: translation initiation factor activity	spr0861,spr0211
GO:0016149	6.366835592267191e-05	2	3	molecular_function: translation release factor activity, codon specific	spr0924,spr0665
GO:0006351	0.0002378775812827492	3	7	biological_process: transcription, DNA-templated	spr0215,spr1777,spr1776
GO:0003899	0.0002378775812827492	3	7	molecular_function: DNA-directed 5'-3' RNA polymerase activity	spr0215,spr1777,spr1776
GO:0006413	0.0016041678523250381	2	4	biological_process: translational initiation	spr0861,spr0211
GO:0008658	1.9832390827301383e-89	4	5	molecular_function: penicillin binding	spr0304,spr0329,spr1517,spr1823
GO:0004180	1.948755913372417e-62	3	4	molecular_function: carboxypeptidase activity	spr0776,spr0329,spr1823
GO:0009002	1.948755913372417e-62	3	4	molecular_function: serine-type D-Ala-D-Ala carboxypeptidase activity	spr0776,spr0329,spr1823
GO:0009252	6.0332721776498886e-49	7	27	biological_process: peptidoglycan biosynthetic process	spr1517,spr0329,spr1540,spr0776,spr1823,spr0304,spr0305
GO:0046677	1.6917132689886138e-43	4	10	biological_process: response to antibiotic	spr0304,spr1823,spr1517,spr0329
GO:0008144	1.6179755272603677e-36	2	3	molecular_function: drug binding	spr0329,spr1823
GO:0008955	1.6179755272603677e-36	2	3	molecular_function: peptidoglycan glycosyltransferase activity	spr0329,spr1823
GO:0071555	4.1776468199828247e-26	5	25	biological_process: cell wall organization	spr1517,spr0776,spr0304,spr0305,spr0329
GO:0008360	4.6135058247071035e-23	5	28	biological_process: regulation of cell shape	spr1517,spr0776,spr0304,spr0305,spr0329
GO:0006310	5.173063255130503e-10	3	22	biological_process: DNA recombination	spr1539,spr1516,spr0330
GO:0044038	1.3446299344949813e-08	1	3	biological_process: cell wall macromolecule biosynthetic process	spr0305
GO:0005887	1.224076929638714e-07	4	48	cellular_component: integral component of plasma membrane	spr0304,spr0303,spr1517,spr0305
GO:0006974	2.706973462403667e-07	3	29	biological_process: cellular response to DNA damage stimulus	spr1539,spr1516,spr0330
GO:0007049	2.706973462403667e-07	3	29	biological_process: cell cycle	spr0304,spr0303,spr0305
GO:0006508	2.414330820838873e-06	4	56	biological_process: proteolysis	spr0776,spr0329,spr1517,spr1823
GO:0016780	2.5763057601305417e-06	1	4	molecular_function: phosphotransferase activity, for other substituted phosphate groups	spr0305
GO:0051301	4.694413225014382e-06	3	34	biological_process: cell division	spr0304,spr0303,spr0305
GO:0006281	1.7727352638921436e-05	3	37	biological_process: DNA repair	spr1539,spr1516,spr0330
GO:0043093	5.7294925824543505e-05	1	5	biological_process: FtsZ-dependent cytokinesis	spr0303
GO:0008233	0.00018905842379024726	3	44	molecular_function: peptidase activity	spr0776,spr0329,spr1823
GO:0070475	0.00043785599545682907	1	6	biological_process: rRNA base methylation	spr0302
GO:0032153	0.00043785599545682907	1	6	cellular_component: cell division site	spr0303
GO:0008982	7.708293065733805e-95	16	34	molecular_function: protein-N(PI)-phosphohistidine-sugar phosphotransferase activity	spr0356,spr0358,spr1070,spr0423,spr0229,spr0278,spr1834,spr0231,spr0280,spr1835,spr1836,spr0425,spr0780,spr0421,spr0230,spr0282
GO:0034219	5.867843881622965e-92	16	35	biological_process: carbohydrate transmembrane transport	spr0356,spr0358,spr1070,spr0423,spr0229,spr0278,spr1834,spr0231,spr0280,spr1835,spr1836,spr0425,spr0780,spr0421,spr0230,spr0282
GO:1901264	6.9069566248568094e-77	6	6	biological_process: carbohydrate derivative transport	spr1070,spr1834,spr0231,spr0425,spr0421,spr0282
GO:0103111	4.3174611209126716e-73	9	14	molecular_function: D-glucosamine PTS permease activity	spr0358,spr0229,spr0278,spr0780,spr0280,spr0423,spr1836,spr1835,spr0230
GO:0009401	2.9305615143705556e-71	17	50	biological_process: phosphoenolpyruvate-dependent sugar phosphotransferase system	spr0356,spr1071,spr0358,spr1070,spr0229,spr0278,spr1834,spr0231,spr1835,spr0423,spr1836,spr0280,spr0425,spr0780,spr0421,spr0230,spr0282
GO:0005988	1.0077876766928577e-52	5	6	biological_process: lactose metabolic process	spr0779,spr1076,spr1074,spr1075,spr1073
GO:0019512	1.0077876766928577e-52	5	6	biological_process: lactose catabolic process via tagatose-6-phosphate	spr0424,spr1076,spr1074,spr1075,spr1073
GO:0009024	6.668962206915158e-38	3	3	molecular_function: tagatose-6-phosphate kinase activity	spr0779,spr1073,spr1074
GO:2001059	6.668962206915158e-38	3	3	biological_process: D-tagatose 6-phosphate catabolic process	spr0779,spr1073,spr1074
GO:0005990	6.125723483328947e-28	3	4	biological_process: lactose catabolic process	spr0424,spr1076,spr1075
GO:0019388	5.149075065116009e-25	2	2	biological_process: galactose catabolic process	spr1076,spr1075
GO:0008662	5.149075065116009e-25	2	2	molecular_function: 1-phosphofructokinase activity	spr0779,spr1074
GO:0050044	5.149075065116009e-25	2	2	molecular_function: galactose-6-phosphate isomerase activity	spr1076,spr1075
GO:0019316	5.149075065116009e-25	2	2	biological_process: D-allose catabolic process	spr1076,spr1075
GO:0008643	3.0787267374435423e-18	8	39	biological_process: carbohydrate transport	spr0356,spr1070,spr1834,spr0425,spr0231,spr0780,spr0421,spr0282
GO:0004751	3.173397281570387e-16	2	3	molecular_function: ribose-5-phosphate isomerase activity	spr1076,spr1075
GO:0008443	3.173397281570387e-16	2	3	molecular_function: phosphofructokinase activity	spr0779,spr1074
GO:0090563	4.0157101454708436e-13	3	8	molecular_function: protein-phosphocysteine-sugar phosphotransferase activity	spr0356,spr0780,spr0358
GO:0016740	2.153207261094957e-12	19	264	molecular_function: transferase activity	spr0356,spr0779,spr1071,spr0358,spr1070,spr1074,spr0229,spr0278,spr1834,spr0231,spr1835,spr0423,spr1836,spr0280,spr0425,spr0780,spr0421,spr0230,spr0282
GO:0009052	7.183928793077111e-12	2	4	biological_process: pentose-phosphate shunt, non-oxidative branch	spr1076,spr1075
GO:0016310	9.282752899211598e-09	9	87	biological_process: phosphorylation	spr0356,spr0779,spr1070,spr1074,spr0278,spr0425,spr1835,spr1073,spr0230
GO:0016773	1.4248269303217557e-07	2	6	molecular_function: phosphotransferase activity, alcohol group as acceptor	spr0779,spr1074
GO:0008422	1.4248269303217557e-07	2	6	molecular_function: beta-glucosidase activity	spr0424,spr1833
GO:0016301	6.889125004892676e-07	8	84	molecular_function: kinase activity	spr0356,spr0779,spr1070,spr1074,spr0278,spr0425,spr1835,spr0230
GO:0046835	2.302949482472883e-06	2	7	biological_process: carbohydrate phosphorylation	spr0779,spr1074
GO:0102483	7.723855281983454e-06	1	2	molecular_function: scopolin beta-glucosidase activity	spr1833
GO:0033920	7.723855281983454e-06	1	2	molecular_function: 6-phospho-beta-galactosidase activity	spr0424
GO:0016052	1.81697840622522e-05	2	8	biological_process: carbohydrate catabolic process	spr0424,spr1833
GO:0005975	0.00032531148323427573	6	72	biological_process: carbohydrate metabolic process	spr0424,spr0779,spr1076,spr1833,spr1074,spr1075
GO:0016861	0.0008954291127143633	1	3	molecular_function: intramolecular oxidoreductase activity, interconverting aldoses and ketoses	spr1075
GO:0051082	5.855402023320787e-155	4	7	molecular_function: unfolded protein binding	spr0455,spr1723,spr1722,spr0454
GO:0051087	1.233562134564276e-135	2	2	molecular_function: chaperone binding	spr1723,spr0454
GO:0006457	9.179643759219268e-108	4	10	biological_process: protein folding	spr0455,spr1723,spr1722,spr0454
GO:0051085	8.914204853595465e-90	2	3	biological_process: chaperone cofactor-dependent protein refolding	spr1723,spr1722
GO:0050790	5.8261178287889325e-33	1	2	biological_process: regulation of catalytic activity	spr0454
GO:0042803	5.8261178287889325e-33	1	2	molecular_function: protein homodimerization activity	spr0454
GO:0009408	5.8261178287889325e-33	1	2	biological_process: response to heat	spr1722
GO:0042026	1.2532678717694244e-21	1	3	biological_process: protein refolding	spr1722
GO:0045892	0.00014651780693026965	1	13	biological_process: negative regulation of transcription, DNA-templated	spr0453
GO:0003743	1.2532678717694244e-21	1	3	molecular_function: translation initiation factor activity	spr0481
GO:0031564	1.2532678717694244e-21	1	3	biological_process: transcription antitermination	spr0478
GO:0042254	2.4865263580498438e-21	2	12	biological_process: ribosome biogenesis	spr0477,spr0482
GO:0042274	5.338346190596842e-16	1	4	biological_process: ribosomal small subunit biogenesis	spr0477
GO:0006413	5.338346190596842e-16	1	4	biological_process: translational initiation	spr0481
GO:0006353	5.338346190596842e-16	1	4	biological_process: DNA-templated transcription, termination	spr0478
GO:0043024	5.338346190596842e-16	1	4	molecular_function: ribosomal small subunit binding	spr0482
GO:0000028	1.2106523155542964e-12	1	5	biological_process: ribosomal small subunit assembly	spr0477
GO:0006633	3.025581213862992e-217	12	15	biological_process: fatty acid biosynthetic process	spr0380,spr0387,spr0037,spr0377,spr0378,spr0385,spr0381,spr0386,spr0038,spr0384,spr0383,spr0382
GO:0006631	5.917335240695935e-166	9	11	biological_process: fatty acid metabolic process	spr0387,spr0377,spr0378,spr0385,spr0381,spr0386,spr0038,spr0382,spr0383
GO:0006629	2.1699438560391596e-107	11	25	biological_process: lipid metabolic process	spr0387,spr0037,spr0377,spr0378,spr0385,spr0381,spr0386,spr0038,spr0384,spr0383,spr0382
GO:0003989	1.5194155676146717e-89	4	4	molecular_function: acetyl-CoA carboxylase activity	spr0383,spr0385,spr0387,spr0386
GO:0009317	7.690258689281559e-67	3	3	cellular_component: acetyl-CoA carboxylase complex	spr0383,spr0387,spr0386
GO:2001295	7.690258689281559e-67	3	3	biological_process: malonyl-CoA biosynthetic process	spr0385,spr0387,spr0386
GO:0000035	3.2426121660259234e-44	2	2	molecular_function: acyl binding	spr0038,spr0378
GO:0004315	3.2426121660259234e-44	2	2	molecular_function: 3-oxoacyl-[acyl-carrier-protein] synthase activity	spr0382,spr0377
GO:0102132	3.2426121660259234e-44	2	2	molecular_function: 3-oxo-pimeloyl-[acp] methyl ester reductase activity	spr0381,spr0701
GO:0004316	3.2426121660259234e-44	2	2	molecular_function: 3-oxoacyl-[acyl-carrier-protein] reductase (NADPH) activity	spr0381,spr0701
GO:0102131	3.2426121660259234e-44	2	2	molecular_function: 3-oxo-glutaryl-[acp] methyl ester reductase activity	spr0381,spr0701
GO:0009245	5.94871372364508e-29	2	3	biological_process: lipid A biosynthetic process	spr0038,spr0384
GO:0000036	5.94871372364508e-29	2	3	molecular_function: acyl carrier activity	spr0038,spr0378
GO:0016743	2.3314544045030916e-21	2	4	molecular_function: carboxyl- or carbamoyltransferase activity	spr0387,spr0386
GO:0016836	1.8387464347001644e-10	1	2	molecular_function: hydro-lyase activity	spr0384
GO:0016746	2.3558423093794837e-07	3	23	molecular_function: transferase activity, transferring acyl groups	spr0382,spr0377,spr0380
GO:0006644	8.865928387631236e-07	1	3	biological_process: phospholipid metabolic process	spr0037
GO:0016747	2.027554430915588e-06	2	12	molecular_function: transferase activity, transferring acyl groups other than amino-acyl groups	spr0037,spr0382
GO:0046940	5.3302721031154384e-170	2	4	biological_process: nucleoside monophosphate phosphorylation	spr1456,spr0845
GO:0044210	2.956128003411842e-84	1	2	biological_process: 'de novo' CTP biosynthetic process	spr0845
GO:0009041	2.956128003411842e-84	1	2	molecular_function: uridylate kinase activity	spr0845
GO:0006220	1.0294483695347428e-55	1	3	biological_process: pyrimidine nucleotide metabolic process	spr1456
GO:0006139	3.053998735633671e-20	1	8	biological_process: nucleobase-containing compound metabolic process	spr1456
GO:0006221	1.6644461489289172e-14	1	11	biological_process: pyrimidine nucleotide biosynthetic process	spr0845
GO:0016301	3.206533634833349e-07	2	84	molecular_function: kinase activity	spr1456,spr0845
GO:0016310	5.939207165481154e-07	2	87	biological_process: phosphorylation	spr1456,spr0845
GO:0006164	1.3920747548795196e-68	13	16	biological_process: purine nucleotide biosynthetic process	spr0052,spr0054,spr0045,spr0051,spr0049,spr0729,spr0047,spr0046,spr2033,spr0056,spr1300,spr0048,spr0053
GO:0006189	6.390413125276101e-59	9	9	biological_process: 'de novo' IMP biosynthetic process	spr0052,spr0054,spr0045,spr0051,spr0049,spr0047,spr0056,spr0048,spr0053
GO:0016874	3.6367826832088878e-28	17	58	molecular_function: ligase activity	spr0509,spr0492,spr0052,spr0054,spr0045,spr0438,spr0626,spr0507,spr1109,spr0519,spr0235,spr1890,spr0696,spr1502,spr1300,spr0048,spr0046
GO:0004812	8.001987815742336e-23	9	21	molecular_function: aminoacyl-tRNA ligase activity	spr0509,spr0626,spr0507,spr0519,spr0235,spr1890,spr0696,spr1502,spr0492
GO:0006418	2.004035287743606e-19	7	15	biological_process: tRNA aminoacylation for protein translation	spr0626,spr0519,spr0235,spr1890,spr0696,spr1502,spr0492
GO:0030983	4.3269191338043054e-19	3	3	molecular_function: mismatched DNA binding	spr0368,spr0160,spr1888
GO:0032300	4.3269191338043054e-19	3	3	cellular_component: mismatch repair complex	spr0368,spr0160,spr1888
GO:0006177	1.4187461718971132e-12	2	2	biological_process: GMP biosynthetic process	spr1300,spr2033
GO:0009113	1.4187461718971132e-12	2	2	biological_process: purine nucleobase biosynthetic process	spr0052,spr0047
GO:0004637	1.4187461718971132e-12	2	2	molecular_function: phosphoribosylamine-glycine ligase activity	spr0048,spr0052
GO:0006432	1.4187461718971132e-12	2	2	biological_process: phenylalanyl-tRNA aminoacylation	spr0509,spr0507
GO:0004826	1.4187461718971132e-12	2	2	molecular_function: phenylalanine-tRNA ligase activity	spr0509,spr0507
GO:0035999	8.305210033821343e-11	3	5	biological_process: tetrahydrofolate interconversion	spr0729,spr1109,spr0928
GO:0006298	9.127440675407167e-09	3	6	biological_process: mismatch repair	spr0368,spr0160,spr1888
GO:0106074	2.5371670647339987e-07	3	7	biological_process: aminoacyl-tRNA metabolism involved in translational fidelity	spr1502,spr0235,spr0492
GO:0002161	2.5371670647339987e-07	3	7	molecular_function: aminoacyl-tRNA editing activity	spr1502,spr0235,spr0492
GO:0006730	2.5371670647339987e-07	3	7	biological_process: one-carbon metabolic process	spr0729,spr1109,spr0928
GO:0000049	2.7231814287947746e-07	6	25	molecular_function: tRNA binding	spr0509,spr0626,spr0926,spr0507,spr0696,spr1502
GO:0005829	1.1939185525564815e-06	20	207	cellular_component: cytosol	spr0492,spr0054,spr0045,spr0051,spr0049,spr0729,spr0438,spr0626,spr0519,spr0928,spr0235,spr1694,spr1695,spr0056,spr1300,spr0048,spr1502,spr1888,spr0922,spr0516
GO:0000166	1.0093897314102075e-05	22	261	molecular_function: nucleotide binding	spr0368,spr0509,spr0694,spr0045,spr2033,spr0922,spr1109,spr0519,spr1695,spr0696,spr1888,spr0052,spr0507,spr0235,spr1502,spr1300,spr0492,spr0054,spr0438,spr0626,spr1890,spr0048
GO:0005524	3.3386602040695456e-05	21	254	molecular_function: ATP binding	spr0368,spr0509,spr0694,spr0045,spr0922,spr1109,spr0519,spr0696,spr1888,spr0052,spr0507,spr0235,spr1502,spr1300,spr0160,spr0492,spr0054,spr0438,spr0626,spr1890,spr0048
GO:0008094	0.00017554801982142882	2	5	molecular_function: DNA-dependent ATPase activity	spr0368,spr1888
GO:0005515	0.00017554801982142882	2	5	molecular_function: protein binding	spr1690,spr1691
GO:0006541	0.00030385962808676296	3	11	biological_process: glutamine metabolic process	spr0438,spr1300,spr0047
GO:0006396	0.000826828485256433	3	12	biological_process: RNA processing	spr1092,spr0520,spr0516
GO:0016020	0.0014129149706753976	2	493	cellular_component: membrane	spr0693,spr0695
GO:1990077	1.144034945563991e-112	2	3	cellular_component: primosome complex	spr2008,spr0978
GO:0006269	1.144034945563991e-112	2	3	biological_process: DNA replication, synthesis of RNA primer	spr2008,spr0978
GO:0006352	1.7650391588170442e-41	1	2	biological_process: DNA-templated transcription, initiation	spr0979
GO:0046467	1.7650391588170442e-41	1	2	biological_process: membrane lipid biosynthetic process	spr0981
GO:0016758	2.80335042229084e-27	1	3	molecular_function: transferase activity, transferring hexosyl groups	spr0981
GO:0006268	3.245123806104558e-20	1	4	biological_process: DNA unwinding involved in DNA replication	spr2008
GO:0006071	3.3389404267536957e-13	1	6	biological_process: glycerol metabolic process	spr0981
GO:0003899	3.23967905518493e-11	1	7	molecular_function: DNA-directed 5'-3' RNA polymerase activity	spr0978
GO:0006260	1.5155649029709478e-10	2	29	biological_process: DNA replication	spr2008,spr0978
GO:0003678	1.379757219432925e-08	1	9	molecular_function: DNA helicase activity	spr2008
GO:0046677	1.12849275284044e-07	1	10	biological_process: response to antibiotic	spr0981
GO:0004386	0.0002365830823566684	1	17	molecular_function: helicase activity	spr2008
GO:0003677	0.000631362198506609	3	154	molecular_function: DNA binding	spr2008,spr0978,spr0979
GO:0006096	8.186996295352023e-60	8	10	biological_process: glycolytic process	spr0796,spr0441,spr0797,spr1499,spr1882,spr1432,spr1036,spr0530
GO:0005978	2.4538673714261706e-37	4	4	biological_process: glycogen biosynthetic process	spr1030,spr1031,spr1032,spr1029
GO:0044205	1.3419359090940244e-36	6	9	biological_process: 'de novo' UMP biosynthetic process	spr0613,spr0614,spr1155,spr1154,spr1153,spr1053
GO:0004022	2.1393266628808206e-29	4	5	molecular_function: alcohol dehydrogenase (NAD) activity	spr1670,spr1866,spr1837,spr0262
GO:0006221	2.198396501091355e-29	6	11	biological_process: pyrimidine nucleotide biosynthetic process	spr0613,spr0614,spr1155,spr1154,spr1153,spr1053
GO:0005977	8.421397065336527e-28	3	3	biological_process: glycogen metabolic process	spr1030,spr1917,spr1029
GO:0006094	4.0448057077265454e-24	4	6	biological_process: gluconeogenesis	spr1499,spr1432,spr1882,spr0441
GO:0006526	2.3091043693700927e-20	4	7	biological_process: arginine biosynthetic process	spr0102,spr0103,spr1154,spr1153
GO:0030388	2.507013355340695e-18	2	2	biological_process: fructose 1,6-bisphosphate metabolic process	spr0796,spr0530
GO:0004845	2.507013355340695e-18	2	2	molecular_function: uracil phosphoribosyltransferase activity	spr1156,spr0655
GO:0004088	2.507013355340695e-18	2	2	molecular_function: carbamoyl-phosphate synthase (glutamine-hydrolyzing) activity	spr1154,spr1153
GO:0016757	1.7561346360330548e-13	7	29	molecular_function: transferase activity, transferring glycosyl groups	spr0614,spr0655,spr1156,spr1916,spr1032,spr1917,spr1029
GO:0006807	4.825029265037747e-13	3	6	biological_process: nitrogen compound metabolic process	spr1155,spr1154,spr1153
GO:0016868	4.825029265037747e-13	3	6	molecular_function: intramolecular transferase activity, phosphotransferases	spr0887,spr1499,spr0219
GO:0006207	4.825029265037747e-13	3	6	biological_process: 'de novo' pyrimidine nucleobase biosynthetic process	spr0613,spr1155,spr1154
GO:0048029	8.279364389963101e-12	2	3	molecular_function: monosaccharide binding	spr0796,spr1882
GO:0016620	1.1004660111844983e-06	2	5	molecular_function: oxidoreductase activity, acting on the aldehyde or oxo group of donors, NAD or NADP as acceptor	spr1825,spr1837
GO:0009116	0.00018300334162264662	3	15	biological_process: nucleoside metabolic process	spr1156,spr0614,spr0655
GO:0043169	0.0002915623464746434	1	2	molecular_function: cation binding	spr1029
GO:0042450	0.0002915623464746434	1	2	biological_process: arginine biosynthetic process via ornithine	spr0103
GO:0004550	0.0002915623464746434	1	2	molecular_function: nucleoside diphosphate kinase activity	spr1775
GO:0006165	0.0002915623464746434	1	2	biological_process: nucleoside diphosphate phosphorylation	spr1775
GO:0006002	0.0002915623464746434	1	2	biological_process: fructose 6-phosphate metabolic process	spr0796
GO:0051156	0.0002915623464746434	1	2	biological_process: glucose 6-phosphate metabolic process	spr1882
GO:0019856	0.0002915623464746434	1	2	biological_process: pyrimidine nucleobase biosynthetic process	spr0614
GO:0006241	0.0002915623464746434	1	2	biological_process: CTP biosynthetic process	spr1775
GO:0043531	0.0002915623464746434	1	2	molecular_function: ADP binding	spr0441
GO:0004590	0.0002915623464746434	1	2	molecular_function: orotidine-5'-phosphate decarboxylase activity	spr0613
GO:0008655	0.0002915623464746434	1	2	biological_process: pyrimidine-containing compound salvage	spr0655
GO:0044206	0.0002915623464746434	1	2	biological_process: UMP salvage	spr0655
GO:0016208	0.0002915623464746434	1	2	molecular_function: AMP binding	spr0796
GO:0019563	0.0002915623464746434	1	2	biological_process: glycerol catabolic process	spr1432
GO:0006183	0.0002915623464746434	1	2	biological_process: GTP biosynthetic process	spr1775
GO:0005737	0.0003738180917858391	17	299	cellular_component: cytoplasm	spr0796,spr1155,spr1154,spr1153,spr0797,spr0441,spr0102,spr0887,spr0219,spr1916,spr1775,spr1917,spr1882,spr1432,spr1036,spr0103,spr1029
GO:0046933	3.37580394372792e-159	8	8	molecular_function: proton-transporting ATP synthase activity, rotational mechanism	spr1362,spr1363,spr1365,spr1361,spr1364,spr1366,spr1360,spr1359
GO:0015986	3.37580394372792e-159	8	8	biological_process: ATP synthesis coupled proton transport	spr1362,spr1363,spr1365,spr1361,spr1364,spr1366,spr1360,spr1359
GO:0006754	4.6469866923609035e-141	8	9	biological_process: ATP biosynthetic process	spr1362,spr1363,spr1365,spr1361,spr1364,spr1366,spr1360,spr1359
GO:0045261	8.053334204220827e-99	5	5	cellular_component: proton-transporting ATP synthase complex, catalytic core F(1)	spr1359,spr1362,spr1363,spr1361,spr1360
GO:0006811	2.77646530162014e-89	8	14	biological_process: ion transport	spr1362,spr1363,spr1365,spr1359,spr1361,spr1364,spr1366,spr1360
GO:0015078	8.811932539396192e-59	3	3	molecular_function: proton transmembrane transporter activity	spr1365,spr1364,spr1366
GO:0045263	8.811932539396192e-59	3	3	cellular_component: proton-transporting ATP synthase complex, coupling factor F(o)	spr1365,spr1364,spr1366
GO:0008861	7.281724171027733e-39	2	2	molecular_function: formate C-acetyltransferase activity	spr0232,spr0415
GO:0046034	7.281724171027733e-39	2	2	biological_process: ATP metabolic process	spr1360,spr1362
GO:0052587	7.281724171027733e-39	2	2	molecular_function: diacetyl reductase ((R)-acetoin forming) activity	spr1050,spr1051
GO:0019152	7.281724171027733e-39	2	2	molecular_function: acetoin dehydrogenase activity	spr1050,spr1051
GO:0046961	7.281724171027733e-39	2	2	molecular_function: proton-transporting ATPase activity, rotational mechanism	spr1360,spr1362
GO:0042777	7.281724171027733e-39	2	2	biological_process: plasma membrane ATP synthesis coupled proton transport	spr1365,spr1361
GO:1902600	4.433962241755706e-24	3	7	biological_process: proton transmembrane transport	spr1360,spr1366,spr1362
GO:0006567	3.6475350272545764e-09	1	2	biological_process: threonine catabolic process	spr0415
GO:0043531	3.6475350272545764e-09	1	2	molecular_function: ADP binding	spr1362
GO:0004459	3.6475350272545764e-09	1	2	molecular_function: L-lactate dehydrogenase activity	spr1100
GO:0016746	2.3969782986954974e-06	3	23	molecular_function: transferase activity, transferring acyl groups	spr1049,spr0232,spr0415
GO:0016668	6.238681312393567e-06	1	3	molecular_function: oxidoreductase activity, acting on a sulfur group of donors, NAD(P) as acceptor	spr1048
GO:0006006	0.0002365830823566684	1	4	biological_process: glucose metabolic process	spr0415
GO:0009401	3.0751889762824565e-79	13	50	biological_process: phosphoenolpyruvate-dependent sugar phosphotransferase system	spr1063,spr0063,spr0259,spr1968,spr0260,spr1967,spr0062,spr0061,spr1969,spr1062,spr0060,spr1970,spr0261
GO:0008643	8.856994584714313e-28	7	39	biological_process: carbohydrate transport	spr0259,spr1967,spr0062,spr1969,spr1062,spr0060,spr0261
GO:0005887	1.0583827013776538e-15	6	48	cellular_component: integral component of plasma membrane	spr0259,spr1968,spr0260,spr1967,spr0062,spr0061
GO:0008982	1.331189361635063e-15	5	34	molecular_function: protein-N(PI)-phosphohistidine-sugar phosphotransferase activity	spr0259,spr0260,spr1969,spr0060,spr0261
GO:0034219	4.274662172402433e-15	5	35	biological_process: carbohydrate transmembrane transport	spr0259,spr0260,spr1969,spr0060,spr0261
GO:0016740	7.336270601450645e-10	12	264	molecular_function: transferase activity	spr0063,spr0259,spr1968,spr0260,spr1967,spr0062,spr0061,spr1969,spr1062,spr0060,spr1970,spr0261
GO:0016301	4.996998237758355e-08	6	84	molecular_function: kinase activity	spr0063,spr1969,spr1062,spr0060,spr1970,spr0261
GO:0016310	1.1099432780331994e-07	6	87	biological_process: phosphorylation	spr0063,spr1969,spr1062,spr0060,spr1970,spr0261
GO:0103111	7.889783922277104e-06	2	14	molecular_function: D-glucosamine PTS permease activity	spr0260,spr0259
GO:0006605	1.955585360817658e-60	4	4	biological_process: protein targeting	spr0209,spr1123,spr1821,spr1544
GO:0015031	1.2704429849391766e-34	6	15	biological_process: protein transport	spr0877,spr1544,spr1821,spr1790,spr0209,spr1852
GO:0015450	9.215437486737959e-30	2	2	molecular_function: P-P-bond-hydrolysis-driven protein transmembrane transporter activity	spr1821,spr0877
GO:0065002	9.215437486737959e-30	2	2	biological_process: intracellular protein transmembrane transport	spr0209,spr1544
GO:0006886	9.215437486737959e-30	2	2	biological_process: intracellular protein transport	spr1821,spr1544
GO:0071806	9.215437486737959e-30	2	2	biological_process: protein transmembrane transport	spr1821,spr0877
GO:0006614	9.215437486737959e-30	2	2	biological_process: SRP-dependent cotranslational protein targeting to membrane	spr1123,spr1166
GO:0006612	9.215437486737959e-30	2	2	biological_process: protein targeting to membrane	spr1123,spr1166
GO:0031522	9.215437486737959e-30	2	2	cellular_component: cell envelope Sec protein transport complex	spr0209,spr1544
GO:0043952	9.215437486737959e-30	2	2	biological_process: protein transport by the Sec complex	spr0209,spr1544
GO:0009306	9.215437486737959e-30	2	2	biological_process: protein secretion	spr1821,spr0877
GO:0032977	9.215437486737959e-30	2	2	molecular_function: membrane insertase activity	spr1852,spr1790
GO:0051205	9.215437486737959e-30	2	2	biological_process: protein insertion into membrane	spr1852,spr1790
GO:0090501	3.8762796421725933e-11	2	5	biological_process: RNA phosphodiester bond hydrolysis	spr1127,spr0878
GO:0005887	4.6928663259880964e-09	6	48	cellular_component: integral component of plasma membrane	spr0296,spr1544,spr1790,spr0209,spr1840,spr1852
GO:0016070	5.683538661666263e-07	1	2	biological_process: RNA metabolic process	spr0878
GO:1990904	5.683538661666263e-07	1	2	cellular_component: ribonucleoprotein complex	spr1166
GO:0008757	5.683538661666263e-07	1	2	molecular_function: S-adenosylmethionine-dependent methyltransferase activity	spr0880
GO:0004525	5.683538661666263e-07	1	2	molecular_function: ribonuclease III activity	spr1127
GO:0042781	5.683538661666263e-07	1	2	molecular_function: 3'-tRNA processing endoribonuclease activity	spr1853
GO:0034414	5.683538661666263e-07	1	2	biological_process: tRNA 3'-trailer cleavage, endonucleolytic	spr1853
GO:0003725	5.683538661666263e-07	1	2	molecular_function: double-stranded RNA binding	spr1127
GO:0030261	5.683538661666263e-07	1	2	biological_process: chromosome condensation	spr1126
GO:0032784	5.683538661666263e-07	1	2	biological_process: regulation of DNA-templated transcription, elongation	spr1820
GO:0006354	5.683538661666263e-07	1	2	biological_process: DNA-templated transcription, elongation	spr1820
GO:0016791	4.048548626437147e-05	2	10	molecular_function: phosphatase activity	spr1125,spr1124
GO:0031564	0.00016608649102885795	1	3	biological_process: transcription antitermination	spr1820
GO:0016311	0.0017941050948041416	2	14	biological_process: dephosphorylation	spr1125,spr1124
GO:0006817	3.70542953616051e-279	9	9	biological_process: phosphate ion transport	spr1256,spr1899,spr1257,spr1254,spr1896,spr1252,spr1253,spr1895,spr1898
GO:0005315	1.7181130136913555e-216	7	7	molecular_function: inorganic phosphate transmembrane transporter activity	spr1256,spr1897,spr1255,spr1896,spr1253,spr1254,spr1898
GO:0035435	5.0758624056336985e-154	5	5	biological_process: phosphate ion transmembrane transport	spr1897,spr1255,spr1253,spr1254,spr1898
GO:0015415	8.757600794345451e-92	3	3	molecular_function: ATPase-coupled phosphate ion transmembrane transporter activity	spr1253,spr1254,spr1898
GO:0045936	5.805000322896757e-40	2	3	biological_process: negative regulation of phosphate metabolic process	spr1252,spr1899
GO:0030643	5.805000322896757e-40	2	3	biological_process: cellular phosphate ion homeostasis	spr1252,spr1899
GO:0042803	1.6644461489289172e-14	1	2	molecular_function: protein homodimerization activity	spr1899
GO:0005886	6.474657395046033e-08	9	236	cellular_component: plasma membrane	spr1256,spr1257,spr1254,spr1897,spr1896,spr1255,spr1253,spr1895,spr1898
GO:0001510	5.8261178287889325e-33	1	5	biological_process: RNA methylation	spr1259
GO:0007165	6.715347256498077e-18	1	9	biological_process: signal transduction	spr1260
GO:0032259	0.00015541931850549938	1	33	biological_process: methylation	spr1259
GO:1902600	2.922485428686911e-23	1	7	biological_process: proton transmembrane transport	spr1410
GO:0019877	1.1300259920444289e-169	5	5	biological_process: diaminopimelate biosynthetic process	spr1414,spr0918,spr0919,spr1907,spr1906
GO:0009085	6.864194172981662e-141	5	6	biological_process: lysine biosynthetic process	spr1414,spr0918,spr0919,spr1907,spr1906
GO:0009089	6.155813918579375e-105	5	8	biological_process: lysine biosynthetic process via diaminopimelate	spr1414,spr0918,spr0919,spr1907,spr1906
GO:0009088	2.6921150866074183e-75	3	4	biological_process: threonine biosynthetic process	spr0918,spr1218,spr1219
GO:0008652	3.2790492049512105e-32	7	48	biological_process: cellular amino acid biosynthetic process	spr1414,spr1219,spr0919,spr0918,spr1218,spr1907,spr1906
GO:0050661	7.183254246606748e-22	3	13	molecular_function: NADP binding	spr1414,spr1219,spr0918
GO:0009086	4.358407785637459e-18	2	7	biological_process: methionine biosynthetic process	spr1219,spr0918
GO:0016407	4.966309095045379e-16	1	2	molecular_function: acetyltransferase activity	spr1907
GO:0006566	4.966309095045379e-16	1	2	biological_process: threonine metabolic process	spr1218
GO:0071266	4.966309095045379e-16	1	2	biological_process: 'de novo' L-methionine biosynthetic process	spr0918
GO:0009097	1.1308056311271394e-15	2	8	biological_process: isoleucine biosynthetic process	spr1219,spr0918
GO:0051287	8.404383171078532e-14	2	9	molecular_function: NAD binding	spr1414,spr0918
GO:0035999	4.860138709299512e-06	1	5	biological_process: tetrahydrofolate interconversion	spr1905
GO:0016620	4.860138709299512e-06	1	5	molecular_function: oxidoreductase activity, acting on the aldehyde or oxo group of donors, NAD or NADP as acceptor	spr0918
GO:0009396	5.771397832180648e-05	1	6	biological_process: folic acid-containing compound biosynthetic process	spr1905
GO:0046983	5.771397832180648e-05	1	6	molecular_function: protein dimerization activity	spr0918
GO:0015744	1.3203793445258684e-55	2	2	biological_process: succinate transport	spr1576,spr1575
GO:0006351	7.083146880568544e-15	2	7	biological_process: transcription, DNA-templated	spr0437,spr1582
GO:0003899	7.083146880568544e-15	2	7	molecular_function: DNA-directed 5'-3' RNA polymerase activity	spr0437,spr1582
GO:0016742	3.0834672717649205e-13	1	2	molecular_function: hydroxymethyl-, formyl- and related transferase activity	spr1580
GO:0015970	3.0834672717649205e-13	1	2	biological_process: guanosine tetraphosphate biosynthetic process	spr1487
GO:0015969	3.0834672717649205e-13	1	2	biological_process: guanosine tetraphosphate metabolic process	spr1487
GO:0006470	3.0834672717649205e-13	1	2	biological_process: protein dephosphorylation	spr1578
GO:0004722	3.0834672717649205e-13	1	2	molecular_function: protein serine/threonine phosphatase activity	spr1578
GO:0004674	3.0834672717649205e-13	1	2	molecular_function: protein serine/threonine kinase activity	spr1577
GO:0006270	1.3446299344949813e-08	1	3	biological_process: DNA replication initiation	spr1581
GO:0006468	1.3446299344949813e-08	1	3	biological_process: protein phosphorylation	spr1577
GO:0004672	1.3446299344949813e-08	1	3	molecular_function: protein kinase activity	spr1577
GO:0008649	1.3446299344949813e-08	1	3	molecular_function: rRNA methyltransferase activity	spr1579
GO:1990077	1.3446299344949813e-08	1	3	cellular_component: primosome complex	spr1581
GO:0006269	1.3446299344949813e-08	1	3	biological_process: DNA replication, synthesis of RNA primer	spr1581
GO:0006163	2.5763057601305417e-06	1	4	biological_process: purine nucleotide metabolic process	spr1583
GO:0006413	2.5763057601305417e-06	1	4	biological_process: translational initiation	spr1580
GO:0006268	2.5763057601305417e-06	1	4	biological_process: DNA unwinding involved in DNA replication	spr1581
GO:0043138	2.5763057601305417e-06	1	4	molecular_function: 3'-5' DNA helicase activity	spr1581
GO:0016788	5.7294925824543505e-05	1	5	molecular_function: hydrolase activity, acting on ester bonds	spr1486
GO:0006302	5.7294925824543505e-05	1	5	biological_process: double-strand break repair	spr1581
GO:0001510	5.7294925824543505e-05	1	5	biological_process: RNA methylation	spr1579
GO:0070475	0.00043785599545682907	1	6	biological_process: rRNA base methylation	spr1579
GO:0000917	0.00043785599545682907	1	6	biological_process: division septum assembly	spr1577
GO:0006166	6.5185514292356066e-127	3	3	biological_process: purine ribonucleoside salvage	spr1435,spr0011,spr1662
GO:0006168	3.7933509403740053e-84	2	2	biological_process: adenine salvage	spr0011,spr1435
GO:0009116	7.565171286466253e-24	3	15	biological_process: nucleoside metabolic process	spr1435,spr0011,spr1662
GO:0016879	3.053998735633671e-20	1	2	molecular_function: ligase activity, forming carbon-nitrogen bonds	spr0010
GO:0044209	3.053998735633671e-20	1	2	biological_process: AMP salvage	spr1435
GO:0015851	3.053998735633671e-20	1	2	biological_process: nucleobase transport	spr1663
GO:0016208	3.053998735633671e-20	1	2	molecular_function: AMP binding	spr1435
GO:0030163	3.2732792542840574e-13	1	3	biological_process: protein catabolic process	spr0012
GO:0004176	3.2732792542840574e-13	1	3	molecular_function: ATP-dependent peptidase activity	spr0012
GO:0016757	1.2626503963494292e-11	3	29	molecular_function: transferase activity, transferring glycosyl groups	spr1435,spr0011,spr1662
GO:0016763	2.6251158150383227e-06	1	6	molecular_function: transferase activity, transferring pentosyl groups	spr1662
GO:0044262	1.0294483695347428e-55	1	2	biological_process: cellular carbohydrate metabolic process	spr1797
GO:0008649	9.860170416322035e-37	1	3	molecular_function: rRNA methyltransferase activity	spr1799
GO:0019323	9.860170416322035e-37	1	3	biological_process: pentose catabolic process	spr1797
GO:0016857	2.80335042229084e-27	1	4	molecular_function: racemase and epimerase activity, acting on carbohydrates and derivatives	spr1797
GO:0042274	2.80335042229084e-27	1	4	biological_process: ribosomal small subunit biogenesis	spr1798
GO:0031167	2.80335042229084e-27	1	4	biological_process: rRNA methylation	spr1799
GO:0009052	2.80335042229084e-27	1	4	biological_process: pentose-phosphate shunt, non-oxidative branch	spr1797
GO:0006098	1.2532678717694244e-21	1	5	biological_process: pentose-phosphate shunt	spr1797
GO:0042254	1.3446299344949813e-08	1	12	biological_process: ribosome biogenesis	spr1798
GO:0003924	8.865928387631236e-07	1	15	molecular_function: GTPase activity	spr1798
GO:0006364	6.238681312393567e-06	1	17	biological_process: rRNA processing	spr1799
GO:0003723	0.0007250123352608568	2	97	molecular_function: RNA binding	spr1799,spr1798
GO:0004590	1.6644461489289172e-14	1	2	molecular_function: orotidine-5'-phosphate decarboxylase activity	spr1846
GO:0009401	2.7340213139287096e-13	5	50	biological_process: phosphoenolpyruvate-dependent sugar phosphotransferase system	spr1938,spr1849,spr1940,spr1939,spr1848
GO:0016861	1.9747252527688514e-09	1	3	molecular_function: intramolecular oxidoreductase activity, interconverting aldoses and ketoses	spr1845
GO:0019323	1.9747252527688514e-09	1	3	biological_process: pentose catabolic process	spr1844
GO:0016832	6.241586213616668e-07	1	4	molecular_function: aldehyde-lyase activity	spr1844
GO:0008982	1.0278204984147175e-06	3	34	molecular_function: protein-N(PI)-phosphohistidine-sugar phosphotransferase activity	spr1940,spr1939,spr1848
GO:0034219	1.7207286429986298e-06	3	35	biological_process: carbohydrate transmembrane transport	spr1940,spr1939,spr1848
GO:0006207	0.00017503392274179847	1	6	biological_process: 'de novo' pyrimidine nucleobase biosynthetic process	spr1846
