GO:0009401	4.1633797311709483e-19	13	50	biological_process: phosphoenolpyruvate-dependent sugar phosphotransferase system	spr0062,spr1969,spr0061,spr0260,spr0259,spr1968,spr1970,spr1063,spr0063,spr1967,spr0060,spr0261,spr1062
GO:0008643	1.609525614068608e-08	7	39	biological_process: carbohydrate transport	spr0062,spr1969,spr0259,spr1967,spr0060,spr0261,spr1062
GO:0016740	2.9718092841159354e-08	12	264	molecular_function: transferase activity	spr0062,spr1969,spr0061,spr0260,spr0259,spr1968,spr1970,spr0063,spr1967,spr0060,spr0261,spr1062
GO:0005887	1.8777233360943838e-06	6	48	cellular_component: integral component of plasma membrane	spr0062,spr0061,spr0260,spr1968,spr0259,spr1967
GO:0008982	7.733192090681754e-06	5	34	molecular_function: protein-N(PI)-phosphohistidine-sugar phosphotransferase activity	spr1969,spr0260,spr0259,spr0060,spr0261
GO:0034219	8.896528330235388e-06	5	35	biological_process: carbohydrate transmembrane transport	spr1969,spr0260,spr0259,spr0060,spr0261
GO:0016301	4.593211911313692e-05	6	84	molecular_function: kinase activity	spr1062,spr1969,spr1970,spr0063,spr0060,spr0261
GO:0016310	5.593599537970084e-05	6	87	biological_process: phosphorylation	spr1062,spr1969,spr1970,spr0063,spr0060,spr0261
