GO:0006096	5.077038953641223e-11	8	10	biological_process: glycolytic process	spr0530,spr1432,spr0797,spr1036,spr1499,spr1882,spr0441,spr0796
GO:0044205	4.7236898424945e-08	6	9	biological_process: 'de novo' UMP biosynthetic process	spr1053,spr0613,spr1154,spr0614,spr1153,spr1155
GO:0006221	1.525916554001205e-07	6	11	biological_process: pyrimidine nucleotide biosynthetic process	spr1053,spr0613,spr1154,spr0614,spr1153,spr1155
GO:0005978	1.9950260110904343e-06	4	4	biological_process: glycogen biosynthetic process	spr1031,spr1030,spr1029,spr1032
GO:0016757	2.9423537899396555e-06	7	29	molecular_function: transferase activity, transferring glycosyl groups	spr1917,spr1156,spr1916,spr1029,spr0655,spr0614,spr1032
GO:0004022	4.795097455980161e-06	4	5	molecular_function: alcohol dehydrogenase (NAD) activity	spr1670,spr1837,spr0262,spr1866
GO:0006094	9.788862317851199e-06	4	6	biological_process: gluconeogenesis	spr1499,spr1432,spr0441,spr1882
GO:0006526	1.7853779790606104e-05	4	7	biological_process: arginine biosynthetic process	spr1153,spr1154,spr0103,spr0102
GO:0005977	4.241041367466538e-05	3	3	biological_process: glycogen metabolic process	spr1917,spr1030,spr1029
GO:0005737	6.602066309923845e-05	17	299	cellular_component: cytoplasm	spr0219,spr1917,spr0887,spr1029,spr1775,spr1916,spr0797,spr1882,spr1036,spr0103,spr0796,spr1154,spr0102,spr1153,spr1432,spr0441,spr1155
GO:0006807	0.00032425018218236484	3	6	biological_process: nitrogen compound metabolic process	spr1153,spr1154,spr1155
GO:0016868	0.00032425018218236484	3	6	molecular_function: intramolecular transferase activity, phosphotransferases	spr0219,spr0887,spr1499
GO:0006207	0.00032425018218236484	3	6	biological_process: 'de novo' pyrimidine nucleobase biosynthetic process	spr1154,spr1155,spr0613
GO:0030388	0.0009214623155151759	2	2	biological_process: fructose 1,6-bisphosphate metabolic process	spr0530,spr0796
GO:0004845	0.0009214623155151759	2	2	molecular_function: uracil phosphoribosyltransferase activity	spr1156,spr0655
GO:0004088	0.0009214623155151759	2	2	molecular_function: carbamoyl-phosphate synthase (glutamine-hydrolyzing) activity	spr1153,spr1154
