GO:0030964	1.018180167388465e-100	14	14	cellular_component: NADH dehydrogenase complex	b2282,b2284,b2277,b2279,b2283,b2281,b2276,b2278,b2280,b2286,b1109,b2285,b2287,b2288
GO:0003954	8.199023611184008e-89	15	18	molecular_function: NADH dehydrogenase activity	b2282,b2284,b2287,b2277,b2279,b2283,b2281,b2276,b2278,b2280,b2286,b2484,b2285,b2488,b2288
GO:0045272	2.864821848309849e-87	14	16	cellular_component: plasma membrane respiratory chain complex I	b2282,b2284,b2287,b2277,b2279,b2283,b2281,b2276,b2278,b2280,b2286,b2285,b2488,b2288
GO:0009060	1.4957323756139846e-84	17	24	biological_process: aerobic respiration	b2488,b2282,b0429,b2284,b2287,b0721,b0432,b2277,b0431,b2281,b2283,b2276,b0723,b1109,b0722,b0724,b0430
GO:0008137	9.804240564828063e-82	14	17	molecular_function: NADH dehydrogenase (ubiquinone) activity	b2284,b2277,b2279,b2283,b2482,b2276,b2278,b2280,b2286,b1109,b2487,b2287,b2288,b2489
GO:0048038	3.255892743710443e-79	15	20	molecular_function: quinone binding	b2282,b2284,b2277,b2279,b2283,b2281,b2276,b2278,b2280,b2286,b2285,b2487,b2287,b2288,b2489
GO:0006099	1.266788029355253e-68	17	29	biological_process: tricarboxylic acid cycle	b0727,b0721,b3236,b0320,b2210,b4122,b0723,b0518,b1612,b4153,b1611,b0726,b0722,b1136,b0729,b0728,b0724
GO:0015990	2.8961206006528326e-64	9	9	biological_process: electron transport coupled proton transport	b0429,b2287,b0432,b2277,b0431,b2276,b2278,b2484,b0430
GO:0019646	2.8961206006528326e-64	9	9	biological_process: aerobic electron transport chain	b0978,b0429,b0733,b0734,b0432,b0431,b0979,b1109,b0430
GO:0055114	1.6512559323422148e-49	64	448	biological_process: oxidation-reduction process	b0978,b0733,b2488,b3908,b0721,b0432,b1479,b0041,b2276,b1378,b2487,b2463,b1697,b0042,b2489,b0430,b2282,b0306,b4515,b0307,b0734,b2277,b1698,b0431,b0979,b2281,b3152,b2286,b2280,b0723,b2485,b2483,b0722,b1656,b4154,b2481,b2288,b2486,b0429,b2284,b2279,b0073,b2278,b2210,b1109,b1415,b0726,b2287,b3962,b0724,b1800,b1387,b2482,b2770,b2283,b3236,b2285,b3003,b4153,b2490,b2484,b1136,b2769,b4211
GO:0042773	4.765500158595954e-43	7	8	biological_process: ATP synthesis coupled electron transport	b0432,b2279,b2277,b2283,b2482,b2276,b2278
GO:0000104	1.6909365911564534e-42	6	6	molecular_function: succinate dehydrogenase activity	b4152,b0721,b0723,b4151,b0722,b4154
GO:0050136	1.6909365911564534e-42	6	6	molecular_function: NADH dehydrogenase (quinone) activity	b2279,b2281,b2276,b2286,b2287,b2288
GO:0016651	2.641853437009067e-40	8	11	molecular_function: oxidoreductase activity, acting on NAD(P)H	b2284,b2279,b2283,b2281,b2286,b2487,b2488,b2288
GO:0006119	2.8564055962104393e-35	5	5	biological_process: oxidative phosphorylation	b0978,b0733,b4515,b0734,b0979
GO:0044569	1.7710713904549737e-33	8	13	cellular_component: [Ni-Fe] hydrogenase complex	b2482,b2484,b2485,b2487,b2483,b2488,b2486,b2481
GO:0009055	9.502453669295239e-32	21	83	molecular_function: electron transfer activity	b0978,b0733,b0721,b0432,b0041,b1697,b0042,b0430,b1698,b0734,b0431,b0979,b0723,b0722,b4154,b0429,b0724,b2770,b2283,b4153,b2769
GO:0016682	4.716135633700128e-31	6	8	molecular_function: oxidoreductase activity, acting on diphenols and related substances as donors, oxygen as acceptor	b0978,b0733,b0734,b0432,b0431,b0979
GO:0006108	6.383093497584716e-29	5	6	biological_process: malate metabolic process	b1800,b1479,b3236,b1611,b2463
GO:0004775	4.596139194410256e-28	4	4	molecular_function: succinate-CoA ligase (ADP-forming) activity	b0518,b0729,b0728,b0320
GO:0009361	4.596139194410256e-28	4	4	cellular_component: succinate-CoA ligase complex (ADP-forming)	b0518,b0729,b0728,b0320
GO:0015453	4.596139194410256e-28	4	4	molecular_function: oxidoreduction-driven active transmembrane transporter activity	b0432,b0429,b0431,b0430
GO:0009486	4.596139194410256e-28	4	4	molecular_function: cytochrome bo3 ubiquinol oxidase activity	b0432,b0429,b0431,b0430
GO:0009319	4.596139194410256e-28	4	4	cellular_component: cytochrome o ubiquinol oxidase complex	b0432,b0429,b0431,b0430
GO:0070069	4.596139194410256e-28	4	4	cellular_component: cytochrome complex	b0978,b0733,b0979,b0734
GO:0102040	4.596139194410256e-28	4	4	molecular_function: fumarate reductase (menaquinone)	b4152,b4153,b4154,b4151
GO:0045284	4.596139194410256e-28	4	4	cellular_component: plasma membrane fumarate reductase complex	b4152,b4153,b4154,b4151
GO:0015078	9.755429485839539e-22	6	11	molecular_function: proton transmembrane transporter activity	b3738,b0429,b3737,b0432,b0431,b0430
GO:0006113	5.1064434911950635e-21	5	8	biological_process: fermentation	b4152,b3236,b4153,b4151,b4154
GO:0004776	6.886044327164605e-21	3	3	molecular_function: succinate-CoA ligase (GDP-forming) activity	b0518,b0729,b0320
GO:0008827	6.886044327164605e-21	3	3	molecular_function: cytochrome o ubiquinol oxidase activity	b0432,b0429,b0430
GO:0004129	6.886044327164605e-21	3	3	molecular_function: cytochrome-c oxidase activity	b0432,b0431,b0430
GO:0008177	6.886044327164605e-21	3	3	molecular_function: succinate dehydrogenase (ubiquinone) activity	b0723,b0724,b0721
GO:0022900	1.421462841723983e-17	14	63	biological_process: electron transport chain	b1697,b1698,b0721,b0432,b2770,b0041,b0723,b1378,b4153,b0722,b1136,b2769,b4154,b0042
GO:0016655	3.1320908566062003e-15	3	4	molecular_function: oxidoreductase activity, acting on NAD(P)H, quinone or similar compound as acceptor	b2282,b2286,b4211
GO:0015765	3.1320908566062003e-15	3	4	biological_process: methylgalactoside transport	b2149,b2150,b2148
GO:0045263	3.1320908566062003e-15	3	4	cellular_component: proton-transporting ATP synthase complex, coupling factor F(o)	b3737,b3738,b3739
GO:0016491	8.88565664485476e-14	35	356	molecular_function: oxidoreductase activity	b3908,b0432,b1479,b1378,b2487,b2463,b2489,b0430,b0723,b2485,b2483,b1656,b4154,b2481,b0429,b0073,b2210,b1109,b1415,b0726,b3962,b0724,b1800,b1387,b2482,b2283,b3236,b4153,b2285,b3003,b2490,b2484,b1136,b2486,b4211
GO:0006091	9.134305708593586e-14	2	2	biological_process: generation of precursor metabolites and energy	b1612,b4122
GO:0003861	9.134305708593586e-14	2	2	molecular_function: 3-isopropylmalate dehydratase activity	b0071,b0072
GO:0003862	9.134305708593586e-14	2	2	molecular_function: 3-isopropylmalate dehydrogenase activity	b0073,b1800
GO:0070469	9.134305708593586e-14	2	2	cellular_component: respiratory chain	b0432,b0431
GO:0045252	9.134305708593586e-14	2	2	cellular_component: oxoglutarate dehydrogenase complex	b0727,b0726
GO:0004471	9.134305708593586e-14	2	2	molecular_function: malate dehydrogenase (decarboxylating) (NAD+) activity	b1479,b2463
GO:0004470	9.134305708593586e-14	2	2	molecular_function: malic enzyme activity	b1479,b2463
GO:0006106	9.134305708593586e-14	2	2	biological_process: fumarate metabolic process	b1611,b4151
GO:0005354	9.134305708593586e-14	2	2	molecular_function: galactose transmembrane transporter activity	b2149,b2148
GO:0042777	9.134305708593586e-14	2	2	biological_process: plasma membrane ATP synthesis coupled proton transport	b3738,b3733
GO:0009098	5.894025609846001e-13	4	8	biological_process: leucine biosynthetic process	b0071,b0072,b0074,b0073
GO:0048039	7.31050330013994e-12	3	5	molecular_function: ubiquinone binding	b2277,b0431,b0721
GO:0004333	7.31050330013994e-12	3	5	molecular_function: fumarate hydratase activity	b1611,b1612,b4122
GO:0006754	2.663189441592225e-11	4	9	biological_process: ATP biosynthetic process	b3738,b3731,b3733,b3737
GO:0046933	2.663189441592225e-11	4	9	molecular_function: proton-transporting ATP synthase activity, rotational mechanism	b3738,b3731,b3733,b3737
GO:0015986	2.663189441592225e-11	4	9	biological_process: ATP synthesis coupled proton transport	b3738,b3731,b3733,b3737
GO:0051287	1.4467296298439853e-10	9	42	molecular_function: NAD binding	b2284,b1800,b1479,b3152,b2286,b0073,b2487,b2463,b1136
GO:0016627	5.525913516025788e-10	4	10	molecular_function: oxidoreductase activity, acting on the CH-CH group of donors	b0722,b0723,b4154,b0721
GO:0033539	8.37226810362813e-09	2	3	biological_process: fatty acid beta-oxidation using acyl-CoA dehydrogenase	b0042,b1698
GO:0016679	8.37226810362813e-09	2	3	molecular_function: oxidoreductase activity, acting on diphenols and related substances as donors	b0733,b4515
GO:0036525	8.37226810362813e-09	2	3	biological_process: protein deglycation	b3153,b0424
GO:0036524	8.37226810362813e-09	2	3	molecular_function: protein deglycase activity	b3153,b0424
GO:0006801	8.37226810362813e-09	2	3	biological_process: superoxide metabolic process	b1656,b3908
GO:0008948	8.37226810362813e-09	2	3	molecular_function: oxaloacetate decarboxylase activity	b1479,b2463
GO:0004784	8.37226810362813e-09	2	3	molecular_function: superoxide dismutase activity	b1656,b3908
GO:0015592	8.37226810362813e-09	2	3	molecular_function: methylgalactoside transmembrane transporter activity	b2149,b2148
GO:0051539	1.4416619762406538e-08	15	117	molecular_function: 4 iron, 4 sulfur cluster binding	b2488,b2284,b0307,b2283,b2281,b4122,b4153,b1378,b2487,b1612,b2287,b0072,b2481,b0724,b2489
GO:0015757	4.6545751340838066e-08	3	7	biological_process: galactose transmembrane transport	b2149,b2150,b2148
GO:0051536	4.387475934409865e-07	16	146	molecular_function: iron-sulfur cluster binding	b2488,b2284,b0307,b2283,b2281,b4122,b2285,b1378,b2487,b4153,b1612,b2287,b0072,b2481,b0724,b2489
GO:0046961	6.917227521098136e-07	3	8	molecular_function: proton-transporting ATPase activity, rotational mechanism	b3738,b3733,b3737
GO:0042413	2.2958243564826796e-06	2	4	biological_process: carnitine catabolic process	b0041,b0042
GO:0045333	2.871758526461003e-05	3	10	biological_process: cellular respiration	b0428,b2284,b2283
GO:0044780	3.362259183131209e-05	4	17	biological_process: bacterial-type flagellum assembly	b4152,b4153,b4154,b4151
GO:0015741	6.266653254059136e-05	2	5	biological_process: fumarate transport	b3528,b4123
GO:0019430	6.266653254059136e-05	2	5	biological_process: removal of superoxide radicals	b1656,b3908
GO:0009082	7.852292604750519e-05	4	18	biological_process: branched-chain amino acid biosynthetic process	b0071,b0072,b0074,b0073
GO:0022904	0.00010896711974742217	3	11	biological_process: respiratory electron transport chain	b0431,b0724,b0430
GO:0050660	0.00012449550946244298	8	61	molecular_function: flavin adenine dinucleotide binding	b1698,b3962,b2210,b0723,b1109,b2769,b4154,b0042
GO:0009061	0.00013165153012815875	7	49	biological_process: anaerobic respiration	b4152,b3236,b0723,b1109,b4153,b4151,b4154
GO:0020037	0.00021275449542095836	6	39	molecular_function: heme binding	b0978,b0733,b0734,b0721,b0431,b0722
GO:0019752	0.0005443819810271818	2	6	biological_process: carboxylic acid metabolic process	b0074,b3236
GO:0071422	0.0005443819810271818	2	6	biological_process: succinate transmembrane transport	b3528,b4123
GO:0045261	0.0005443819810271818	2	6	cellular_component: proton-transporting ATP synthase complex, catalytic core F(1)	b3733,b3731
