GO:0003887	1.219574226132755e-19	10	10	molecular_function: DNA-directed DNA polymerase activity	spr0251,spr0673,spr0414,spr0711,spr0032,spr0769,spr0836,spr0795,spr0896,spr0002
GO:0071897	1.1903044447069494e-16	9	10	biological_process: DNA biosynthetic process	spr0251,spr0673,spr0711,spr0032,spr0769,spr0836,spr0795,spr0896,spr0002
GO:0006260	4.70422670383141e-16	12	29	biological_process: DNA replication	spr0251,spr0837,spr1066,spr0673,spr0414,spr0711,spr0032,spr0769,spr0836,spr1065,spr0795,spr0002
GO:0008408	7.737403673082315e-13	7	8	molecular_function: 3'-5' exonuclease activity	spr0251,spr0711,spr0032,spr0836,spr0795,spr0896,spr0002
GO:0006261	3.44706553199584e-12	7	9	biological_process: DNA-dependent DNA replication	spr0715,spr0251,spr0673,spr0414,spr0032,spr0769,spr0836
GO:0016779	7.036874499902828e-09	8	31	molecular_function: nucleotidyltransferase activity	spr0251,spr0414,spr0032,spr0769,spr0836,spr0795,spr0896,spr0002
GO:0090305	2.571002071166043e-08	8	36	biological_process: nucleic acid phosphodiester bond hydrolysis	spr0251,spr1044,spr0711,spr0032,spr0836,spr0795,spr0896,spr0002
GO:0009360	3.4722719159704178e-06	3	3	cellular_component: DNA polymerase III complex	spr0673,spr0769,spr0002
GO:0003677	5.1017080594066166e-05	10	154	molecular_function: DNA binding	spr0715,spr0251,spr0673,spr0414,spr0025,spr0711,spr0032,spr0769,spr1757,spr0002
GO:0003676	5.682853997589509e-05	6	47	molecular_function: nucleic acid binding	spr0251,spr1044,spr0711,spr0032,spr0795,spr0896
GO:0003684	6.729553338971624e-05	3	6	molecular_function: damaged DNA binding	spr0414,spr0025,spr1757
GO:0005737	0.0001756819897783341	13	299	cellular_component: cytoplasm	spr0838,spr0715,spr1043,spr0251,spr0414,spr1044,spr0585,spr0032,spr0024,spr1757,spr0795,spr0002,spr0835
GO:0009263	0.00023898288882515797	2	2	biological_process: deoxyribonucleotide biosynthetic process	spr1066,spr1065
GO:0006235	0.00023898288882515797	2	2	biological_process: dTTP biosynthetic process	spr0585,spr0835
GO:0044776	0.00023898288882515797	2	2	cellular_component: DNA polymerase III, core complex	spr0896,spr0711
GO:0045004	0.00023898288882515797	2	2	biological_process: DNA replication proofreading	spr0896,spr0711
GO:0004748	0.00023898288882515797	2	2	molecular_function: ribonucleoside-diphosphate reductase activity, thioredoxin disulfide as acceptor	spr1066,spr1065
GO:0005971	0.00023898288882515797	2	2	cellular_component: ribonucleoside-diphosphate reductase complex	spr1066,spr1065
GO:0006974	0.0008778711879249487	4	29	biological_process: cellular response to DNA damage stimulus	spr0414,spr0025,spr1757,spr0032
GO:0004527	0.000894310148387436	3	13	molecular_function: exonuclease activity	spr0711,spr0251,spr0032
GO:0016740	0.0011113607996087733	11	264	molecular_function: transferase activity	spr0838,spr0251,spr0414,spr0585,spr0032,spr0769,spr0836,spr0795,spr0896,spr0002,spr0835
GO:0004518	0.0011383711328859449	4	31	molecular_function: nuclease activity	spr1044,spr0711,spr0251,spr0032
GO:0003735	1.1624449397053373e-75	53	56	molecular_function: structural constituent of ribosome	spr0862,spr1396,spr0192,spr0201,spr2009,spr1014,spr0216,spr0200,spr0078,spr0248,spr0740,spr1212,spr1394,spr0187,spr0398,spr0214,spr0213,spr0206,spr0188,spr0204,spr0863,spr0202,spr1271,spr0249,spr0196,spr1171,spr0195,spr0198,spr0194,spr0197,spr1944,spr0189,spr0271,spr0555,spr1177,spr1211,spr0272,spr0208,spr0199,spr0682,spr0764,spr2020,spr1807,spr0212,spr0190,spr0205,spr0191,spr0207,spr1467,spr1943,spr0203,spr1012,spr0556
GO:0005840	3.2760642848656527e-74	54	60	cellular_component: ribosome	spr0862,spr1396,spr0192,spr0201,spr2009,spr1014,spr0216,spr0200,spr0078,spr0248,spr0740,spr1212,spr1394,spr0187,spr0398,spr0214,spr0213,spr0206,spr0188,spr0204,spr0863,spr0202,spr1271,spr0249,spr0196,spr1171,spr0195,spr0198,spr0194,spr0686,spr0197,spr1944,spr0189,spr0271,spr0555,spr1177,spr1211,spr0272,spr0208,spr0199,spr0682,spr0764,spr2020,spr1807,spr0212,spr0190,spr0205,spr0191,spr0207,spr1467,spr1943,spr0203,spr1012,spr0556
GO:0006412	6.699292429041999e-72	63	99	biological_process: translation	spr0862,spr1396,spr0192,spr0201,spr2009,spr1014,spr0216,spr0200,spr0078,spr0248,spr0740,spr1212,spr0665,spr1881,spr1394,spr0250,spr0187,spr0398,spr0214,spr0213,spr0188,spr0206,spr0204,spr0863,spr0202,spr1271,spr0249,spr0196,spr1171,spr0195,spr0198,spr0194,spr0846,spr0197,spr1944,spr2019,spr0924,spr0271,spr0211,spr0189,spr0555,spr1177,spr1211,spr0272,spr0208,spr0199,spr0682,spr0392,spr0861,spr0764,spr2020,spr1343,spr1807,spr1467,spr0212,spr0190,spr0205,spr1943,spr0191,spr0207,spr0203,spr1012,spr0556
GO:0019843	3.122081965512779e-42	34	40	molecular_function: rRNA binding	spr1396,spr0192,spr0201,spr2009,spr0200,spr0078,spr0248,spr0740,spr1212,spr1394,spr0214,spr0213,spr0206,spr0188,spr0204,spr0863,spr0202,spr0249,spr0196,spr0195,spr0198,spr0194,spr0189,spr0211,spr0555,spr0208,spr0199,spr1467,spr0190,spr0205,spr0191,spr0203,spr1012,spr0556
GO:0022625	9.246801830229872e-34	24	24	cellular_component: cytosolic large ribosomal subunit	spr0862,spr0201,spr2009,spr1014,spr0216,spr0200,spr1212,spr0188,spr0204,spr0863,spr0196,spr1171,spr0194,spr0197,spr0271,spr0555,spr1211,spr0208,spr0199,spr0190,spr0205,spr0191,spr0207,spr0556
GO:0003723	2.5211077375921606e-31	40	97	molecular_function: RNA binding	spr1396,spr0192,spr0201,spr2009,spr0200,spr0078,spr0248,spr0740,spr1212,spr1394,spr0187,spr0480,spr0214,spr0213,spr0188,spr0206,spr0204,spr0863,spr0202,spr0249,spr0196,spr0195,spr0198,spr0194,spr0683,spr0189,spr0211,spr0555,spr0272,spr0208,spr0390,spr0199,spr0764,spr1467,spr0190,spr0205,spr0191,spr0203,spr1012,spr0556
GO:0022627	3.620166551369433e-18	13	13	cellular_component: cytosolic small ribosomal subunit	spr1396,spr0192,spr0764,spr0214,spr2020,spr1467,spr2011,spr0198,spr0203,spr0249,spr0272,spr0195,spr1394
GO:0015935	8.628063614109305e-17	12	12	cellular_component: small ribosomal subunit	spr0192,spr0682,spr0187,spr0213,spr2020,spr0206,spr0078,spr0202,spr0248,spr0740,spr0249,spr0272
GO:0015934	2.0269510639734878e-15	11	11	cellular_component: large ribosomal subunit	spr0862,spr0194,spr0216,spr0555,spr0191,spr0207,spr1943,spr1212,spr0208,spr0556,spr0199
GO:0000049	1.3177321461845005e-05	8	25	molecular_function: tRNA binding	spr0187,spr0201,spr0213,spr0248,spr0249,spr0196,spr0556,spr1881
GO:0070181	2.6204993714723766e-05	4	5	molecular_function: small ribosomal subunit rRNA binding	spr1396,spr0214,spr0740,spr1394
GO:0003746	2.6204993714723766e-05	4	5	molecular_function: translation elongation factor activity	spr0250,spr2019,spr0392,spr1343
GO:0006414	2.6204993714723766e-05	4	5	biological_process: translational elongation	spr0250,spr2019,spr0392,spr1343
GO:0043022	5.278831450297594e-05	5	10	molecular_function: ribosome binding	spr0686,spr2011,spr0211,spr0362,spr0861
GO:0003729	7.567450420890471e-05	4	6	molecular_function: mRNA binding	spr0764,spr0271,spr0195,spr0249
GO:0070180	0.00011485067751273081	3	3	molecular_function: large ribosomal subunit rRNA binding	spr0555,spr0199,spr1212
GO:0000027	0.00032726664789932945	4	8	biological_process: ribosomal large subunit assembly	spr0555,spr0863,spr0201,spr0190
GO:0000028	0.0010683626814576327	3	5	biological_process: ribosomal small subunit assembly	spr0214,spr0192,spr0249
GO:0006415	0.0010683626814576327	3	5	biological_process: translational termination	spr0665,spr0846,spr0924
GO:0009252	1.3517786252672552e-10	7	27	biological_process: peptidoglycan biosynthetic process	spr0304,spr1823,spr1517,spr0329,spr0776,spr1540,spr0305
GO:0008658	9.40920616212161e-09	4	5	molecular_function: penicillin binding	spr1517,spr0304,spr0329,spr1823
GO:0046677	3.8724399786150616e-07	4	10	biological_process: response to antibiotic	spr1517,spr0304,spr0329,spr1823
GO:0071555	4.716079765298231e-07	5	25	biological_process: cell wall organization	spr0304,spr1517,spr0329,spr0776,spr0305
GO:0008360	8.626663625036879e-07	5	28	biological_process: regulation of cell shape	spr0304,spr1517,spr0329,spr0776,spr0305
GO:0004180	1.322852958657485e-06	3	4	molecular_function: carboxypeptidase activity	spr0329,spr0776,spr1823
GO:0009002	1.322852958657485e-06	3	4	molecular_function: serine-type D-Ala-D-Ala carboxypeptidase activity	spr0329,spr0776,spr1823
GO:0008144	0.00015706444591084148	2	3	molecular_function: drug binding	spr0329,spr1823
GO:0008955	0.00015706444591084148	2	3	molecular_function: peptidoglycan glycosyltransferase activity	spr0329,spr1823
GO:0005887	0.000307139361750699	4	48	cellular_component: integral component of plasma membrane	spr0303,spr1517,spr0304,spr0305
GO:0006310	0.0004714953688665462	3	22	biological_process: DNA recombination	spr0330,spr1516,spr1539
GO:0006508	0.0005609374239706462	4	56	biological_process: proteolysis	spr1517,spr0329,spr0776,spr1823
GO:0008982	1.493865395238257e-22	16	34	molecular_function: protein-N(PI)-phosphohistidine-sugar phosphotransferase activity	spr0358,spr0280,spr1835,spr0230,spr0780,spr0425,spr0282,spr1834,spr0356,spr1070,spr0421,spr0231,spr0278,spr0423,spr0229,spr1836
GO:0034219	2.7351757714070106e-22	16	35	biological_process: carbohydrate transmembrane transport	spr0358,spr0280,spr1835,spr0230,spr0780,spr0425,spr0282,spr1834,spr0356,spr1070,spr0421,spr0231,spr0278,spr0423,spr0229,spr1836
GO:0009401	3.957565151023105e-21	17	50	biological_process: phosphoenolpyruvate-dependent sugar phosphotransferase system	spr0358,spr0280,spr1835,spr0230,spr0780,spr0425,spr0282,spr1834,spr0356,spr1071,spr1070,spr0421,spr0231,spr0278,spr0423,spr0229,spr1836
GO:0103111	3.5029078546652914e-14	9	14	molecular_function: D-glucosamine PTS permease activity	spr0358,spr0229,spr0280,spr1835,spr0780,spr0278,spr0423,spr0230,spr1836
GO:1901264	1.0554401598631948e-11	6	6	biological_process: carbohydrate derivative transport	spr0425,spr0282,spr1834,spr0421,spr0231,spr1070
GO:0016740	1.9839494633027644e-10	19	264	molecular_function: transferase activity	spr0229,spr0358,spr0280,spr1835,spr0230,spr0780,spr0425,spr0282,spr1834,spr0356,spr1071,spr1070,spr0421,spr0231,spr0278,spr0423,spr0779,spr1074,spr1836
GO:0005988	4.711786427955288e-09	5	6	biological_process: lactose metabolic process	spr1073,spr1076,spr1075,spr1074,spr0779
GO:0019512	4.711786427955288e-09	5	6	biological_process: lactose catabolic process via tagatose-6-phosphate	spr1073,spr1076,spr0424,spr1075,spr1074
GO:0008643	7.203810836948383e-08	8	39	biological_process: carbohydrate transport	spr0780,spr0425,spr0282,spr1834,spr0356,spr1070,spr0421,spr0231
GO:0009024	3.925176948492376e-06	3	3	molecular_function: tagatose-6-phosphate kinase activity	spr0779,spr1073,spr1074
GO:2001059	3.925176948492376e-06	3	3	biological_process: D-tagatose 6-phosphate catabolic process	spr0779,spr1073,spr1074
GO:0016310	4.340889103571326e-06	9	87	biological_process: phosphorylation	spr1073,spr1835,spr0230,spr0425,spr0356,spr1070,spr0278,spr1074,spr0779
GO:0005990	1.5529508546520846e-05	3	4	biological_process: lactose catabolic process	spr0424,spr1075,spr1076
GO:0016301	3.1912695556482035e-05	8	84	molecular_function: kinase activity	spr1835,spr0230,spr0425,spr0356,spr1070,spr0278,spr1074,spr0779
GO:0090563	0.00020808983784313174	3	8	molecular_function: protein-phosphocysteine-sugar phosphotransferase activity	spr0358,spr0356,spr0780
GO:0019388	0.00025889812956065173	2	2	biological_process: galactose catabolic process	spr1075,spr1076
GO:0008662	0.00025889812956065173	2	2	molecular_function: 1-phosphofructokinase activity	spr0779,spr1074
GO:0050044	0.00025889812956065173	2	2	molecular_function: galactose-6-phosphate isomerase activity	spr1075,spr1076
GO:0019316	0.00025889812956065173	2	2	biological_process: D-allose catabolic process	spr1075,spr1076
GO:0004751	0.0007688440347849141	2	3	molecular_function: ribose-5-phosphate isomerase activity	spr1075,spr1076
GO:0008443	0.0007688440347849141	2	3	molecular_function: phosphofructokinase activity	spr0779,spr1074
GO:0005975	0.0007964106599063753	6	72	biological_process: carbohydrate metabolic process	spr1076,spr0424,spr1075,spr1074,spr0779,spr1833
GO:0009052	0.0015221585610240742	2	4	biological_process: pentose-phosphate shunt, non-oxidative branch	spr1075,spr1076
GO:0051082	6.669874788294737e-10	4	7	molecular_function: unfolded protein binding	spr0455,spr1722,spr1723,spr0454
GO:0006457	3.995840608627039e-09	4	10	biological_process: protein folding	spr0455,spr1722,spr1723,spr0454
GO:0051087	7.966096294163423e-06	2	2	molecular_function: chaperone binding	spr1723,spr0454
GO:0051085	2.3868095213659903e-05	2	3	biological_process: chaperone cofactor-dependent protein refolding	spr1722,spr1723
GO:0006633	4.0910952372816423e-25	12	15	biological_process: fatty acid biosynthetic process	spr0383,spr0385,spr0380,spr0384,spr0038,spr0037,spr0377,spr0378,spr0382,spr0381,spr0387,spr0386
GO:0006629	1.5343287456210803e-18	11	25	biological_process: lipid metabolic process	spr0383,spr0385,spr0384,spr0038,spr0037,spr0377,spr0378,spr0382,spr0381,spr0387,spr0386
GO:0006631	1.6075560991440152e-18	9	11	biological_process: fatty acid metabolic process	spr0383,spr0385,spr0038,spr0377,spr0378,spr0382,spr0381,spr0387,spr0386
GO:0003989	5.210411878525416e-09	4	4	molecular_function: acetyl-CoA carboxylase activity	spr0383,spr0387,spr0386,spr0385
GO:0009317	6.869059659852975e-07	3	3	cellular_component: acetyl-CoA carboxylase complex	spr0383,spr0387,spr0386
GO:2001295	6.869059659852975e-07	3	3	biological_process: malonyl-CoA biosynthetic process	spr0387,spr0386,spr0385
GO:0000035	8.364401108886613e-05	2	2	molecular_function: acyl binding	spr0038,spr0378
GO:0004315	8.364401108886613e-05	2	2	molecular_function: 3-oxoacyl-[acyl-carrier-protein] synthase activity	spr0377,spr0382
GO:0102132	8.364401108886613e-05	2	2	molecular_function: 3-oxo-pimeloyl-[acp] methyl ester reductase activity	spr0381,spr0701
GO:0004316	8.364401108886613e-05	2	2	molecular_function: 3-oxoacyl-[acyl-carrier-protein] reductase (NADPH) activity	spr0381,spr0701
GO:0102131	8.364401108886613e-05	2	2	molecular_function: 3-oxo-glutaryl-[acp] methyl ester reductase activity	spr0381,spr0701
GO:0009245	0.00024955822133468825	2	3	biological_process: lipid A biosynthetic process	spr0384,spr0038
GO:0000036	0.00024955822133468825	2	3	molecular_function: acyl carrier activity	spr0038,spr0378
GO:0016743	0.0004963844500417886	2	4	molecular_function: carboxyl- or carbamoyltransferase activity	spr0387,spr0386
GO:0046940	4.7796577765008145e-06	2	4	biological_process: nucleoside monophosphate phosphorylation	spr1456,spr0845
GO:0006164	3.053297046355699e-18	13	16	biological_process: purine nucleotide biosynthetic process	spr0053,spr0048,spr2033,spr1300,spr0045,spr0729,spr0046,spr0056,spr0052,spr0051,spr0054,spr0047,spr0049
GO:0006189	1.473208889153932e-14	9	9	biological_process: 'de novo' IMP biosynthetic process	spr0053,spr0049,spr0045,spr0056,spr0052,spr0051,spr0054,spr0047,spr0048
GO:0016874	1.304742864834542e-13	17	58	molecular_function: ligase activity	spr1890,spr0519,spr0696,spr0507,spr1502,spr0492,spr1300,spr0438,spr0235,spr0046,spr0045,spr0509,spr0052,spr0054,spr0626,spr1109,spr0048
GO:0004812	3.2569330936430947e-09	9	21	molecular_function: aminoacyl-tRNA ligase activity	spr1890,spr0519,spr0696,spr0507,spr1502,spr0492,spr0235,spr0509,spr0626
GO:0006418	1.0768101968261537e-07	7	15	biological_process: tRNA aminoacylation for protein translation	spr1890,spr0519,spr0696,spr0235,spr0492,spr1502,spr0626
GO:0005829	1.1268103732139988e-06	20	207	cellular_component: cytosol	spr1888,spr0048,spr1694,spr0519,spr0516,spr1502,spr0492,spr1300,spr0438,spr0235,spr0045,spr0922,spr0729,spr0928,spr0056,spr0626,spr0051,spr0054,spr1695,spr0049
GO:0000166	2.8329317928068282e-06	22	261	molecular_function: nucleotide binding	spr0492,spr1300,spr0438,spr0368,spr0922,spr0054,spr1890,spr0507,spr1502,spr0509,spr1695,spr0519,spr0052,spr0696,spr0694,spr0235,spr2033,spr0045,spr0626,spr1888,spr1109,spr0048
GO:0005524	7.580658271791956e-06	21	254	molecular_function: ATP binding	spr0492,spr1300,spr0438,spr0368,spr0922,spr0160,spr0054,spr1890,spr0507,spr1502,spr0509,spr0519,spr0052,spr0696,spr0694,spr0235,spr0045,spr0626,spr1888,spr1109,spr0048
GO:0030983	2.9589795457823526e-05	3	3	molecular_function: mismatched DNA binding	spr1888,spr0368,spr0160
GO:0032300	2.9589795457823526e-05	3	3	cellular_component: mismatch repair complex	spr1888,spr0368,spr0160
GO:0000049	8.149100933141403e-05	6	25	molecular_function: tRNA binding	spr0696,spr0507,spr1502,spr0509,spr0626,spr0926
GO:0035999	0.000282865069944194	3	5	biological_process: tetrahydrofolate interconversion	spr0928,spr0729,spr1109
GO:0005737	0.0003391866791867284	20	299	cellular_component: cytoplasm	spr0048,spr1890,spr0519,spr0696,spr0507,spr1502,spr0492,spr1695,spr0516,spr0235,spr1691,spr0922,spr0928,spr0509,spr1692,spr0926,spr0626,spr0520,spr1690,spr0049
GO:0006298	0.0005531503667854476	3	6	biological_process: mismatch repair	spr1888,spr0368,spr0160
GO:0046872	0.0007226454371992972	15	199	molecular_function: metal ion binding	spr1694,spr0519,spr0507,spr1502,spr0516,spr2033,spr0438,spr0046,spr0922,spr0509,spr0052,spr0626,spr0054,spr1695,spr0047
GO:0106074	0.0009465104758056017	3	7	biological_process: aminoacyl-tRNA metabolism involved in translational fidelity	spr1502,spr0235,spr0492
GO:0002161	0.0009465104758056017	3	7	molecular_function: aminoacyl-tRNA editing activity	spr1502,spr0235,spr0492
GO:0006730	0.0009465104758056017	3	7	biological_process: one-carbon metabolic process	spr0928,spr0729,spr1109
GO:0006177	0.0009758467960365218	2	2	biological_process: GMP biosynthetic process	spr2033,spr1300
GO:0009113	0.0009758467960365218	2	2	biological_process: purine nucleobase biosynthetic process	spr0052,spr0047
GO:0004637	0.0009758467960365218	2	2	molecular_function: phosphoribosylamine-glycine ligase activity	spr0052,spr0048
GO:0006432	0.0009758467960365218	2	2	biological_process: phenylalanyl-tRNA aminoacylation	spr0507,spr0509
GO:0004826	0.0009758467960365218	2	2	molecular_function: phenylalanine-tRNA ligase activity	spr0507,spr0509
GO:1990077	1.4326895861987586e-05	2	3	cellular_component: primosome complex	spr2008,spr0978
GO:0006269	1.4326895861987586e-05	2	3	biological_process: DNA replication, synthesis of RNA primer	spr2008,spr0978
GO:0006096	1.0582528421025263e-12	8	10	biological_process: glycolytic process	spr0441,spr1036,spr0797,spr0796,spr1882,spr0530,spr1432,spr1499
GO:0044205	5.959834070576432e-09	6	9	biological_process: 'de novo' UMP biosynthetic process	spr1053,spr1154,spr1153,spr0614,spr0613,spr1155
GO:0006221	3.1754396908358233e-08	6	11	biological_process: pyrimidine nucleotide biosynthetic process	spr1053,spr1154,spr1153,spr0614,spr0613,spr1155
GO:0005978	1.9986605564831577e-07	4	4	biological_process: glycogen biosynthetic process	spr1032,spr1030,spr1031,spr1029
GO:0004022	9.836545091699144e-07	4	5	molecular_function: alcohol dehydrogenase (NAD) activity	spr1670,spr1837,spr1866,spr0262
GO:0016757	1.510078013540261e-06	7	29	molecular_function: transferase activity, transferring glycosyl groups	spr1917,spr1029,spr0614,spr1032,spr1916,spr0655,spr1156
GO:0006094	2.9046803232644456e-06	4	6	biological_process: gluconeogenesis	spr0441,spr1882,spr1432,spr1499
GO:0006526	6.671302185462117e-06	4	7	biological_process: arginine biosynthetic process	spr0103,spr0102,spr1154,spr1153
GO:0005977	9.88087812610243e-06	3	3	biological_process: glycogen metabolic process	spr1917,spr1030,spr1029
GO:0005737	5.31166477133796e-05	17	299	cellular_component: cytoplasm	spr1917,spr0887,spr0441,spr1036,spr1154,spr1153,spr1029,spr0797,spr0796,spr1775,spr1882,spr1916,spr1155,spr0102,spr0103,spr0219,spr1432
GO:0006807	0.00018876392783671216	3	6	biological_process: nitrogen compound metabolic process	spr1155,spr1154,spr1153
GO:0016868	0.00018876392783671216	3	6	molecular_function: intramolecular transferase activity, phosphotransferases	spr0887,spr0219,spr1499
GO:0006207	0.00018876392783671216	3	6	biological_process: 'de novo' pyrimidine nucleobase biosynthetic process	spr0613,spr1154,spr1155
GO:0030388	0.0004739827295028227	2	2	biological_process: fructose 1,6-bisphosphate metabolic process	spr0796,spr0530
GO:0004845	0.0004739827295028227	2	2	molecular_function: uracil phosphoribosyltransferase activity	spr1156,spr0655
GO:0004088	0.0004739827295028227	2	2	molecular_function: carbamoyl-phosphate synthase (glutamine-hydrolyzing) activity	spr1154,spr1153
GO:0046933	2.504699094004625e-17	8	8	molecular_function: proton-transporting ATP synthase activity, rotational mechanism	spr1361,spr1364,spr1360,spr1365,spr1366,spr1362,spr1359,spr1363
GO:0015986	2.504699094004625e-17	8	8	biological_process: ATP synthesis coupled proton transport	spr1361,spr1364,spr1360,spr1365,spr1366,spr1362,spr1359,spr1363
GO:0006754	2.242793652911396e-16	8	9	biological_process: ATP biosynthetic process	spr1361,spr1364,spr1360,spr1365,spr1366,spr1362,spr1359,spr1363
GO:0006811	7.295272774773617e-14	8	14	biological_process: ion transport	spr1361,spr1364,spr1360,spr1365,spr1366,spr1362,spr1359,spr1363
GO:0045261	7.470124557013309e-11	5	5	cellular_component: proton-transporting ATP synthase complex, catalytic core F(1)	spr1361,spr1360,spr1362,spr1359,spr1363
GO:0015078	1.0265847403734634e-06	3	3	molecular_function: proton transmembrane transporter activity	spr1365,spr1366,spr1364
GO:0045263	1.0265847403734634e-06	3	3	cellular_component: proton-transporting ATP synthase complex, coupling factor F(o)	spr1365,spr1366,spr1364
GO:1902600	3.498593243997188e-05	3	7	biological_process: proton transmembrane transport	spr1360,spr1366,spr1362
GO:0008861	0.0001083389096005506	2	2	molecular_function: formate C-acetyltransferase activity	spr0232,spr0415
GO:0046034	0.0001083389096005506	2	2	biological_process: ATP metabolic process	spr1360,spr1362
GO:0052587	0.0001083389096005506	2	2	molecular_function: diacetyl reductase ((R)-acetoin forming) activity	spr1050,spr1051
GO:0019152	0.0001083389096005506	2	2	molecular_function: acetoin dehydrogenase activity	spr1050,spr1051
GO:0046961	0.0001083389096005506	2	2	molecular_function: proton-transporting ATPase activity, rotational mechanism	spr1360,spr1362
GO:0042777	0.0001083389096005506	2	2	biological_process: plasma membrane ATP synthesis coupled proton transport	spr1361,spr1365
GO:0009401	7.978424314258228e-20	13	50	biological_process: phosphoenolpyruvate-dependent sugar phosphotransferase system	spr1970,spr0260,spr0061,spr0062,spr1967,spr0060,spr0261,spr1969,spr1063,spr0259,spr0063,spr1968,spr1062
GO:0008643	9.463363188145125e-09	7	39	biological_process: carbohydrate transport	spr1967,spr0062,spr0060,spr1969,spr0261,spr0259,spr1062
GO:0016740	2.4373364158934896e-08	12	264	molecular_function: transferase activity	spr1970,spr0260,spr0061,spr0062,spr1967,spr0060,spr0261,spr1969,spr0259,spr0063,spr1968,spr1062
GO:0005887	1.4046830864562193e-06	6	48	cellular_component: integral component of plasma membrane	spr0260,spr0061,spr0062,spr1967,spr0259,spr1968
GO:0008982	5.853525909643782e-06	5	34	molecular_function: protein-N(PI)-phosphohistidine-sugar phosphotransferase activity	spr0260,spr0261,spr0060,spr1969,spr0259
GO:0034219	6.796314202708405e-06	5	35	biological_process: carbohydrate transmembrane transport	spr0260,spr0261,spr0060,spr1969,spr0259
GO:0016301	3.960620397297655e-05	6	84	molecular_function: kinase activity	spr1970,spr0261,spr0060,spr1969,spr0063,spr1062
GO:0016310	4.854165674146413e-05	6	87	biological_process: phosphorylation	spr1970,spr0261,spr0060,spr1969,spr0063,spr1062
GO:0015031	1.582497154857881e-08	6	15	biological_process: protein transport	spr1852,spr1544,spr1790,spr0877,spr1821,spr0209
GO:0006605	2.7922463656723817e-08	4	4	biological_process: protein targeting	spr1123,spr1544,spr1821,spr0209
GO:0005887	2.901759924143141e-05	6	48	cellular_component: integral component of plasma membrane	spr1852,spr1840,spr1544,spr1790,spr0296,spr0209
GO:0015450	0.0001840168243951562	2	2	molecular_function: P-P-bond-hydrolysis-driven protein transmembrane transporter activity	spr0877,spr1821
GO:0065002	0.0001840168243951562	2	2	biological_process: intracellular protein transmembrane transport	spr1544,spr0209
GO:0006886	0.0001840168243951562	2	2	biological_process: intracellular protein transport	spr1544,spr1821
GO:0071806	0.0001840168243951562	2	2	biological_process: protein transmembrane transport	spr0877,spr1821
GO:0006614	0.0001840168243951562	2	2	biological_process: SRP-dependent cotranslational protein targeting to membrane	spr1123,spr1166
GO:0006612	0.0001840168243951562	2	2	biological_process: protein targeting to membrane	spr1123,spr1166
GO:0031522	0.0001840168243951562	2	2	cellular_component: cell envelope Sec protein transport complex	spr1544,spr0209
GO:0043952	0.0001840168243951562	2	2	biological_process: protein transport by the Sec complex	spr1544,spr0209
GO:0009306	0.0001840168243951562	2	2	biological_process: protein secretion	spr0877,spr1821
GO:0032977	0.0001840168243951562	2	2	molecular_function: membrane insertase activity	spr1790,spr1852
GO:0051205	0.0001840168243951562	2	2	biological_process: protein insertion into membrane	spr1790,spr1852
GO:0006817	3.234030455623455e-22	9	9	biological_process: phosphate ion transport	spr1899,spr1254,spr1895,spr1256,spr1253,spr1898,spr1252,spr1257,spr1896
GO:0005315	6.706586827500877e-17	7	7	molecular_function: inorganic phosphate transmembrane transporter activity	spr1255,spr1254,spr1256,spr1253,spr1898,spr1897,spr1896
GO:0035435	5.5772423163332235e-12	5	5	biological_process: phosphate ion transmembrane transport	spr1255,spr1254,spr1253,spr1898,spr1897
GO:0015415	2.490977678847972e-07	3	3	molecular_function: ATPase-coupled phosphate ion transmembrane transporter activity	spr1898,spr1254,spr1253
GO:0005886	1.3140058172191036e-06	9	236	cellular_component: plasma membrane	spr1255,spr1254,spr1895,spr1256,spr1253,spr1898,spr1897,spr1257,spr1896
GO:0045936	0.0001309423933182561	2	3	biological_process: negative regulation of phosphate metabolic process	spr1252,spr1899
GO:0030643	0.0001309423933182561	2	3	biological_process: cellular phosphate ion homeostasis	spr1252,spr1899
GO:0019877	3.042132172542383e-12	5	5	biological_process: diaminopimelate biosynthetic process	spr0919,spr0918,spr1907,spr1414,spr1906
GO:0009085	1.8204658032509817e-11	5	6	biological_process: lysine biosynthetic process	spr0919,spr0918,spr1907,spr1414,spr1906
GO:0009089	1.6901454647412177e-10	5	8	biological_process: lysine biosynthetic process via diaminopimelate	spr0919,spr0918,spr1907,spr1414,spr1906
GO:0008652	1.675907736077106e-09	7	48	biological_process: cellular amino acid biosynthetic process	spr0919,spr0918,spr1907,spr1414,spr1219,spr1218,spr1906
GO:0009088	7.222432465448618e-07	3	4	biological_process: threonine biosynthetic process	spr0918,spr1218,spr1219
GO:0050661	5.011622657185392e-05	3	13	molecular_function: NADP binding	spr0918,spr1414,spr1219
GO:0015744	5.2576235541560986e-05	2	2	biological_process: succinate transport	spr1575,spr1576
GO:0006166	8.454227273672316e-08	3	3	biological_process: purine ribonucleoside salvage	spr1662,spr0011,spr1435
GO:0006168	2.2305069623685344e-05	2	2	biological_process: adenine salvage	spr0011,spr1435
GO:0009116	3.738466421056108e-05	3	15	biological_process: nucleoside metabolic process	spr1662,spr0011,spr1435
GO:0009401	1.0231404607083807e-05	5	50	biological_process: phosphoenolpyruvate-dependent sugar phosphotransferase system	spr1940,spr1849,spr1938,spr1939,spr1848
