GO:0006189	2.158257170859408e-16	11	12	biological_process: 'de novo' IMP biosynthetic process	b4005,b2312,b1849,b2499,b4006,b1131,b2476,b2557,b2500,b0523,b0522
GO:0006164	3.6583125600549167e-16	12	18	biological_process: purine nucleotide biosynthetic process	b0529,b4005,b2312,b1849,b2499,b4006,b1131,b2476,b2557,b2500,b0523,b0522
GO:0006221	3.6351782530540595e-13	9	11	biological_process: pyrimidine nucleotide biosynthetic process	b1281,b1062,b0033,b4245,b0945,b3642,b4246,b4244,b0032
GO:0044205	4.2837459180883576e-11	7	7	biological_process: 'de novo' UMP biosynthetic process	b1281,b1062,b0033,b4245,b0945,b3642,b0032
GO:0006207	2.4229188128763675e-10	7	9	biological_process: 'de novo' pyrimidine nucleobase biosynthetic process	b1281,b1062,b4245,b0945,b3642,b4244,b0032
GO:0005829	1.1454720794547796e-09	41	1032	cellular_component: cytosol	b1281,b1062,b0355,b3951,b1241,b2500,b2903,b2154,b0033,b0114,b3114,b1133,b2453,b0337,b0529,b3642,b2557,b0032,b3113,b3589,b0903,b2904,b2499,b0116,b2551,b0528,b4243,b0823,b4245,b2312,b0945,b2905,b4006,b1849,b0356,b2498,b1131,b2476,b0523,b3117,b0522
GO:0004022	7.160535967355133e-08	5	6	molecular_function: alcohol dehydrogenase (NAD) activity	b3589,b2453,b0356,b1241,b1478
GO:0019464	7.615551325801873e-07	4	4	biological_process: glycine decarboxylation via glycine cleavage system	b2903,b2905,b2904,b0116
GO:0070689	6.875487769077742e-06	4	7	biological_process: L-threonine catabolic process to propionate	b3114,b3113,b3117,b3115
GO:0006546	2.016354534050011e-05	3	3	biological_process: glycine catabolic process	b2551,b2905,b2903
GO:0046294	2.016354534050011e-05	3	3	biological_process: formaldehyde catabolic process	b2154,b0356,b0355
GO:0006567	2.7566242328932416e-05	4	10	biological_process: threonine catabolic process	b3114,b3117,b0903,b3115
GO:0019856	4.72202588587123e-05	3	4	biological_process: pyrimidine nucleobase biosynthetic process	b1062,b4246,b0033
GO:0003824	0.0001271386583074352	17	375	molecular_function: catalytic activity	b1281,b2903,b3952,b0114,b0903,b3114,b3951,b0823,b0529,b1241,b2498,b0945,b2551,b4006,b1131,b3117,b0824
GO:0005737	0.00013046247700098604	28	848	cellular_component: cytoplasm	b1281,b1062,b3952,b0115,b1132,b2500,b0824,b0512,b0033,b3114,b1133,b3642,b2557,b0032,b0903,b2904,b2499,b0116,b2551,b2873,b4244,b4243,b3953,b4245,b2312,b0945,b0356,b0357
GO:0006541	0.00013098549607546905	4	15	biological_process: glutamine metabolic process	b0032,b0033,b2312,b2557
GO:0016597	0.00013098549607546905	4	15	molecular_function: amino acid binding	b2551,b3117,b0033,b4245
GO:0046336	0.00016743253812963397	4	16	biological_process: ethanolamine catabolic process	b2453,b2455,b2454,b2456
GO:0042802	0.00020365931952983092	18	429	molecular_function: identical protein binding	b2903,b3113,b2154,b2456,b0114,b0337,b4245,b2312,b0904,b1241,b0116,b2551,b0356,b2498,b2873,b4243,b0523,b3117
