GO:0016226	6.1648367752418955e-15	6	19	biological_process: iron-sulfur cluster assembly	b1684,b1680,b1682,b1679,b1681,b1683
GO:1990229	2.1292416361112397e-09	3	3	cellular_component: iron-sulfur cluster assembly complex	b1682,b1681,b1683
GO:0031162	2.040345797802071e-06	2	2	biological_process: sulfur incorporation into metallo-sulfur cluster	b1680,b1679
GO:0006979	4.310397457681236e-05	3	51	biological_process: response to oxidative stress	b1681,b1684,b1679
