GO:0003887	2.996618615521153e-16	10	10	molecular_function: DNA-directed DNA polymerase activity	spr0673,spr0795,spr0251,spr0836,spr0002,spr0711,spr0414,spr0032,spr0769,spr0896
GO:0006260	5.866050033043365e-15	12	29	biological_process: DNA replication	spr0673,spr0795,spr0251,spr0836,spr0711,spr0002,spr0837,spr1066,spr0414,spr0032,spr0769,spr1065
GO:0071897	2.954255372841312e-14	9	10	biological_process: DNA biosynthetic process	spr0673,spr0795,spr0251,spr0836,spr0711,spr0002,spr0032,spr0769,spr0896
GO:0008408	3.704411178043442e-11	7	8	molecular_function: 3'-5' exonuclease activity	spr0836,spr0795,spr0251,spr0711,spr0002,spr0032,spr0896
GO:0006261	8.364818666947616e-11	7	9	biological_process: DNA-dependent DNA replication	spr0673,spr0836,spr0251,spr0715,spr0414,spr0032,spr0769
GO:0016779	1.7197546877629373e-08	8	31	molecular_function: nucleotidyltransferase activity	spr0795,spr0251,spr0836,spr0002,spr0414,spr0032,spr0769,spr0896
GO:0090305	5.41973901301925e-08	8	36	biological_process: nucleic acid phosphodiester bond hydrolysis	spr0795,spr0251,spr0836,spr0711,spr0002,spr1044,spr0032,spr0896
GO:0009360	1.5116267509593133e-05	3	3	cellular_component: DNA polymerase III complex	spr0673,spr0769,spr0002
GO:0003677	6.175280367484769e-05	10	154	molecular_function: DNA binding	spr0673,spr0251,spr0711,spr0002,spr0715,spr1757,spr0414,spr0032,spr0769,spr0025
GO:0003676	7.400661181144308e-05	6	47	molecular_function: nucleic acid binding	spr0795,spr0251,spr0711,spr1044,spr0032,spr0896
GO:0003684	0.00011721504889516122	3	6	molecular_function: damaged DNA binding	spr0414,spr1757,spr0025
GO:0005737	0.00020088333684448927	13	299	cellular_component: cytoplasm	spr0795,spr0251,spr0002,spr0024,spr1757,spr0835,spr1044,spr0585,spr1043,spr0414,spr0032,spr0715,spr0838
GO:0009263	0.000468517880972283	2	2	biological_process: deoxyribonucleotide biosynthetic process	spr1065,spr1066
GO:0006235	0.000468517880972283	2	2	biological_process: dTTP biosynthetic process	spr0585,spr0835
GO:0044776	0.000468517880972283	2	2	cellular_component: DNA polymerase III, core complex	spr0711,spr0896
GO:0045004	0.000468517880972283	2	2	biological_process: DNA replication proofreading	spr0711,spr0896
GO:0004748	0.000468517880972283	2	2	molecular_function: ribonucleoside-diphosphate reductase activity, thioredoxin disulfide as acceptor	spr1065,spr1066
GO:0005971	0.000468517880972283	2	2	cellular_component: ribonucleoside-diphosphate reductase complex	spr1065,spr1066
GO:0006974	0.0010421735909948503	4	29	biological_process: cellular response to DNA damage stimulus	spr0414,spr1757,spr0032,spr0025
GO:0004527	0.0011085965688440887	3	13	molecular_function: exonuclease activity	spr0032,spr0251,spr0711
GO:0016740	0.0012271798614388093	11	264	molecular_function: transferase activity	spr0795,spr0251,spr0836,spr0002,spr0835,spr0585,spr0414,spr0032,spr0769,spr0838,spr0896
GO:0004518	0.0013322085635192056	4	31	molecular_function: nuclease activity	spr0032,spr0251,spr0711,spr1044
