Rv0081	Rv0087	Rv0086	Rv0085	Rv0083	Rv0082	Rv0084	Rv0088
Rv0167	Rv1969	Rv0174	Rv0589	Rv1970	Rv1971	Rv3498c	Rv3494c	Rv0592	Rv0168	Rv3497c	Rv0173	Rv1968	Rv3496c	Rv0169	Rv3499c	Rv0170	Rv0172	Rv1966	Rv0591	Rv3495c	Rv0593	Rv0655	Rv1967	Rv0594	Rv0171	Rv0588	Rv1964	Rv3501c	Rv3500c	Rv1965	Rv0587	Rv0175	Rv0177	Rv0178	Rv0176	Rv0586	Rv0590A	Rv0590	Rv1975	Rv1974	Rv1973	Rv1972	Rv3492c	Rv3493c
Rv0066c	Rv3339c	Rv3153	Rv1308	Rv3317	Rv0247c	Rv3319	Rv2195	Rv1554	Rv1552	Rv0248c	Rv1248c	Rv1555	Rv0951	Rv3318	Rv1098c	Rv3316	Rv0952	Rv0249c	Rv1553	Rv3150	Rv1310	Rv1311	Rv2782c	Rv1306	Rv1507c	Rv1309	Rv0889c	Rv0896	Rv3148	Rv1240	Rv3147	Rv1097c	Rv1099c	Rv1129c	Rv1130	Rv1132	Rv1131	Rv2855	Rv1817	Rv3537	Rv3149	Rv3043c	Rv1475c	Rv3151	Rv1303	Rv1304	Rv1305	Rv3145	Rv2193	Rv2200c	Rv3157	Rv2196	Rv3152	Rv1868	Rv3146	Rv1312	Rv1451	Rv1456c	Rv1474c	Rv1620c	Rv1621c	Rv1622c	Rv1623c	Rv2194	Rv3158	Rv2199c	Rv2783c	Rv3154	Rv3155	Rv3156	Rv3538
Rv0350	Rv0351	Rv0352	Rv0353	Rv2299c	Rv3418c	Rv0440	Rv3417c	Rv2374c	Rv1798	Rv1795	Rv1796	Rv1797	Rv3081	Rv2372c	Rv2373c
Rv0634B	Rv0635	Rv0637	Rv0636
Rv0818	Rv0819	Rv0820	Rv0936	Rv0935	Rv0934	Rv0930	Rv0929	Rv0932c	Rv0928	Rv0933	Rv0931c
Rv0899	Rv0900
Rv0131c	Rv2831	Rv2679	Rv1141c	Rv0243	Rv1070c	Rv0222	Rv0132c	Rv1142c	Rv3774	Rv0859	Rv0971c	Rv1074c	Rv3516	Rv3373	Rv2486	Rv3550	Rv0456c	Rv3039c	Rv0632c	Rv0675	Rv3556c	Rv1867	Rv0860	Rv3523	Rv1935c	Rv3546	Rv1323	Rv1071c	Rv0905	Rv1472	Rv0914c	Rv0673	Rv0153c	Rv0154c	Rv0218	Rv0219	Rv0220	Rv0221	Rv0468	Rv0400c	Rv0231	Rv3140	Rv2502c	Rv0975c	Rv1715	Rv2247	Rv0398c	Rv0399c	Rv0633c	Rv0672	Rv0674	Rv0751c	Rv0753c	Rv0752c	Rv0904c	Rv3285	Rv2501c	Rv1722	Rv2246	Rv2245	Rv0906	Rv0913c	Rv0972c	Rv0974c	Rv0976c	Rv0973c	Rv3280	Rv1069c	Rv1075c	Rv1470	Rv1469	Rv1471	Rv3913	Rv1473	Rv1714	Rv1716	Rv1717	Rv1718	Rv1719	Rv1723	Rv1933c	Rv1934c	Rv2244	Rv2498c	Rv2504c	Rv2500c	Rv2499c	Rv2503c	Rv3139	Rv3283	Rv3284	Rv3282	Rv3375	Rv3374	Rv3521	Rv3522	Rv3553	Rv3551	Rv3552	Rv3775	Rv3915	Rv3914
Rv1009	Rv1010
Rv1180	Rv2931	Rv2932	Rv2935	Rv2934	Rv1181	Rv2933	Rv2940c	Rv2930	Rv2938	Rv2936	Rv2937
Rv0381c	Rv0382c	Rv1384	Rv1382	Rv1385	Rv1383	Rv0858c	Rv1655	Rv1658	Rv1213	Rv1659	Rv1652	Rv1379	Rv1380	Rv1381	Rv3309c	Rv2172c	Rv1656	Rv1657	Rv1654	Rv1653	Rv2747	Rv2745c	Rv2746c
Rv0761c	Rv0147	Rv0162c	Rv3086	Rv1530	Rv0768	Rv0223c	Rv2858c	Rv3293	Rv3391	Rv0241c	Rv0242c	Rv2243	Rv0533c	Rv2524c	Rv0648	Rv0649	Rv0650	Rv3559c	Rv2793c	Rv0760c	Rv0769	Rv1350	Rv1531	Rv1661	Rv1663	Rv1662	Rv1664	Rv3502c	Rv2377c	Rv2379c	Rv2384	Rv2380c	Rv2378c	Rv2381c	Rv2383c	Rv2382c	Rv2794c	Rv2838c	Rv2795c	Rv2836c	Rv2837c	Rv2839c	Rv2857c	Rv2860c	Rv2859c	Rv3083	Rv3085	Rv3084	Rv3089	Rv3088	Rv3087	Rv3292	Rv3503c	Rv3560c
Rv0058	Rv0001	Rv0002	Rv0038	Rv2902c	Rv1547	Rv3644c	Rv1629	Rv0004	Rv2764c	Rv3051c	Rv0003	Rv2413c	Rv0570	Rv2191	Rv3721c	Rv2697c	Rv1402	Rv2343c	Rv0155	Rv0157	Rv0156	Rv1695	Rv2713	Rv0232	Rv0233	Rv0569	Rv3048c	Rv1981c	Rv1420	Rv1421	Rv1633	Rv1423	Rv1422	Rv3711c	Rv2737c	Rv1638	Rv1634	Rv1690	Rv1691	Rv1692	Rv1694	Rv1696	Rv1693	Rv2414c	Rv2415c	Rv3247c	Rv2735c	Rv2736c	Rv2760c	Rv2757c	Rv2761c	Rv2762c	Rv2763c	Rv2901c	Rv2903c	Rv3052c	Rv3053c	Rv3370c
Rv1707	Rv1711	Rv1709	Rv1708	Rv1712	Rv1710	Rv1713	Rv2883c
Rv1406	Rv1408	Rv1407	Rv1409	Rv1415	Rv1940	Rv1416	Rv1412	Rv1418	Rv1417	Rv2671	Rv3688c	Rv1936	Rv1939	Rv1937	Rv1938	Rv1941	Rv2670c	Rv2672	Rv2673
Rv0014c	Rv0017c	Rv0015c	Rv0016c	Rv0018c	Rv2163c	Rv0019c	Rv2165c	Rv2164c	Rv2166c
Rv0069c	Rv1559	Rv0070c	Rv2211c	Rv1832	Rv1826	Rv0189c	Rv3001c	Rv2210c	Rv0337c	Rv0338c	Rv0407	Rv0408	Rv0409	Rv2455c	Rv2241	Rv0462	Rv0843	Rv2497c	Rv2495c	Rv2496c	Rv2215	Rv0463	Rv0564c	Rv2249c	Rv3302c	Rv0727c	Rv0728c	Rv0729	Rv2996c	Rv0884c	Rv1093	Rv0794c	Rv3303c	Rv0811c	Rv0842	Rv0885	Rv0886	Rv3859c	Rv1177	Rv1178	Rv1455	Rv1538c	Rv2201	Rv1557	Rv1558	Rv1560	Rv1820	Rv3002c	Rv1822	Rv1825	Rv1824	Rv1823	Rv2007c	Rv2754c	Rv2216	Rv2217	Rv2218	Rv2219	Rv2242	Rv2250c	Rv2982c	Rv2453c	Rv2454c	Rv2474c	Rv2476c	Rv2475c	Rv3858c	Rv2537c	Rv2539c	Rv2538c	Rv2540c	Rv2752c	Rv2753c	Rv2995c	Rv2987c	Rv2988c	Rv3534c	Rv3710	Rv3469c	Rv3003c	Rv3470c	Rv3509c	Rv3106	Rv3510c	Rv3535c	Rv3536c
Rv2287	Rv2289	Rv2881c	Rv2879c	Rv2880c
Rv0252	Rv2391	Rv0253	Rv0254c	Rv0255c	Rv0256c	Rv2066	Rv0414c	Rv0417	Rv0415	Rv0416	Rv1286	Rv1285	Rv1859	Rv2397c	Rv2121c	Rv2920c	Rv2398c	Rv2400c	Rv1287	Rv2064	Rv2392	Rv2131c	Rv1599	Rv1604	Rv1606	Rv1603	Rv1601	Rv1600	Rv1605	Rv1602	Rv2393	Rv1857	Rv1858	Rv2062c	Rv2065	Rv2236c	Rv2072c	Rv2208	Rv2207	Rv2070c	Rv2071c	Rv2073c	Rv2122c	Rv2130c	Rv2206	Rv2394	Rv2399c	Rv2918c	Rv2919c
Rv3201c	Rv0949	Rv3198c	Rv2417c	Rv2418c	Rv2419c	Rv2421c	Rv2420c	Rv3199c	Rv3200c	Rv3202c
Rv2555c	Rv0041	Rv1536	Rv2448c	Rv0780	Rv0957	Rv0389	Rv0956	Rv0391	Rv0390	Rv1079	Rv0562	Rv1107c	Rv2445c	Rv3396c	Rv1699	Rv0772	Rv0809	Rv0777	Rv3356c	Rv0808	Rv0803	Rv0787A	Rv0788	Rv0804	Rv3276c	Rv0989c	Rv1078	Rv3340	Rv1108c	Rv1106c	Rv3409c	Rv3383c	Rv3398c	Rv2173	Rv1109c	Rv3382c	Rv1110	Rv1121	Rv1122	Rv1844c	Rv1650	Rv1292	Rv1295	Rv1293	Rv1294	Rv1296	Rv3708c	Rv1444c	Rv1446c	Rv1445c	Rv1447c	Rv1449c	Rv1448c	Rv1640c	Rv2580c	Rv3598c	Rv1649	Rv1689	Rv1688	Rv1701	Rv1700	Rv3411c	Rv1843c	Rv3410c	Rv1846c	Rv1845c	Rv2139	Rv2174	Rv2406c	Rv2446c	Rv2447c	Rv2551c	Rv2554c	Rv2552c	Rv2553c	Rv2581c	Rv2583c	Rv2584c	Rv3624c	Rv2624c	Rv2625c	Rv2626c	Rv2683	Rv2845c	Rv2911	Rv3330	Rv3596c	Rv3274c	Rv3275c	Rv3277	Rv3627c	Rv3342	Rv3341	Rv3355c	Rv3397c	Rv3625c	Rv3626c	Rv3709c
Rv3041c	Rv0265c	Rv3044	Rv0266c	Rv2483c	Rv0505c	Rv3042c	Rv2482c	Rv2484c	Rv3040c	Rv3038c
Rv2532c	Rv2535c	Rv2533c
Rv3663c	Rv1280c	Rv1282c	Rv1281c	Rv2585c	Rv1283c	Rv2586c	Rv2587c	Rv3662c	Rv3664c	Rv3666c	Rv3665c
Rv0363c	Rv1617	Rv1437	Rv1438	Rv0489	Rv3010c	Rv0946c	Rv3068c	Rv1328	Rv1126c	Rv1127c	Rv3745c	Rv1436	Rv1327c	Rv1326c	Rv3433c	Rv1564c	Rv3432c	Rv1562c	Rv1565c	Rv1563c	Rv1618	Rv2605c	Rv2037c	Rv2042c	Rv2043c	Rv2041c	Rv2040c	Rv2039c	Rv2038c	Rv2044c	Rv2439c	Rv2440c	Rv2592c	Rv2593c	Rv2594c	Rv2604c	Rv2606c	Rv3009c	Rv3011c	Rv3012c	Rv3257c	Rv3255c	Rv3256c	Rv3435c	Rv3434c
Rv2629	Rv2630
Rv2841c	Rv2842c
Rv0053	Rv2926c	Rv0708	Rv0702	Rv0707	Rv0705	Rv0651	Rv0682	Rv0714	Rv0704	Rv2890c	Rv0721	Rv0703	Rv0716	Rv3924c	Rv1307	Rv0652	Rv0054	Rv0715	Rv0710	Rv2442c	Rv0901	Rv2907c	Rv2412	Rv0701	Rv0720	Rv0718	Rv0709	Rv2055c	Rv3461c	Rv0722	Rv2909c	Rv3443c	Rv0700	Rv1643	Rv3460c	Rv3456c	Rv0723	Rv2478c	Rv2882c	Rv1642	Rv0055	Rv1015c	Rv3459c	Rv2904c	Rv0732	Rv1630	Rv0683	Rv3458c	Rv0056	Rv3442c	Rv1388	Rv0706	Rv0641	Rv2889c	Rv2906c	Rv0719	Rv3457c	Rv2441c	Rv2785c	Rv0640	Rv2057c	Rv2462c	Rv0105c	Rv2058c	Rv1298	Rv0079	Rv0080	Rv0120c	Rv0667	Rv0685	Rv0639	Rv0684	Rv2056c	Rv2008c	Rv0717	Rv2534c	Rv0668	Rv1390	Rv2101	Rv3462c	Rv2992c	Rv0733	Rv3241c	Rv0734	Rv3005c	Rv3486	Rv3064c	Rv1014c	Rv1391	Rv1631	Rv1988	Rv2689c	Rv1641	Rv1644	Rv2888c	Rv2908c	Rv2925c	Rv2927c	Rv2993c	Rv3455c
Rv0864	Rv0865	Rv0866	Rv3323c	Rv0868c	Rv0870c	Rv0869c	Rv1335	Rv1019	Rv1020	Rv1021	Rv1341	Rv1331	Rv1333	Rv1339	Rv1336	Rv1332	Rv1337	Rv1334	Rv1338	Rv1340	Rv3110	Rv3111	Rv3112	Rv3120	Rv3116	Rv3119	Rv3118	Rv3117	Rv3206c	Rv3322c	Rv3324c
Rv3800c	Rv3799c	Rv3801c
Rv1736c	Rv0258c	Rv0259c	Rv0260c	Rv0511	Rv0261c	Rv1161	Rv1162	Rv1164	Rv0267	Rv0508	Rv0510	Rv0509	Rv2850c	Rv2847c	Rv0512	Rv0513	Rv0514	Rv0958	Rv0959	Rv1163	Rv1737c	Rv2329c	Rv1165	Rv2852c	Rv1314c	Rv2849c	Rv3818	Rv2345	Rv2468c	Rv2469c	Rv2675c	Rv2677c	Rv2676c	Rv2678c	Rv3465	Rv2846c	Rv2848c	Rv2851c	Rv3464	Rv3784	Rv3468c	Rv3809c	Rv3805c	Rv3807c	Rv3806c	Rv3808c	Rv3819
Rv0638	Rv1440	Rv3240c	Rv1821	Rv3921c	Rv2921c	Rv2588c	Rv2916c	Rv3923c	Rv2915c	Rv2922c	Rv2923c	Rv2922A	Rv3920c	Rv3922c
