[
  {
    "Employee_Id": "Z0638"
  },
  {
    "Employee_Id": "Z0835"
  },
  {
    "Employee_Id": "Z0767"
  },
  {
    "Employee_Id": "Z1100"
  },
  {
    "Employee_Id": "Z0969"
  },
  {
    "Employee_Id": "Z1864"
  },
  {
    "Employee_Id": "Z0938"
  },
  {
    "Employee_Id": "Z2061"
  },
  {
    "Employee_Id": "Z2188"
  },
  {
    "Employee_Id": "Z2228"
  },
  {
    "Employee_Id": "Z2230"
  },
  {
    "Employee_Id": "Z1016"
  },
  {
    "Employee_Id": "Z2300"
  },
  {
    "Employee_Id": "Z0822"
  },
  {
    "Employee_Id": "Z2390"
  },
  {
    "Employee_Id": "Z2412"
  },
  {
    "Employee_Id": "Z0812"
  },
  {
    "Employee_Id": "Z2477"
  },
  {
    "Employee_Id": "Z2505"
  },
  {
    "Employee_Id": "Z0976"
  },
  {
    "Employee_Id": "Z1001"
  },
  {
    "Employee_Id": "Z0990"
  },
  {
    "Employee_Id": "Z2581"
  },
  {
    "Employee_Id": "Z2637"
  },
  {
    "Employee_Id": "Z2643"
  },
  {
    "Employee_Id": "Z2648"
  },
  {
    "Employee_Id": "Z2655"
  },
  {
    "Employee_Id": "Z2666"
  },
  {
    "Employee_Id": "Z2673"
  },
  {
    "Employee_Id": "Z1031"
  },
  {
    "Employee_Id": "Z1069"
  },
  {
    "Employee_Id": "Z1120"
  },
  {
    "Employee_Id": "Z0909"
  },
  {
    "Employee_Id": "Z1847"
  },
  {
    "Employee_Id": "Z1251"
  },
  {
    "Employee_Id": "Z0957"
  },
  {
    "Employee_Id": "Z1038"
  },
  {
    "Employee_Id": "Z1060"
  },
  {
    "Employee_Id": "Z1087"
  },
  {
    "Employee_Id": "Z1108"
  },
  {
    "Employee_Id": "Z1118"
  },
  {
    "Employee_Id": "Z1130"
  },
  {
    "Employee_Id": "Z1121"
  },
  {
    "Employee_Id": "Z0885"
  },
  {
    "Employee_Id": "Z1476"
  },
  {
    "Employee_Id": "Z1557"
  },
  {
    "Employee_Id": "Z1671"
  },
  {
    "Employee_Id": "Z1683"
  },
  {
    "Employee_Id": "Z1702"
  },
  {
    "Employee_Id": "Z1711"
  },
  {
    "Employee_Id": "Z1675"
  },
  {
    "Employee_Id": "Z1617"
  },
  {
    "Employee_Id": "Z1098"
  },
  {
    "Employee_Id": "Z2063"
  },
  {
    "Employee_Id": "Z2117"
  },
  {
    "Employee_Id": "Z2162"
  },
  {
    "Employee_Id": "Z2180"
  },
  {
    "Employee_Id": "Z0939"
  },
  {
    "Employee_Id": "Z2303"
  },
  {
    "Employee_Id": "Z2325"
  },
  {
    "Employee_Id": "Z2345"
  },
  {
    "Employee_Id": "Z2348"
  },
  {
    "Employee_Id": "Z1099"
  },
  {
    "Employee_Id": "Z2381"
  },
  {
    "Employee_Id": "Z2408"
  },
  {
    "Employee_Id": "Z2459"
  },
  {
    "Employee_Id": "Z2461"
  },
  {
    "Employee_Id": "Z1559"
  },
  {
    "Employee_Id": "Z2506"
  },
  {
    "Employee_Id": "Z0986"
  },
  {
    "Employee_Id": "Z1616"
  },
  {
    "Employee_Id": "Z1754"
  },
  {
    "Employee_Id": "Z1878"
  },
  {
    "Employee_Id": "Z1655"
  },
  {
    "Employee_Id": "Z1345"
  },
  {
    "Employee_Id": "Z2280"
  },
  {
    "Employee_Id": "Z2373"
  },
  {
    "Employee_Id": "Z2580"
  },
  {
    "Employee_Id": "Z2499"
  },
  {
    "Employee_Id": "Z2621"
  },
  {
    "Employee_Id": "Z2631"
  },
  {
    "Employee_Id": "Z1452"
  },
  {
    "Employee_Id": "Z1450"
  },
  {
    "Employee_Id": "Z2198"
  },
  {
    "Employee_Id": "ZC3153"
  },
  {
    "Employee_Id": "Z2695"
  },
  {
    "Employee_Id": "Z2696"
  },
  {
    "Employee_Id": "Z0801"
  },
  {
    "Employee_Id": "Z0317"
  },
  {
    "Employee_Id": "Z1783"
  },
  {
    "Employee_Id": "Z1235"
  },
  {
    "Employee_Id": "Z2082"
  },
  {
    "Employee_Id": "Z2444"
  },
  {
    "Employee_Id": "Z2469"
  },
  {
    "Employee_Id": "Z2537"
  },
  {
    "Employee_Id": "Z2559"
  },
  {
    "Employee_Id": "Z2495"
  },
  {
    "Employee_Id": "Z1480"
  },
  {
    "Employee_Id": "Z2593"
  },
  {
    "Employee_Id": "Z0693"
  },
  {
    "Employee_Id": "Z2611"
  },
  {
    "Employee_Id": "Z0847"
  },
  {
    "Employee_Id": "Z1762"
  },
  {
    "Employee_Id": "Z0340"
  },
  {
    "Employee_Id": "Z2026"
  },
  {
    "Employee_Id": "Z0796"
  },
  {
    "Employee_Id": "ZC2243"
  },
  {
    "Employee_Id": "ZI091"
  },
  {
    "Employee_Id": "ZI092"
  },
  {
    "Employee_Id": "ZI093"
  },
  {
    "Employee_Id": "ZI095"
  },
  {
    "Employee_Id": "ZI094"
  }
]