{
  "environment": "staging",
  "httpRouterPort": 9001,
  "config": {
    "issuer": "ekaPlugins",
    "private_key": "/app/main/static/cert/private_key.der",
    "public_key": "/app/main/static/cert/public_key.der",
    "host": "https://plugins.expanso.in",
    "decline": "https://eka-invoice.netlify.app/invoices",
    "smtp": "/app/main/smtp.properties",
    "secret": "53ca09e4572b49544eb7ad1f217g480d891cd1h75999e58eaf4d0970506267a3",
    "id": "a00f991dw7f34a08b8q1f1898a3ad274"
  },
  "mail": {
    "crawlingEmail": {
      "host": "smtp.gmail.com",
      "port": 465,
      "username": "receive@eka-antrepriz.com",
      "password": "#developer@1"
    },
    "gmail": {
      "host": "smtp.gmail.com",
      "port": 465,
      "username": "no-reply@antrepriz.com",
      "password": "#developer@1"
    },
    "aws":{
      "host": "email-smtp.us-east-1.amazonaws.com",
      "from":"no-reply@eka.io",
      "name":"Eka",
      "port": 465,
      "username": "AKIA23AJDYTXKQH4EC4M",
      "password": "BJ1+VD5U2KBpkkGCfdESsgpp+0wc2eIJXdpG1vNrf+1D"
    }
  },
  "sql": {
    "port":3306,
    "driver":"com.mysql.cj.jdbc.Driver",
    "username":"root",
    "url":"jdbc:mysql://10.0.0.52/plugins?useSSL=false",
    "password":"antrepriz@1"
  },
  "s3":{
      "accessKeyID":"AKIA23AJDYTXDCDGJHGS",
      "secretAccessKey":"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",
      "bucket":"fintrip",
      "region":"ap-south-1"
  },
  "rmq": {
    "url": "rmq"
  },
  "fileuplaod": {
    "blackhole": {
      "url": "https://bifrost.eka.io",
      "secret": "53ca0744572b49544eb7ad1f2178480d891cd1575999e58eaf4d0970506267a3",
      "id": "a00f991d87f24a08b831f1898a3ad174"
    }
  },
  "apis": {
    "plugins": {
      "olaCorp": {
        "url": "https://devapi-stg.olacabs-dev.in/"
      }
    },
    "eka": {
      "url" : "http://10.0.0.52:9000/plugins/"
    },
    "slack": {
      "ekaSyncUpdate": "https://hooks.slack.com/services/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"
    }
  },
  "static": {
    "dtdc": {
      "gl_codes": "/app/main/static/dtdc/DtdcGlCodes.json",
      "finance_users": "/app/main/static/dtdc/DtdcFinanceUsers.json",
      "sap_data": "/app/main/static/dtdc/DtdcHrmsSapRecords.json",
      "it_admin_heads": "/app/main/static/dtdc/DtdcHrmsAdminItHeads.json",
      "dynamic_heads": "/app/main/static/dtdc/DtdcHrmsDynamicHeads.json",
      "dynamic_nfh": "/app/main/static/dtdc/DtdcNfhMapping.json",
      "rom_manager3": "/app/main/static/dtdc/DtdcHrmsRomMapping.json",
      "area_manager": "/app/main/static/dtdc/DtdcAreaManagers.json"
    },
    "bizongo": {
      "cost_center_prefix": "/app/main/static/BizongoCostCenterPrefix.json"
    },
    "blackbuck": {
      "after_corona_travel_on": "/app/main/static/blackbuck/BlackBuckTravelOnEmployees.json",
      "managers_mapping": "/app/main/static/blackbuck/BlackBuckManagersMapping.json",
      "policy_mapping": "/app/main/static/blackbuck/BlackBuckPolicyMapping.json"
    },
    "vmart": "/app/main/static/vmart/invoice_data.csv",
    "fino": {
      "hod_approvers": "/app/main/static/fino/FinoHodApprover.json"
    },
    "nykaa": {
      "cxo_approvers": "/app/main/static/nykaa/NykaaCXOApprover.json"
    },
    "directi": {
      "entertainment_benefit": "/app/main/static/directi/zeta_entertainment_benifit.json"
    }
  },
  "template_path" : "/app/main/static/template",
  "pdfpath": "/app/main/pdf/results/",
  "sftp_files": "/app/main/sftpFiles/"
}