{
 "_comments": "[{\"comment\": \"<div class=\\\"ql-editor read-mode\\\"><p>tetst</p></div>\", \"by\": \"ritik.gupta@cybrilla.com\", \"name\": \"2d972829b3\"}, {\"comment\": \"<div class=\\\"ql-editor read-mode\\\"><p>test 2</p></div>\", \"by\": \"ritik.gupta@cybrilla.com\", \"name\": \"3683a0fb38\"}]",
 "actions": [],
 "allow_guest_to_view": 1,
 "allow_rename": 1,
 "autoname": "field:title",
 "creation": "2023-01-12 10:53:47.276596",
 "default_view": "List",
 "doctype": "DocType",
 "editable_grid": 1,
 "engine": "InnoDB",
 "field_order": [
  "title",
  "post",
  "author",
  "image",
  "tag",
  "route",
  "published",
  "comment"
 ],
 "fields": [
  {
   "fieldname": "title",
   "fieldtype": "Data",
   "in_list_view": 1,
   "label": "Title",
   "reqd": 1,
   "unique": 1
  },
  {
   "fieldname": "post",
   "fieldtype": "Markdown Editor",
   "label": "Post"
  },
  {
   "fieldname": "author",
   "fieldtype": "Table",
   "label": "Author",
   "options": "Blog Author",
   "reqd": 1
  },
  {
   "fieldname": "image",
   "fieldtype": "Image",
   "label": "Image"
  },
  {
   "fieldname": "tag",
   "fieldtype": "Text",
   "label": "Tag"
  },
  {
   "fieldname": "route",
   "fieldtype": "Data",
   "label": "Route"
  },
  {
   "default": "0",
   "fieldname": "published",
   "fieldtype": "Check",
   "label": "Published"
  },
  {
   "fieldname": "comment",
   "fieldtype": "Table",
   "label": "Comment",
   "options": "Comment_C"
  }
 ],
 "has_web_view": 1,
 "index_web_pages_for_search": 1,
 "is_published_field": "published",
 "links": [],
 "modified": "2023-01-17 12:52:22.547724",
 "modified_by": "Administrator",
 "module": "Blog Cybrilla",
 "name": "Blog Post Custom",
 "naming_rule": "Expression (old style)",
 "owner": "Administrator",
 "permissions": [
  {
   "create": 1,
   "delete": 1,
   "email": 1,
   "export": 1,
   "print": 1,
   "read": 1,
   "report": 1,
   "role": "System Manager",
   "share": 1,
   "write": 1
  },
  {
   "create": 1,
   "delete": 1,
   "email": 1,
   "export": 1,
   "print": 1,
   "read": 1,
   "report": 1,
   "role": "Owner",
   "share": 1,
   "write": 1
  },
  {
   "email": 1,
   "export": 1,
   "print": 1,
   "read": 1,
   "report": 1,
   "role": "Viewer",
   "share": 1
  }
 ],
 "route": "blog_posts",
 "sort_field": "modified",
 "sort_order": "DESC",
 "states": []
}