2019-06-21 14:59:14,064 ERROR: Exception on /index [GET] [in /Users/shiteshchaurasia/Desktop/mountblue/microblog/venv/lib/python3.7/site-packages/flask/app.py:1780]
Traceback (most recent call last):
  File "/Users/shiteshchaurasia/Desktop/mountblue/microblog/venv/lib/python3.7/site-packages/flask/app.py", line 2311, in wsgi_app
    response = self.full_dispatch_request()
  File "/Users/shiteshchaurasia/Desktop/mountblue/microblog/venv/lib/python3.7/site-packages/flask/app.py", line 1834, in full_dispatch_request
    rv = self.handle_user_exception(e)
  File "/Users/shiteshchaurasia/Desktop/mountblue/microblog/venv/lib/python3.7/site-packages/flask/app.py", line 1737, in handle_user_exception
    reraise(exc_type, exc_value, tb)
  File "/Users/shiteshchaurasia/Desktop/mountblue/microblog/venv/lib/python3.7/site-packages/flask/_compat.py", line 36, in reraise
    raise value
  File "/Users/shiteshchaurasia/Desktop/mountblue/microblog/venv/lib/python3.7/site-packages/flask/app.py", line 1832, in full_dispatch_request
    rv = self.dispatch_request()
  File "/Users/shiteshchaurasia/Desktop/mountblue/microblog/venv/lib/python3.7/site-packages/flask/app.py", line 1818, in dispatch_request
    return self.view_functions[rule.endpoint](**req.view_args)
  File "/Users/shiteshchaurasia/Desktop/mountblue/microblog/venv/lib/python3.7/site-packages/flask_login/utils.py", line 261, in decorated_view
    return func(*args, **kwargs)
  File "/Users/shiteshchaurasia/Desktop/mountblue/microblog/app/routes.py", line 32, in index
    ]
  File "/Users/shiteshchaurasia/Desktop/mountblue/microblog/venv/lib/python3.7/site-packages/flask/templating.py", line 135, in render_template
    context, ctx.app)
  File "/Users/shiteshchaurasia/Desktop/mountblue/microblog/venv/lib/python3.7/site-packages/flask/templating.py", line 117, in _render
    rv = template.render(context)
  File "/Users/shiteshchaurasia/Desktop/mountblue/microblog/venv/lib/python3.7/site-packages/jinja2/asyncsupport.py", line 76, in render
    return original_render(self, *args, **kwargs)
  File "/Users/shiteshchaurasia/Desktop/mountblue/microblog/venv/lib/python3.7/site-packages/jinja2/environment.py", line 1008, in render
    return self.environment.handle_exception(exc_info, True)
  File "/Users/shiteshchaurasia/Desktop/mountblue/microblog/venv/lib/python3.7/site-packages/jinja2/environment.py", line 780, in handle_exception
    reraise(exc_type, exc_value, tb)
  File "/Users/shiteshchaurasia/Desktop/mountblue/microblog/venv/lib/python3.7/site-packages/jinja2/_compat.py", line 37, in reraise
    raise value.with_traceback(tb)
  File "/Users/shiteshchaurasia/Desktop/mountblue/microblog/app/templates/index.html", line 1, in top-level template code
    {% extends "base.html" %}
  File "/Users/shiteshchaurasia/Desktop/mountblue/microblog/app/templates/base.html", line 30, in top-level template code
    {% block content %} {% endblock %}
  File "/Users/shiteshchaurasia/Desktop/mountblue/microblog/app/templates/index.html", line 3, in block "content"
    <h1>Hi, {{ user.username }}!</h1>
  File "/Users/shiteshchaurasia/Desktop/mountblue/microblog/venv/lib/python3.7/site-packages/jinja2/environment.py", line 430, in getattr
    return getattr(obj, attribute)
jinja2.exceptions.UndefinedError: 'user' is undefined
2019-06-21 14:59:14,691 ERROR: Exception on /index [GET] [in /Users/shiteshchaurasia/Desktop/mountblue/microblog/venv/lib/python3.7/site-packages/flask/app.py:1780]
Traceback (most recent call last):
  File "/Users/shiteshchaurasia/Desktop/mountblue/microblog/venv/lib/python3.7/site-packages/flask/app.py", line 2311, in wsgi_app
    response = self.full_dispatch_request()
  File "/Users/shiteshchaurasia/Desktop/mountblue/microblog/venv/lib/python3.7/site-packages/flask/app.py", line 1834, in full_dispatch_request
    rv = self.handle_user_exception(e)
  File "/Users/shiteshchaurasia/Desktop/mountblue/microblog/venv/lib/python3.7/site-packages/flask/app.py", line 1737, in handle_user_exception
    reraise(exc_type, exc_value, tb)
  File "/Users/shiteshchaurasia/Desktop/mountblue/microblog/venv/lib/python3.7/site-packages/flask/_compat.py", line 36, in reraise
    raise value
  File "/Users/shiteshchaurasia/Desktop/mountblue/microblog/venv/lib/python3.7/site-packages/flask/app.py", line 1832, in full_dispatch_request
    rv = self.dispatch_request()
  File "/Users/shiteshchaurasia/Desktop/mountblue/microblog/venv/lib/python3.7/site-packages/flask/app.py", line 1818, in dispatch_request
    return self.view_functions[rule.endpoint](**req.view_args)
  File "/Users/shiteshchaurasia/Desktop/mountblue/microblog/venv/lib/python3.7/site-packages/flask_login/utils.py", line 261, in decorated_view
    return func(*args, **kwargs)
  File "/Users/shiteshchaurasia/Desktop/mountblue/microblog/app/routes.py", line 32, in index
    ]
  File "/Users/shiteshchaurasia/Desktop/mountblue/microblog/venv/lib/python3.7/site-packages/flask/templating.py", line 135, in render_template
    context, ctx.app)
  File "/Users/shiteshchaurasia/Desktop/mountblue/microblog/venv/lib/python3.7/site-packages/flask/templating.py", line 117, in _render
    rv = template.render(context)
  File "/Users/shiteshchaurasia/Desktop/mountblue/microblog/venv/lib/python3.7/site-packages/jinja2/asyncsupport.py", line 76, in render
    return original_render(self, *args, **kwargs)
  File "/Users/shiteshchaurasia/Desktop/mountblue/microblog/venv/lib/python3.7/site-packages/jinja2/environment.py", line 1008, in render
    return self.environment.handle_exception(exc_info, True)
  File "/Users/shiteshchaurasia/Desktop/mountblue/microblog/venv/lib/python3.7/site-packages/jinja2/environment.py", line 780, in handle_exception
    reraise(exc_type, exc_value, tb)
  File "/Users/shiteshchaurasia/Desktop/mountblue/microblog/venv/lib/python3.7/site-packages/jinja2/_compat.py", line 37, in reraise
    raise value.with_traceback(tb)
  File "/Users/shiteshchaurasia/Desktop/mountblue/microblog/app/templates/index.html", line 1, in top-level template code
    {% extends "base.html" %}
  File "/Users/shiteshchaurasia/Desktop/mountblue/microblog/app/templates/base.html", line 30, in top-level template code
    {% block content %} {% endblock %}
  File "/Users/shiteshchaurasia/Desktop/mountblue/microblog/app/templates/index.html", line 3, in block "content"
    <h1>Hi, {{ user.username }}!</h1>
  File "/Users/shiteshchaurasia/Desktop/mountblue/microblog/venv/lib/python3.7/site-packages/jinja2/environment.py", line 430, in getattr
    return getattr(obj, attribute)
jinja2.exceptions.UndefinedError: 'user' is undefined
2019-06-21 14:59:14,947 ERROR: Exception on /index [GET] [in /Users/shiteshchaurasia/Desktop/mountblue/microblog/venv/lib/python3.7/site-packages/flask/app.py:1780]
Traceback (most recent call last):
  File "/Users/shiteshchaurasia/Desktop/mountblue/microblog/venv/lib/python3.7/site-packages/flask/app.py", line 2311, in wsgi_app
    response = self.full_dispatch_request()
  File "/Users/shiteshchaurasia/Desktop/mountblue/microblog/venv/lib/python3.7/site-packages/flask/app.py", line 1834, in full_dispatch_request
    rv = self.handle_user_exception(e)
  File "/Users/shiteshchaurasia/Desktop/mountblue/microblog/venv/lib/python3.7/site-packages/flask/app.py", line 1737, in handle_user_exception
    reraise(exc_type, exc_value, tb)
  File "/Users/shiteshchaurasia/Desktop/mountblue/microblog/venv/lib/python3.7/site-packages/flask/_compat.py", line 36, in reraise
    raise value
  File "/Users/shiteshchaurasia/Desktop/mountblue/microblog/venv/lib/python3.7/site-packages/flask/app.py", line 1832, in full_dispatch_request
    rv = self.dispatch_request()
  File "/Users/shiteshchaurasia/Desktop/mountblue/microblog/venv/lib/python3.7/site-packages/flask/app.py", line 1818, in dispatch_request
    return self.view_functions[rule.endpoint](**req.view_args)
  File "/Users/shiteshchaurasia/Desktop/mountblue/microblog/venv/lib/python3.7/site-packages/flask_login/utils.py", line 261, in decorated_view
    return func(*args, **kwargs)
  File "/Users/shiteshchaurasia/Desktop/mountblue/microblog/app/routes.py", line 32, in index
    ]
  File "/Users/shiteshchaurasia/Desktop/mountblue/microblog/venv/lib/python3.7/site-packages/flask/templating.py", line 135, in render_template
    context, ctx.app)
  File "/Users/shiteshchaurasia/Desktop/mountblue/microblog/venv/lib/python3.7/site-packages/flask/templating.py", line 117, in _render
    rv = template.render(context)
  File "/Users/shiteshchaurasia/Desktop/mountblue/microblog/venv/lib/python3.7/site-packages/jinja2/asyncsupport.py", line 76, in render
    return original_render(self, *args, **kwargs)
  File "/Users/shiteshchaurasia/Desktop/mountblue/microblog/venv/lib/python3.7/site-packages/jinja2/environment.py", line 1008, in render
    return self.environment.handle_exception(exc_info, True)
  File "/Users/shiteshchaurasia/Desktop/mountblue/microblog/venv/lib/python3.7/site-packages/jinja2/environment.py", line 780, in handle_exception
    reraise(exc_type, exc_value, tb)
  File "/Users/shiteshchaurasia/Desktop/mountblue/microblog/venv/lib/python3.7/site-packages/jinja2/_compat.py", line 37, in reraise
    raise value.with_traceback(tb)
  File "/Users/shiteshchaurasia/Desktop/mountblue/microblog/app/templates/index.html", line 1, in top-level template code
    {% extends "base.html" %}
  File "/Users/shiteshchaurasia/Desktop/mountblue/microblog/app/templates/base.html", line 30, in top-level template code
    {% block content %} {% endblock %}
  File "/Users/shiteshchaurasia/Desktop/mountblue/microblog/app/templates/index.html", line 3, in block "content"
    <h1>Hi, {{ user.username }}!</h1>
  File "/Users/shiteshchaurasia/Desktop/mountblue/microblog/venv/lib/python3.7/site-packages/jinja2/environment.py", line 430, in getattr
    return getattr(obj, attribute)
jinja2.exceptions.UndefinedError: 'user' is undefined
2019-06-21 14:59:27,419 INFO: Microblog startup [in /Users/shiteshchaurasia/Desktop/mountblue/microblog/app/__init__.py:55]
2019-06-21 16:15:06,323 INFO: Microblog startup [in /Users/shiteshchaurasia/Desktop/mountblue/microblog/app/__init__.py:55]
