2019-06-21 14:35:08,653 ERROR: Exception on / [GET] [in /Users/shiteshchaurasia/Desktop/mountblue/microblog/venv/lib/python3.7/site-packages/flask/app.py:1780]
Traceback (most recent call last):
  File "/Users/shiteshchaurasia/Desktop/mountblue/microblog/venv/lib/python3.7/site-packages/flask/app.py", line 2311, in wsgi_app
    response = self.full_dispatch_request()
  File "/Users/shiteshchaurasia/Desktop/mountblue/microblog/venv/lib/python3.7/site-packages/flask/app.py", line 1834, in full_dispatch_request
    rv = self.handle_user_exception(e)
  File "/Users/shiteshchaurasia/Desktop/mountblue/microblog/venv/lib/python3.7/site-packages/flask/app.py", line 1737, in handle_user_exception
    reraise(exc_type, exc_value, tb)
  File "/Users/shiteshchaurasia/Desktop/mountblue/microblog/venv/lib/python3.7/site-packages/flask/_compat.py", line 36, in reraise
    raise value
  File "/Users/shiteshchaurasia/Desktop/mountblue/microblog/venv/lib/python3.7/site-packages/flask/app.py", line 1832, in full_dispatch_request
    rv = self.dispatch_request()
  File "/Users/shiteshchaurasia/Desktop/mountblue/microblog/venv/lib/python3.7/site-packages/flask/app.py", line 1818, in dispatch_request
    return self.view_functions[rule.endpoint](**req.view_args)
  File "/Users/shiteshchaurasia/Desktop/mountblue/microblog/venv/lib/python3.7/site-packages/flask_login/utils.py", line 261, in decorated_view
    return func(*args, **kwargs)
  File "/Users/shiteshchaurasia/Desktop/mountblue/microblog/app/routes.py", line 16, in index
    user = current_user.user
  File "/Users/shiteshchaurasia/Desktop/mountblue/microblog/venv/lib/python3.7/site-packages/werkzeug/local.py", line 348, in __getattr__
    return getattr(self._get_current_object(), name)
AttributeError: 'User' object has no attribute 'user'
2019-06-21 14:35:38,667 ERROR: Exception on / [GET] [in /Users/shiteshchaurasia/Desktop/mountblue/microblog/venv/lib/python3.7/site-packages/flask/app.py:1780]
Traceback (most recent call last):
  File "/Users/shiteshchaurasia/Desktop/mountblue/microblog/venv/lib/python3.7/site-packages/flask/app.py", line 2311, in wsgi_app
    response = self.full_dispatch_request()
  File "/Users/shiteshchaurasia/Desktop/mountblue/microblog/venv/lib/python3.7/site-packages/flask/app.py", line 1834, in full_dispatch_request
    rv = self.handle_user_exception(e)
  File "/Users/shiteshchaurasia/Desktop/mountblue/microblog/venv/lib/python3.7/site-packages/flask/app.py", line 1737, in handle_user_exception
    reraise(exc_type, exc_value, tb)
  File "/Users/shiteshchaurasia/Desktop/mountblue/microblog/venv/lib/python3.7/site-packages/flask/_compat.py", line 36, in reraise
    raise value
  File "/Users/shiteshchaurasia/Desktop/mountblue/microblog/venv/lib/python3.7/site-packages/flask/app.py", line 1832, in full_dispatch_request
    rv = self.dispatch_request()
  File "/Users/shiteshchaurasia/Desktop/mountblue/microblog/venv/lib/python3.7/site-packages/flask/app.py", line 1818, in dispatch_request
    return self.view_functions[rule.endpoint](**req.view_args)
  File "/Users/shiteshchaurasia/Desktop/mountblue/microblog/venv/lib/python3.7/site-packages/flask_login/utils.py", line 261, in decorated_view
    return func(*args, **kwargs)
  File "/Users/shiteshchaurasia/Desktop/mountblue/microblog/app/routes.py", line 16, in index
    user = current_user.username
  File "/Users/shiteshchaurasia/Desktop/mountblue/microblog/venv/lib/python3.7/site-packages/werkzeug/local.py", line 348, in __getattr__
    return getattr(self._get_current_object(), name)
AttributeError: 'User' object has no attribute 'user'
2019-06-21 14:35:39,354 ERROR: Exception on / [GET] [in /Users/shiteshchaurasia/Desktop/mountblue/microblog/venv/lib/python3.7/site-packages/flask/app.py:1780]
Traceback (most recent call last):
  File "/Users/shiteshchaurasia/Desktop/mountblue/microblog/venv/lib/python3.7/site-packages/flask/app.py", line 2311, in wsgi_app
    response = self.full_dispatch_request()
  File "/Users/shiteshchaurasia/Desktop/mountblue/microblog/venv/lib/python3.7/site-packages/flask/app.py", line 1834, in full_dispatch_request
    rv = self.handle_user_exception(e)
  File "/Users/shiteshchaurasia/Desktop/mountblue/microblog/venv/lib/python3.7/site-packages/flask/app.py", line 1737, in handle_user_exception
    reraise(exc_type, exc_value, tb)
  File "/Users/shiteshchaurasia/Desktop/mountblue/microblog/venv/lib/python3.7/site-packages/flask/_compat.py", line 36, in reraise
    raise value
  File "/Users/shiteshchaurasia/Desktop/mountblue/microblog/venv/lib/python3.7/site-packages/flask/app.py", line 1832, in full_dispatch_request
    rv = self.dispatch_request()
  File "/Users/shiteshchaurasia/Desktop/mountblue/microblog/venv/lib/python3.7/site-packages/flask/app.py", line 1818, in dispatch_request
    return self.view_functions[rule.endpoint](**req.view_args)
  File "/Users/shiteshchaurasia/Desktop/mountblue/microblog/venv/lib/python3.7/site-packages/flask_login/utils.py", line 261, in decorated_view
    return func(*args, **kwargs)
  File "/Users/shiteshchaurasia/Desktop/mountblue/microblog/app/routes.py", line 16, in index
    user = current_user.username
  File "/Users/shiteshchaurasia/Desktop/mountblue/microblog/venv/lib/python3.7/site-packages/werkzeug/local.py", line 348, in __getattr__
    return getattr(self._get_current_object(), name)
AttributeError: 'User' object has no attribute 'user'
2019-06-21 14:36:12,837 INFO: Microblog startup [in /Users/shiteshchaurasia/Desktop/mountblue/microblog/app/__init__.py:55]
2019-06-21 14:38:24,624 ERROR: Exception on /login [POST] [in /Users/shiteshchaurasia/Desktop/mountblue/microblog/venv/lib/python3.7/site-packages/flask/app.py:1780]
Traceback (most recent call last):
  File "/Users/shiteshchaurasia/Desktop/mountblue/microblog/venv/lib/python3.7/site-packages/flask/app.py", line 2311, in wsgi_app
    response = self.full_dispatch_request()
  File "/Users/shiteshchaurasia/Desktop/mountblue/microblog/venv/lib/python3.7/site-packages/flask/app.py", line 1834, in full_dispatch_request
    rv = self.handle_user_exception(e)
  File "/Users/shiteshchaurasia/Desktop/mountblue/microblog/venv/lib/python3.7/site-packages/flask/app.py", line 1737, in handle_user_exception
    reraise(exc_type, exc_value, tb)
  File "/Users/shiteshchaurasia/Desktop/mountblue/microblog/venv/lib/python3.7/site-packages/flask/_compat.py", line 36, in reraise
    raise value
  File "/Users/shiteshchaurasia/Desktop/mountblue/microblog/venv/lib/python3.7/site-packages/flask/app.py", line 1832, in full_dispatch_request
    rv = self.dispatch_request()
  File "/Users/shiteshchaurasia/Desktop/mountblue/microblog/venv/lib/python3.7/site-packages/flask/app.py", line 1818, in dispatch_request
    return self.view_functions[rule.endpoint](**req.view_args)
  File "/Users/shiteshchaurasia/Desktop/mountblue/microblog/app/routes.py", line 37, in login
    if user is None or not user.check_password(form.password.data):
  File "/Users/shiteshchaurasia/Desktop/mountblue/microblog/app/models.py", line 25, in check_password
    return check_password_hash(self.password_hash, password)
  File "/Users/shiteshchaurasia/Desktop/mountblue/microblog/venv/lib/python3.7/site-packages/werkzeug/security.py", line 218, in check_password_hash
    if pwhash.count("$") < 2:
AttributeError: 'NoneType' object has no attribute 'count'
2019-06-21 14:42:58,565 ERROR: Exception on /login [POST] [in /Users/shiteshchaurasia/Desktop/mountblue/microblog/venv/lib/python3.7/site-packages/flask/app.py:1780]
Traceback (most recent call last):
  File "/Users/shiteshchaurasia/Desktop/mountblue/microblog/venv/lib/python3.7/site-packages/flask/app.py", line 2311, in wsgi_app
    response = self.full_dispatch_request()
  File "/Users/shiteshchaurasia/Desktop/mountblue/microblog/venv/lib/python3.7/site-packages/flask/app.py", line 1834, in full_dispatch_request
    rv = self.handle_user_exception(e)
  File "/Users/shiteshchaurasia/Desktop/mountblue/microblog/venv/lib/python3.7/site-packages/flask/app.py", line 1737, in handle_user_exception
    reraise(exc_type, exc_value, tb)
  File "/Users/shiteshchaurasia/Desktop/mountblue/microblog/venv/lib/python3.7/site-packages/flask/_compat.py", line 36, in reraise
    raise value
  File "/Users/shiteshchaurasia/Desktop/mountblue/microblog/venv/lib/python3.7/site-packages/flask/app.py", line 1832, in full_dispatch_request
    rv = self.dispatch_request()
  File "/Users/shiteshchaurasia/Desktop/mountblue/microblog/venv/lib/python3.7/site-packages/flask/app.py", line 1818, in dispatch_request
    return self.view_functions[rule.endpoint](**req.view_args)
  File "/Users/shiteshchaurasia/Desktop/mountblue/microblog/app/routes.py", line 37, in login
    if user is None or not user.check_password(form.password.data):
  File "/Users/shiteshchaurasia/Desktop/mountblue/microblog/app/models.py", line 25, in check_password
    return check_password_hash(self.password_hash, password)
  File "/Users/shiteshchaurasia/Desktop/mountblue/microblog/venv/lib/python3.7/site-packages/werkzeug/security.py", line 218, in check_password_hash
    if pwhash.count("$") < 2:
AttributeError: 'NoneType' object has no attribute 'count'
