2019-06-21 14:47:56,867 ERROR: Exception on /login [POST] [in /Users/shiteshchaurasia/Desktop/mountblue/microblog/venv/lib/python3.7/site-packages/flask/app.py:1780]
Traceback (most recent call last):
  File "/Users/shiteshchaurasia/Desktop/mountblue/microblog/venv/lib/python3.7/site-packages/flask/app.py", line 2311, in wsgi_app
    response = self.full_dispatch_request()
  File "/Users/shiteshchaurasia/Desktop/mountblue/microblog/venv/lib/python3.7/site-packages/flask/app.py", line 1834, in full_dispatch_request
    rv = self.handle_user_exception(e)
  File "/Users/shiteshchaurasia/Desktop/mountblue/microblog/venv/lib/python3.7/site-packages/flask/app.py", line 1737, in handle_user_exception
    reraise(exc_type, exc_value, tb)
  File "/Users/shiteshchaurasia/Desktop/mountblue/microblog/venv/lib/python3.7/site-packages/flask/_compat.py", line 36, in reraise
    raise value
  File "/Users/shiteshchaurasia/Desktop/mountblue/microblog/venv/lib/python3.7/site-packages/flask/app.py", line 1832, in full_dispatch_request
    rv = self.dispatch_request()
  File "/Users/shiteshchaurasia/Desktop/mountblue/microblog/venv/lib/python3.7/site-packages/flask/app.py", line 1818, in dispatch_request
    return self.view_functions[rule.endpoint](**req.view_args)
  File "/Users/shiteshchaurasia/Desktop/mountblue/microblog/app/routes.py", line 37, in login
    if user is None or not user.check_password(form.password.data):
  File "/Users/shiteshchaurasia/Desktop/mountblue/microblog/app/models.py", line 25, in check_password
    return check_password_hash(self.password_hash, password)
  File "/Users/shiteshchaurasia/Desktop/mountblue/microblog/venv/lib/python3.7/site-packages/werkzeug/security.py", line 218, in check_password_hash
    if pwhash.count("$") < 2:
AttributeError: 'NoneType' object has no attribute 'count'
2019-06-21 14:48:28,566 ERROR: Exception on /login [POST] [in /Users/shiteshchaurasia/Desktop/mountblue/microblog/venv/lib/python3.7/site-packages/flask/app.py:1780]
Traceback (most recent call last):
  File "/Users/shiteshchaurasia/Desktop/mountblue/microblog/venv/lib/python3.7/site-packages/flask/app.py", line 2311, in wsgi_app
    response = self.full_dispatch_request()
  File "/Users/shiteshchaurasia/Desktop/mountblue/microblog/venv/lib/python3.7/site-packages/flask/app.py", line 1834, in full_dispatch_request
    rv = self.handle_user_exception(e)
  File "/Users/shiteshchaurasia/Desktop/mountblue/microblog/venv/lib/python3.7/site-packages/flask/app.py", line 1737, in handle_user_exception
    reraise(exc_type, exc_value, tb)
  File "/Users/shiteshchaurasia/Desktop/mountblue/microblog/venv/lib/python3.7/site-packages/flask/_compat.py", line 36, in reraise
    raise value
  File "/Users/shiteshchaurasia/Desktop/mountblue/microblog/venv/lib/python3.7/site-packages/flask/app.py", line 1832, in full_dispatch_request
    rv = self.dispatch_request()
  File "/Users/shiteshchaurasia/Desktop/mountblue/microblog/venv/lib/python3.7/site-packages/flask/app.py", line 1818, in dispatch_request
    return self.view_functions[rule.endpoint](**req.view_args)
  File "/Users/shiteshchaurasia/Desktop/mountblue/microblog/app/routes.py", line 37, in login
    if user is None or not user.check_password(form.password.data):
  File "/Users/shiteshchaurasia/Desktop/mountblue/microblog/app/models.py", line 25, in check_password
    return check_password_hash(self.password_hash, password)
  File "/Users/shiteshchaurasia/Desktop/mountblue/microblog/venv/lib/python3.7/site-packages/werkzeug/security.py", line 218, in check_password_hash
    if pwhash.count("$") < 2:
AttributeError: 'NoneType' object has no attribute 'count'
2019-06-21 14:50:07,484 INFO: Microblog startup [in /Users/shiteshchaurasia/Desktop/mountblue/microblog/app/__init__.py:55]
2019-06-21 14:50:59,945 INFO: Microblog startup [in /Users/shiteshchaurasia/Desktop/mountblue/microblog/app/__init__.py:55]
2019-06-21 14:57:03,988 INFO: Microblog startup [in /Users/shiteshchaurasia/Desktop/mountblue/microblog/app/__init__.py:55]
2019-06-21 14:57:06,713 ERROR: Exception on / [GET] [in /Users/shiteshchaurasia/Desktop/mountblue/microblog/venv/lib/python3.7/site-packages/flask/app.py:1780]
Traceback (most recent call last):
  File "/Users/shiteshchaurasia/Desktop/mountblue/microblog/venv/lib/python3.7/site-packages/flask/app.py", line 2311, in wsgi_app
    response = self.full_dispatch_request()
  File "/Users/shiteshchaurasia/Desktop/mountblue/microblog/venv/lib/python3.7/site-packages/flask/app.py", line 1834, in full_dispatch_request
    rv = self.handle_user_exception(e)
  File "/Users/shiteshchaurasia/Desktop/mountblue/microblog/venv/lib/python3.7/site-packages/flask/app.py", line 1737, in handle_user_exception
    reraise(exc_type, exc_value, tb)
  File "/Users/shiteshchaurasia/Desktop/mountblue/microblog/venv/lib/python3.7/site-packages/flask/_compat.py", line 36, in reraise
    raise value
  File "/Users/shiteshchaurasia/Desktop/mountblue/microblog/venv/lib/python3.7/site-packages/flask/app.py", line 1832, in full_dispatch_request
    rv = self.dispatch_request()
  File "/Users/shiteshchaurasia/Desktop/mountblue/microblog/venv/lib/python3.7/site-packages/flask/app.py", line 1818, in dispatch_request
    return self.view_functions[rule.endpoint](**req.view_args)
  File "/Users/shiteshchaurasia/Desktop/mountblue/microblog/venv/lib/python3.7/site-packages/flask_login/utils.py", line 261, in decorated_view
    return func(*args, **kwargs)
  File "/Users/shiteshchaurasia/Desktop/mountblue/microblog/app/routes.py", line 32, in index
    return render_template('index.html', title='Home', posts=posts)
  File "/Users/shiteshchaurasia/Desktop/mountblue/microblog/venv/lib/python3.7/site-packages/flask/templating.py", line 135, in render_template
    context, ctx.app)
  File "/Users/shiteshchaurasia/Desktop/mountblue/microblog/venv/lib/python3.7/site-packages/flask/templating.py", line 117, in _render
    rv = template.render(context)
  File "/Users/shiteshchaurasia/Desktop/mountblue/microblog/venv/lib/python3.7/site-packages/jinja2/asyncsupport.py", line 76, in render
    return original_render(self, *args, **kwargs)
  File "/Users/shiteshchaurasia/Desktop/mountblue/microblog/venv/lib/python3.7/site-packages/jinja2/environment.py", line 1008, in render
    return self.environment.handle_exception(exc_info, True)
  File "/Users/shiteshchaurasia/Desktop/mountblue/microblog/venv/lib/python3.7/site-packages/jinja2/environment.py", line 780, in handle_exception
    reraise(exc_type, exc_value, tb)
  File "/Users/shiteshchaurasia/Desktop/mountblue/microblog/venv/lib/python3.7/site-packages/jinja2/_compat.py", line 37, in reraise
    raise value.with_traceback(tb)
  File "/Users/shiteshchaurasia/Desktop/mountblue/microblog/app/templates/index.html", line 1, in top-level template code
    {% extends "base.html" %}
  File "/Users/shiteshchaurasia/Desktop/mountblue/microblog/app/templates/base.html", line 30, in top-level template code
    {% block content %} {% endblock %}
  File "/Users/shiteshchaurasia/Desktop/mountblue/microblog/app/templates/index.html", line 3, in block "content"
    <h1>Hi, {{ user.username }}!</h1>
  File "/Users/shiteshchaurasia/Desktop/mountblue/microblog/venv/lib/python3.7/site-packages/jinja2/environment.py", line 430, in getattr
    return getattr(obj, attribute)
jinja2.exceptions.UndefinedError: 'user' is undefined
