<?xml version="1.0" encoding="UTF-8" standalone="no"?>
<svg
   xmlns:dc="http://purl.org/dc/elements/1.1/"
   xmlns:cc="http://creativecommons.org/ns#"
   xmlns:rdf="http://www.w3.org/1999/02/22-rdf-syntax-ns#"
   xmlns:svg="http://www.w3.org/2000/svg"
   xmlns="http://www.w3.org/2000/svg"
   xmlns:sodipodi="http://sodipodi.sourceforge.net/DTD/sodipodi-0.dtd"
   xmlns:inkscape="http://www.inkscape.org/namespaces/inkscape"
   viewBox="0 0 793.7007874015749 1122.5196850393702"
   width="793.7007874015749"
   height="1122.5196850393702"
   version="1.1"
   id="svg1398"
   sodipodi:docname="moebius1h.dxf"
   inkscape:version="1.0.1 (c497b03c, 2020-09-10)">
  <metadata
     id="metadata1402">
    <rdf:RDF>
      <cc:Work
         rdf:about="">
        <dc:format>image/svg+xml</dc:format>
        <dc:type
           rdf:resource="http://purl.org/dc/dcmitype/StillImage" />
        <dc:title></dc:title>
      </cc:Work>
    </rdf:RDF>
  </metadata>
  <sodipodi:namedview
     pagecolor="#ffffff"
     bordercolor="#666666"
     borderopacity="1"
     objecttolerance="10"
     gridtolerance="10"
     guidetolerance="10"
     inkscape:pageopacity="0"
     inkscape:pageshadow="2"
     inkscape:window-width="1401"
     inkscape:window-height="775"
     id="namedview1400"
     showgrid="false"
     inkscape:zoom="0.38448454"
     inkscape:cx="119.13554"
     inkscape:cy="339.578"
     inkscape:window-x="0"
     inkscape:window-y="25"
     inkscape:window-maximized="0"
     inkscape:current-layer="g1394" />
  <defs
     id="defs846">
    <marker
       id="DistanceX"
       orient="auto"
       refX="0.0"
       refY="0.0"
       style="overflow:visible">
      <path
         d="M 3,-3 L -3,3 M 0,-5 L  0,5"
         style="stroke:#000000; stroke-width:0.5"
         id="path833" />
    </marker>
    <pattern
       id="Hatch"
       patternUnits="userSpaceOnUse"
       width="8"
       height="8"
       x="0"
       y="0">
      <path
         d="M8 4 l-4,4"
         stroke="#000000"
         stroke-width="0.25"
         linecap="square"
         id="path836" />
      <path
         d="M6 2 l-4,4"
         stroke="#000000"
         stroke-width="0.25"
         linecap="square"
         id="path838" />
      <path
         d="M4 0 l-4,4"
         stroke="#000000"
         stroke-width="0.25"
         linecap="square"
         id="path840" />
    </pattern>
    <symbol
       id="*Model_Space" />
    <symbol
       id="*Paper_Space" />
    <symbol
       id="*Paper_Space0" />
  </defs>
  <g
     inkscape:groupmode="layer"
     inkscape:label="0"
     id="g848" />
  <g
     inkscape:groupmode="layer"
     inkscape:label="Layer 1"
     id="g1394">
    <g
       id="g1682"
       transform="matrix(0,9.5749804,-9.5749804,0,11059.902,550.17997)"
       style="opacity:1">
      <path
         d="m 15.192529,1137.3733 c 0,0 7.700901,13.3384 7.700901,13.3384"
         style="fill:none;stroke:#000000;stroke-width:0.0377953;stroke-miterlimit:4;stroke-dasharray:none;stroke-opacity:1"
         id="path850" />
      <path
         d="m 14.282532,1137.3733 c 0,0 7.700901,13.3384 7.700901,13.3384"
         style="fill:none;stroke:#000000;stroke-width:0.0377953;stroke-miterlimit:4;stroke-dasharray:none;stroke-opacity:1"
         id="path852" />
      <path
         d="m 13.375446,1137.3733 c 0,0 7.7009,13.3384 7.7009,13.3384"
         style="fill:none;stroke:#000000;stroke-width:0.0377953;stroke-miterlimit:4;stroke-dasharray:none;stroke-opacity:1"
         id="path854" />
      <path
         d="m 12.4608,1137.3733 c 0,0 7.700901,13.3384 7.700901,13.3384"
         style="fill:none;stroke:#000000;stroke-width:0.0377953;stroke-miterlimit:4;stroke-dasharray:none;stroke-opacity:1"
         id="path856" />
      <path
         d="m 11.553713,1137.3733 c 0,0 7.700901,13.3384 7.700901,13.3384"
         style="fill:none;stroke:#000000;stroke-width:0.0377953;stroke-miterlimit:4;stroke-dasharray:none;stroke-opacity:1"
         id="path858" />
      <path
         d="m 10.608831,1137.3733 c 0,0 7.700901,13.3384 7.700901,13.3384"
         style="fill:none;stroke:#000000;stroke-width:0.0377953;stroke-miterlimit:4;stroke-dasharray:none;stroke-opacity:1"
         id="path860" />
      <path
         d="m 9.701745,1137.3733 c 0,0 7.700901,13.3384 7.700901,13.3384"
         style="fill:none;stroke:#000000;stroke-width:0.0377953;stroke-miterlimit:4;stroke-dasharray:none;stroke-opacity:1"
         id="path862" />
      <path
         d="m 8.794658,1137.3733 c 0,0 7.700901,13.3384 7.700901,13.3384"
         style="fill:none;stroke:#000000;stroke-width:0.0377953;stroke-miterlimit:4;stroke-dasharray:none;stroke-opacity:1"
         id="path864" />
      <path
         d="m 7.887572,1137.3733 c 0,0 7.7009,13.3384 7.7009,13.3384"
         style="fill:none;stroke:#000000;stroke-width:0.0377953;stroke-miterlimit:4;stroke-dasharray:none;stroke-opacity:1"
         id="path866" />
      <path
         d="m 6.963477,1137.3733 c 0,0 7.700901,13.3384 7.700901,13.3384"
         style="fill:none;stroke:#000000;stroke-width:0.0377953;stroke-miterlimit:4;stroke-dasharray:none;stroke-opacity:1"
         id="path868" />
      <path
         d="m 6.05348,1137.3733 c 0,0 7.700901,13.3384 7.700901,13.3384"
         style="fill:none;stroke:#000000;stroke-width:0.0377953;stroke-miterlimit:4;stroke-dasharray:none;stroke-opacity:1"
         id="path870" />
      <path
         d="m 5.146394,1137.3733 c 0,0 7.7009,13.3384 7.7009,13.3384"
         style="fill:none;stroke:#000000;stroke-width:0.0377953;stroke-miterlimit:4;stroke-dasharray:none;stroke-opacity:1"
         id="path872" />
      <path
         d="m 4.231748,1137.3733 c 0,0 7.700901,13.3384 7.700901,13.3384"
         style="fill:none;stroke:#000000;stroke-width:0.0377953;stroke-miterlimit:4;stroke-dasharray:none;stroke-opacity:1"
         id="path874" />
      <path
         d="m 3.324661,1137.3733 c 0,0 7.700901,13.3384 7.700901,13.3384"
         style="fill:none;stroke:#000000;stroke-width:0.0377953;stroke-miterlimit:4;stroke-dasharray:none;stroke-opacity:1"
         id="path876" />
      <path
         d="m 2.37978,1137.3733 c 0,0 7.7009,13.3384 7.7009,13.3384"
         style="fill:none;stroke:#000000;stroke-width:0.0377953;stroke-miterlimit:4;stroke-dasharray:none;stroke-opacity:1"
         id="path878" />
      <path
         d="m 1.472693,1137.3733 c 0,0 7.700901,13.3384 7.700901,13.3384"
         style="fill:none;stroke:#000000;stroke-width:0.0377953;stroke-miterlimit:4;stroke-dasharray:none;stroke-opacity:1"
         id="path880" />
      <path
         d="m 0.565606,1137.3733 c 0,0 7.700901,13.3384 7.700901,13.3384"
         style="fill:none;stroke:#000000;stroke-width:0.0377953;stroke-miterlimit:4;stroke-dasharray:none;stroke-opacity:1"
         id="path882" />
      <path
         d="m -0.34148,1137.3733 c 0,0 7.7009,13.3384 7.7009,13.3384"
         style="fill:none;stroke:#000000;stroke-width:0.0377953;stroke-miterlimit:4;stroke-dasharray:none;stroke-opacity:1"
         id="path884" />
      <path
         d="m -1.265613,1137.3733 c 0,0 7.700901,13.3384 7.700901,13.3384"
         style="fill:none;stroke:#000000;stroke-width:0.0377953;stroke-miterlimit:4;stroke-dasharray:none;stroke-opacity:1"
         id="path886" />
      <path
         d="m -2.175609,1137.3733 c 0,0 7.7009,13.3384 7.7009,13.3384"
         style="fill:none;stroke:#000000;stroke-width:0.0377953;stroke-miterlimit:4;stroke-dasharray:none;stroke-opacity:1"
         id="path888" />
      <path
         d="m -3.082696,1137.3733 c 0,0 7.700901,13.3384 7.700901,13.3384"
         style="fill:none;stroke:#000000;stroke-width:0.0377953;stroke-miterlimit:4;stroke-dasharray:none;stroke-opacity:1"
         id="path890" />
      <path
         d="m -3.997342,1137.3733 c 0,0 7.700901,13.3384 7.700901,13.3384"
         style="fill:none;stroke:#000000;stroke-width:0.0377953;stroke-miterlimit:4;stroke-dasharray:none;stroke-opacity:1"
         id="path892" />
      <path
         d="m -4.904428,1137.3733 c 0,0 7.7009,13.3384 7.7009,13.3384"
         style="fill:none;stroke:#000000;stroke-width:0.0377953;stroke-miterlimit:4;stroke-dasharray:none;stroke-opacity:1"
         id="path894" />
      <path
         d="m -5.84931,1137.3733 c 0,0 7.700901,13.3384 7.700901,13.3384"
         style="fill:none;stroke:#000000;stroke-width:0.0377953;stroke-miterlimit:4;stroke-dasharray:none;stroke-opacity:1"
         id="path896" />
      <path
         d="m -6.756397,1137.3733 c 0,0 7.700901,13.3384 7.700901,13.3384"
         style="fill:none;stroke:#000000;stroke-width:0.0377953;stroke-miterlimit:4;stroke-dasharray:none;stroke-opacity:1"
         id="path898" />
      <path
         d="m -7.663483,1137.3733 c 0,0 7.7009,13.3384 7.7009,13.3384"
         style="fill:none;stroke:#000000;stroke-width:0.0377953;stroke-miterlimit:4;stroke-dasharray:none;stroke-opacity:1"
         id="path900" />
      <path
         d="m -8.57057,1137.3733 c 0,0 7.700901,13.3384 7.700901,13.3384"
         style="fill:none;stroke:#000000;stroke-width:0.0377953;stroke-miterlimit:4;stroke-dasharray:none;stroke-opacity:1"
         id="path902" />
      <path
         d="m 14.433713,1136.8501 c 0,0 3.95452,6.8494 3.95452,6.8494"
         style="fill:none;stroke:#000000;stroke-width:0.0377953;stroke-miterlimit:4;stroke-dasharray:none;stroke-opacity:1"
         id="path904" />
      <path
         d="m 13.523717,1136.8501 c 0,0 3.954519,6.8494 3.954519,6.8494"
         style="fill:none;stroke:#000000;stroke-width:0.0377953;stroke-miterlimit:4;stroke-dasharray:none;stroke-opacity:1"
         id="path906" />
      <path
         d="m 12.61663,1136.8501 c 0,0 3.95452,6.8494 3.95452,6.8494"
         style="fill:none;stroke:#000000;stroke-width:0.0377953;stroke-miterlimit:4;stroke-dasharray:none;stroke-opacity:1"
         id="path908" />
      <path
         d="m 11.701984,1136.8501 c 0,0 3.95452,6.8494 3.95452,6.8494"
         style="fill:none;stroke:#000000;stroke-width:0.0377953;stroke-miterlimit:4;stroke-dasharray:none;stroke-opacity:1"
         id="path910" />
      <path
         d="m 10.794898,1136.8501 c 0,0 3.954519,6.8494 3.954519,6.8494"
         style="fill:none;stroke:#000000;stroke-width:0.0377953;stroke-miterlimit:4;stroke-dasharray:none;stroke-opacity:1"
         id="path912" />
      <path
         d="m 9.850016,1136.8501 c 0,0 3.954519,6.8494 3.954519,6.8494"
         style="fill:none;stroke:#000000;stroke-width:0.0377953;stroke-miterlimit:4;stroke-dasharray:none;stroke-opacity:1"
         id="path914" />
      <path
         d="m 8.942929,1136.8501 c 0,0 3.95452,6.8494 3.95452,6.8494"
         style="fill:none;stroke:#000000;stroke-width:0.0377953;stroke-miterlimit:4;stroke-dasharray:none;stroke-opacity:1"
         id="path916" />
      <path
         d="m 8.035843,1136.8501 c 0,0 3.954519,6.8494 3.954519,6.8494"
         style="fill:none;stroke:#000000;stroke-width:0.0377953;stroke-miterlimit:4;stroke-dasharray:none;stroke-opacity:1"
         id="path918" />
      <path
         d="m 7.128756,1136.8501 c 0,0 3.95452,6.8494 3.95452,6.8494"
         style="fill:none;stroke:#000000;stroke-width:0.0377953;stroke-miterlimit:4;stroke-dasharray:none;stroke-opacity:1"
         id="path920" />
      <path
         d="m 6.204661,1136.8501 c 0,0 3.95452,6.8494 3.95452,6.8494"
         style="fill:none;stroke:#000000;stroke-width:0.0377953;stroke-miterlimit:4;stroke-dasharray:none;stroke-opacity:1"
         id="path922" />
      <path
         d="m 5.294665,1136.8501 c 0,0 3.954519,6.8494 3.954519,6.8494"
         style="fill:none;stroke:#000000;stroke-width:0.0377953;stroke-miterlimit:4;stroke-dasharray:none;stroke-opacity:1"
         id="path924" />
      <path
         d="m 4.387578,1136.8501 c 0,0 3.95452,6.8494 3.95452,6.8494"
         style="fill:none;stroke:#000000;stroke-width:0.0377953;stroke-miterlimit:4;stroke-dasharray:none;stroke-opacity:1"
         id="path926" />
      <path
         d="m 3.472932,1136.8501 c 0,0 3.95452,6.8494 3.95452,6.8494"
         style="fill:none;stroke:#000000;stroke-width:0.0377953;stroke-miterlimit:4;stroke-dasharray:none;stroke-opacity:1"
         id="path928" />
      <path
         d="m 2.565846,1136.8501 c 0,0 3.954519,6.8494 3.954519,6.8494"
         style="fill:none;stroke:#000000;stroke-width:0.0377953;stroke-miterlimit:4;stroke-dasharray:none;stroke-opacity:1"
         id="path930" />
      <path
         d="m 1.620964,1136.8501 c 0,0 3.954519,6.8494 3.954519,6.8494"
         style="fill:none;stroke:#000000;stroke-width:0.0377953;stroke-miterlimit:4;stroke-dasharray:none;stroke-opacity:1"
         id="path932" />
      <path
         d="m 0.713877,1136.8501 c 0,0 3.95452,6.8494 3.95452,6.8494"
         style="fill:none;stroke:#000000;stroke-width:0.0377953;stroke-miterlimit:4;stroke-dasharray:none;stroke-opacity:1"
         id="path934" />
      <path
         d="m -0.193209,1136.8501 c 0,0 3.954519,6.8494 3.954519,6.8494"
         style="fill:none;stroke:#000000;stroke-width:0.0377953;stroke-miterlimit:4;stroke-dasharray:none;stroke-opacity:1"
         id="path936" />
      <path
         d="m -1.100296,1136.8501 c 0,0 3.95452,6.8494 3.95452,6.8494"
         style="fill:none;stroke:#000000;stroke-width:0.0377953;stroke-miterlimit:4;stroke-dasharray:none;stroke-opacity:1"
         id="path938" />
      <path
         d="m -2.024428,1136.8501 c 0,0 3.954519,6.8494 3.954519,6.8494"
         style="fill:none;stroke:#000000;stroke-width:0.0377953;stroke-miterlimit:4;stroke-dasharray:none;stroke-opacity:1"
         id="path940" />
      <path
         d="m -2.934425,1136.8501 c 0,0 3.954519,6.8494 3.954519,6.8494"
         style="fill:none;stroke:#000000;stroke-width:0.0377953;stroke-miterlimit:4;stroke-dasharray:none;stroke-opacity:1"
         id="path942" />
      <path
         d="m -3.841512,1136.8501 c 0,0 3.95452,6.8494 3.95452,6.8494"
         style="fill:none;stroke:#000000;stroke-width:0.0377953;stroke-miterlimit:4;stroke-dasharray:none;stroke-opacity:1"
         id="path944" />
      <path
         d="m -4.756157,1136.8501 c 0,0 3.954519,6.8494 3.954519,6.8494"
         style="fill:none;stroke:#000000;stroke-width:0.0377953;stroke-miterlimit:4;stroke-dasharray:none;stroke-opacity:1"
         id="path946" />
      <path
         d="m -5.663244,1136.8501 c 0,0 3.95452,6.8494 3.95452,6.8494"
         style="fill:none;stroke:#000000;stroke-width:0.0377953;stroke-miterlimit:4;stroke-dasharray:none;stroke-opacity:1"
         id="path948" />
      <path
         d="m -6.608126,1136.8501 c 0,0 3.95452,6.8494 3.95452,6.8494"
         style="fill:none;stroke:#000000;stroke-width:0.0377953;stroke-miterlimit:4;stroke-dasharray:none;stroke-opacity:1"
         id="path950" />
      <path
         d="m -7.515213,1136.8501 c 0,0 3.95452,6.8494 3.95452,6.8494"
         style="fill:none;stroke:#000000;stroke-width:0.0377953;stroke-miterlimit:4;stroke-dasharray:none;stroke-opacity:1"
         id="path952" />
      <path
         d="m -8.422299,1136.8501 c 0,0 3.954519,6.8494 3.954519,6.8494"
         style="fill:none;stroke:#000000;stroke-width:0.0377953;stroke-miterlimit:4;stroke-dasharray:none;stroke-opacity:1"
         id="path954" />
      <path
         d="m -9.329386,1136.8501 c 0,0 3.95452,6.8494 3.95452,6.8494"
         style="fill:none;stroke:#000000;stroke-width:0.0377953;stroke-miterlimit:4;stroke-dasharray:none;stroke-opacity:1"
         id="path956" />
      <path
         d="m 19.096441,1144.9262 c 0,0 3.954595,6.8495 3.954595,6.8495"
         style="fill:none;stroke:#000000;stroke-width:0.0377953;stroke-miterlimit:4;stroke-dasharray:none;stroke-opacity:1"
         id="path958" />
      <path
         d="m 18.186444,1144.9262 c 0,0 3.954595,6.8495 3.954595,6.8495"
         style="fill:none;stroke:#000000;stroke-width:0.0377953;stroke-miterlimit:4;stroke-dasharray:none;stroke-opacity:1"
         id="path960" />
      <path
         d="m 17.279357,1144.9262 c 0,0 3.954596,6.8495 3.954596,6.8495"
         style="fill:none;stroke:#000000;stroke-width:0.0377953;stroke-miterlimit:4;stroke-dasharray:none;stroke-opacity:1"
         id="path962" />
      <path
         d="m 16.364712,1144.9262 c 0,0 3.954595,6.8495 3.954595,6.8495"
         style="fill:none;stroke:#000000;stroke-width:0.0377953;stroke-miterlimit:4;stroke-dasharray:none;stroke-opacity:1"
         id="path964" />
      <path
         d="m 15.457625,1144.9262 c 0,0 3.954595,6.8495 3.954595,6.8495"
         style="fill:none;stroke:#000000;stroke-width:0.0377953;stroke-miterlimit:4;stroke-dasharray:none;stroke-opacity:1"
         id="path966" />
      <path
         d="m 14.512743,1144.9262 c 0,0 3.954596,6.8495 3.954596,6.8495"
         style="fill:none;stroke:#000000;stroke-width:0.0377953;stroke-miterlimit:4;stroke-dasharray:none;stroke-opacity:1"
         id="path968" />
      <path
         d="m 13.605657,1144.9262 c 0,0 3.954595,6.8495 3.954595,6.8495"
         style="fill:none;stroke:#000000;stroke-width:0.0377953;stroke-miterlimit:4;stroke-dasharray:none;stroke-opacity:1"
         id="path970" />
      <path
         d="m 12.69857,1144.9262 c 0,0 3.954595,6.8495 3.954595,6.8495"
         style="fill:none;stroke:#000000;stroke-width:0.0377953;stroke-miterlimit:4;stroke-dasharray:none;stroke-opacity:1"
         id="path972" />
      <path
         d="m 11.791483,1144.9262 c 0,0 3.954596,6.8495 3.954596,6.8495"
         style="fill:none;stroke:#000000;stroke-width:0.0377953;stroke-miterlimit:4;stroke-dasharray:none;stroke-opacity:1"
         id="path974" />
      <path
         d="m 10.867389,1144.9262 c 0,0 3.954595,6.8495 3.954595,6.8495"
         style="fill:none;stroke:#000000;stroke-width:0.0377953;stroke-miterlimit:4;stroke-dasharray:none;stroke-opacity:1"
         id="path976" />
      <path
         d="m 9.957392,1144.9262 c 0,0 3.954595,6.8495 3.954595,6.8495"
         style="fill:none;stroke:#000000;stroke-width:0.0377953;stroke-miterlimit:4;stroke-dasharray:none;stroke-opacity:1"
         id="path978" />
      <path
         d="m 9.050306,1144.9262 c 0,0 3.954595,6.8495 3.954595,6.8495"
         style="fill:none;stroke:#000000;stroke-width:0.0377953;stroke-miterlimit:4;stroke-dasharray:none;stroke-opacity:1"
         id="path980" />
      <path
         d="m 8.13566,1144.9262 c 0,0 3.954595,6.8495 3.954595,6.8495"
         style="fill:none;stroke:#000000;stroke-width:0.0377953;stroke-miterlimit:4;stroke-dasharray:none;stroke-opacity:1"
         id="path982" />
      <path
         d="m 7.228573,1144.9262 c 0,0 3.954596,6.8495 3.954596,6.8495"
         style="fill:none;stroke:#000000;stroke-width:0.0377953;stroke-miterlimit:4;stroke-dasharray:none;stroke-opacity:1"
         id="path984" />
      <path
         d="m 6.283691,1144.9262 c 0,0 3.954596,6.8495 3.954596,6.8495"
         style="fill:none;stroke:#000000;stroke-width:0.0377953;stroke-miterlimit:4;stroke-dasharray:none;stroke-opacity:1"
         id="path986" />
      <path
         d="m 5.376605,1144.9262 c 0,0 3.954595,6.8495 3.954595,6.8495"
         style="fill:none;stroke:#000000;stroke-width:0.0377953;stroke-miterlimit:4;stroke-dasharray:none;stroke-opacity:1"
         id="path988" />
      <path
         d="m 4.469518,1144.9262 c 0,0 3.954595,6.8495 3.954595,6.8495"
         style="fill:none;stroke:#000000;stroke-width:0.0377953;stroke-miterlimit:4;stroke-dasharray:none;stroke-opacity:1"
         id="path990" />
      <path
         d="m 3.562431,1144.9262 c 0,0 3.954596,6.8495 3.954596,6.8495"
         style="fill:none;stroke:#000000;stroke-width:0.0377953;stroke-miterlimit:4;stroke-dasharray:none;stroke-opacity:1"
         id="path992" />
      <path
         d="m 2.638299,1144.9262 c 0,0 3.954595,6.8495 3.954595,6.8495"
         style="fill:none;stroke:#000000;stroke-width:0.0377953;stroke-miterlimit:4;stroke-dasharray:none;stroke-opacity:1"
         id="path994" />
      <path
         d="m 1.728302,1144.9262 c 0,0 3.954596,6.8495 3.954596,6.8495"
         style="fill:none;stroke:#000000;stroke-width:0.0377953;stroke-miterlimit:4;stroke-dasharray:none;stroke-opacity:1"
         id="path996" />
      <path
         d="m 0.821216,1144.9262 c 0,0 3.954595,6.8495 3.954595,6.8495"
         style="fill:none;stroke:#000000;stroke-width:0.0377953;stroke-miterlimit:4;stroke-dasharray:none;stroke-opacity:1"
         id="path998" />
      <path
         d="m -0.09343,1144.9262 c 0,0 3.954595,6.8495 3.954595,6.8495"
         style="fill:none;stroke:#000000;stroke-width:0.0377953;stroke-miterlimit:4;stroke-dasharray:none;stroke-opacity:1"
         id="path1000" />
      <path
         d="m -1.000517,1144.9262 c 0,0 3.954596,6.8495 3.954596,6.8495"
         style="fill:none;stroke:#000000;stroke-width:0.0377953;stroke-miterlimit:4;stroke-dasharray:none;stroke-opacity:1"
         id="path1002" />
      <path
         d="m -1.945398,1144.9262 c 0,0 3.954595,6.8495 3.954595,6.8495"
         style="fill:none;stroke:#000000;stroke-width:0.0377953;stroke-miterlimit:4;stroke-dasharray:none;stroke-opacity:1"
         id="path1004" />
      <path
         d="m -2.852485,1144.9262 c 0,0 3.954595,6.8495 3.954595,6.8495"
         style="fill:none;stroke:#000000;stroke-width:0.0377953;stroke-miterlimit:4;stroke-dasharray:none;stroke-opacity:1"
         id="path1006" />
      <path
         d="m -3.759572,1144.9262 c 0,0 3.954596,6.8495 3.954596,6.8495"
         style="fill:none;stroke:#000000;stroke-width:0.0377953;stroke-miterlimit:4;stroke-dasharray:none;stroke-opacity:1"
         id="path1008" />
      <path
         d="m -4.666658,1144.9262 c 0,0 3.954595,6.8495 3.954595,6.8495"
         style="fill:none;stroke:#000000;stroke-width:0.0377953;stroke-miterlimit:4;stroke-dasharray:none;stroke-opacity:1"
         id="path1010" />
      <path
         d="m 35.879735,1137.3733 c 0,0 -7.7009,13.3384 -7.7009,13.3384"
         style="fill:none;stroke:#000000;stroke-width:0.0377953;stroke-miterlimit:4;stroke-dasharray:none;stroke-opacity:1"
         id="path1012" />
      <path
         d="m 36.789732,1137.3733 c 0,0 -7.700901,13.3384 -7.700901,13.3384"
         style="fill:none;stroke:#000000;stroke-width:0.0377953;stroke-miterlimit:4;stroke-dasharray:none;stroke-opacity:1"
         id="path1014" />
      <path
         d="m 37.696819,1137.3733 c 0,0 -7.700901,13.3384 -7.700901,13.3384"
         style="fill:none;stroke:#000000;stroke-width:0.0377953;stroke-miterlimit:4;stroke-dasharray:none;stroke-opacity:1"
         id="path1016" />
      <path
         d="m 38.611465,1137.3733 c 0,0 -7.700901,13.3384 -7.700901,13.3384"
         style="fill:none;stroke:#000000;stroke-width:0.0377953;stroke-miterlimit:4;stroke-dasharray:none;stroke-opacity:1"
         id="path1018" />
      <path
         d="m 39.518551,1137.3733 c 0,0 -7.700901,13.3384 -7.700901,13.3384"
         style="fill:none;stroke:#000000;stroke-width:0.0377953;stroke-miterlimit:4;stroke-dasharray:none;stroke-opacity:1"
         id="path1020" />
      <path
         d="m 40.463433,1137.3733 c 0,0 -7.700901,13.3384 -7.700901,13.3384"
         style="fill:none;stroke:#000000;stroke-width:0.0377953;stroke-miterlimit:4;stroke-dasharray:none;stroke-opacity:1"
         id="path1022" />
      <path
         d="m 41.37052,1137.3733 c 0,0 -7.700901,13.3384 -7.700901,13.3384"
         style="fill:none;stroke:#000000;stroke-width:0.0377953;stroke-miterlimit:4;stroke-dasharray:none;stroke-opacity:1"
         id="path1024" />
      <path
         d="m 42.277606,1137.3733 c 0,0 -7.7009,13.3384 -7.7009,13.3384"
         style="fill:none;stroke:#000000;stroke-width:0.0377953;stroke-miterlimit:4;stroke-dasharray:none;stroke-opacity:1"
         id="path1026" />
      <path
         d="m 43.184693,1137.3733 c 0,0 -7.700901,13.3384 -7.700901,13.3384"
         style="fill:none;stroke:#000000;stroke-width:0.0377953;stroke-miterlimit:4;stroke-dasharray:none;stroke-opacity:1"
         id="path1028" />
      <path
         d="m 44.108787,1137.3733 c 0,0 -7.7009,13.3384 -7.7009,13.3384"
         style="fill:none;stroke:#000000;stroke-width:0.0377953;stroke-miterlimit:4;stroke-dasharray:none;stroke-opacity:1"
         id="path1030" />
      <path
         d="m 45.018784,1137.3733 c 0,0 -7.700901,13.3384 -7.700901,13.3384"
         style="fill:none;stroke:#000000;stroke-width:0.0377953;stroke-miterlimit:4;stroke-dasharray:none;stroke-opacity:1"
         id="path1032" />
      <path
         d="m 45.925871,1137.3733 c 0,0 -7.700901,13.3384 -7.700901,13.3384"
         style="fill:none;stroke:#000000;stroke-width:0.0377953;stroke-miterlimit:4;stroke-dasharray:none;stroke-opacity:1"
         id="path1034" />
      <path
         d="m 46.840517,1137.3733 c 0,0 -7.700901,13.3384 -7.700901,13.3384"
         style="fill:none;stroke:#000000;stroke-width:0.0377953;stroke-miterlimit:4;stroke-dasharray:none;stroke-opacity:1"
         id="path1036" />
      <path
         d="m 47.747603,1137.3733 c 0,0 -7.700901,13.3384 -7.700901,13.3384"
         style="fill:none;stroke:#000000;stroke-width:0.0377953;stroke-miterlimit:4;stroke-dasharray:none;stroke-opacity:1"
         id="path1038" />
      <path
         d="m 48.692485,1137.3733 c 0,0 -7.700901,13.3384 -7.700901,13.3384"
         style="fill:none;stroke:#000000;stroke-width:0.0377953;stroke-miterlimit:4;stroke-dasharray:none;stroke-opacity:1"
         id="path1040" />
      <path
         d="m 49.599572,1137.3733 c 0,0 -7.700901,13.3384 -7.700901,13.3384"
         style="fill:none;stroke:#000000;stroke-width:0.0377953;stroke-miterlimit:4;stroke-dasharray:none;stroke-opacity:1"
         id="path1042" />
      <path
         d="m 50.506658,1137.3733 c 0,0 -7.700901,13.3384 -7.700901,13.3384"
         style="fill:none;stroke:#000000;stroke-width:0.0377953;stroke-miterlimit:4;stroke-dasharray:none;stroke-opacity:1"
         id="path1044" />
      <path
         d="m 51.413745,1137.3733 c 0,0 -7.700901,13.3384 -7.700901,13.3384"
         style="fill:none;stroke:#000000;stroke-width:0.0377953;stroke-miterlimit:4;stroke-dasharray:none;stroke-opacity:1"
         id="path1046" />
      <path
         d="m 52.337877,1137.3733 c 0,0 -7.700901,13.3384 -7.700901,13.3384"
         style="fill:none;stroke:#000000;stroke-width:0.0377953;stroke-miterlimit:4;stroke-dasharray:none;stroke-opacity:1"
         id="path1048" />
      <path
         d="m 53.247874,1137.3733 c 0,0 -7.700901,13.3384 -7.700901,13.3384"
         style="fill:none;stroke:#000000;stroke-width:0.0377953;stroke-miterlimit:4;stroke-dasharray:none;stroke-opacity:1"
         id="path1050" />
      <path
         d="m 54.154961,1137.3733 c 0,0 -7.700901,13.3384 -7.700901,13.3384"
         style="fill:none;stroke:#000000;stroke-width:0.0377953;stroke-miterlimit:4;stroke-dasharray:none;stroke-opacity:1"
         id="path1052" />
      <path
         d="m 55.069606,1137.3733 c 0,0 -7.7009,13.3384 -7.7009,13.3384"
         style="fill:none;stroke:#000000;stroke-width:0.0377953;stroke-miterlimit:4;stroke-dasharray:none;stroke-opacity:1"
         id="path1054" />
      <path
         d="m 55.976693,1137.3733 c 0,0 -7.700901,13.3384 -7.700901,13.3384"
         style="fill:none;stroke:#000000;stroke-width:0.0377953;stroke-miterlimit:4;stroke-dasharray:none;stroke-opacity:1"
         id="path1056" />
      <path
         d="m 56.921575,1137.3733 c 0,0 -7.700901,13.3384 -7.700901,13.3384"
         style="fill:none;stroke:#000000;stroke-width:0.0377953;stroke-miterlimit:4;stroke-dasharray:none;stroke-opacity:1"
         id="path1058" />
      <path
         d="m 57.828661,1137.3733 c 0,0 -7.7009,13.3384 -7.7009,13.3384"
         style="fill:none;stroke:#000000;stroke-width:0.0377953;stroke-miterlimit:4;stroke-dasharray:none;stroke-opacity:1"
         id="path1060" />
      <path
         d="m 58.735748,1137.3733 c 0,0 -7.700901,13.3384 -7.700901,13.3384"
         style="fill:none;stroke:#000000;stroke-width:0.0377953;stroke-miterlimit:4;stroke-dasharray:none;stroke-opacity:1"
         id="path1062" />
      <path
         d="m 59.642835,1137.3733 c 0,0 -7.700901,13.3384 -7.700901,13.3384"
         style="fill:none;stroke:#000000;stroke-width:0.0377953;stroke-miterlimit:4;stroke-dasharray:none;stroke-opacity:1"
         id="path1064" />
      <path
         d="m 36.638551,1136.8501 c 0,0 -3.95452,6.8494 -3.95452,6.8494"
         style="fill:none;stroke:#000000;stroke-width:0.0377953;stroke-miterlimit:4;stroke-dasharray:none;stroke-opacity:1"
         id="path1066" />
      <path
         d="m 37.548548,1136.8501 c 0,0 -3.95452,6.8494 -3.95452,6.8494"
         style="fill:none;stroke:#000000;stroke-width:0.0377953;stroke-miterlimit:4;stroke-dasharray:none;stroke-opacity:1"
         id="path1068" />
      <path
         d="m 38.455635,1136.8501 c 0,0 -3.95452,6.8494 -3.95452,6.8494"
         style="fill:none;stroke:#000000;stroke-width:0.0377953;stroke-miterlimit:4;stroke-dasharray:none;stroke-opacity:1"
         id="path1070" />
      <path
         d="m 39.37028,1136.8501 c 0,0 -3.954519,6.8494 -3.954519,6.8494"
         style="fill:none;stroke:#000000;stroke-width:0.0377953;stroke-miterlimit:4;stroke-dasharray:none;stroke-opacity:1"
         id="path1072" />
      <path
         d="m 40.277367,1136.8501 c 0,0 -3.95452,6.8494 -3.95452,6.8494"
         style="fill:none;stroke:#000000;stroke-width:0.0377953;stroke-miterlimit:4;stroke-dasharray:none;stroke-opacity:1"
         id="path1074" />
      <path
         d="m 41.222249,1136.8501 c 0,0 -3.95452,6.8494 -3.95452,6.8494"
         style="fill:none;stroke:#000000;stroke-width:0.0377953;stroke-miterlimit:4;stroke-dasharray:none;stroke-opacity:1"
         id="path1076" />
      <path
         d="m 42.129335,1136.8501 c 0,0 -3.954519,6.8494 -3.954519,6.8494"
         style="fill:none;stroke:#000000;stroke-width:0.0377953;stroke-miterlimit:4;stroke-dasharray:none;stroke-opacity:1"
         id="path1078" />
      <path
         d="m 43.036422,1136.8501 c 0,0 -3.95452,6.8494 -3.95452,6.8494"
         style="fill:none;stroke:#000000;stroke-width:0.0377953;stroke-miterlimit:4;stroke-dasharray:none;stroke-opacity:1"
         id="path1080" />
      <path
         d="m 43.943509,1136.8501 c 0,0 -3.95452,6.8494 -3.95452,6.8494"
         style="fill:none;stroke:#000000;stroke-width:0.0377953;stroke-miterlimit:4;stroke-dasharray:none;stroke-opacity:1"
         id="path1082" />
      <path
         d="m 44.867603,1136.8501 c 0,0 -3.95452,6.8494 -3.95452,6.8494"
         style="fill:none;stroke:#000000;stroke-width:0.0377953;stroke-miterlimit:4;stroke-dasharray:none;stroke-opacity:1"
         id="path1084" />
      <path
         d="m 45.7776,1136.8501 c 0,0 -3.95452,6.8494 -3.95452,6.8494"
         style="fill:none;stroke:#000000;stroke-width:0.0377953;stroke-miterlimit:4;stroke-dasharray:none;stroke-opacity:1"
         id="path1086" />
      <path
         d="m 46.684687,1136.8501 c 0,0 -3.95452,6.8494 -3.95452,6.8494"
         style="fill:none;stroke:#000000;stroke-width:0.0377953;stroke-miterlimit:4;stroke-dasharray:none;stroke-opacity:1"
         id="path1088" />
      <path
         d="m 47.599332,1136.8501 c 0,0 -3.954519,6.8494 -3.954519,6.8494"
         style="fill:none;stroke:#000000;stroke-width:0.0377953;stroke-miterlimit:4;stroke-dasharray:none;stroke-opacity:1"
         id="path1090" />
      <path
         d="m 48.506419,1136.8501 c 0,0 -3.95452,6.8494 -3.95452,6.8494"
         style="fill:none;stroke:#000000;stroke-width:0.0377953;stroke-miterlimit:4;stroke-dasharray:none;stroke-opacity:1"
         id="path1092" />
      <path
         d="m 49.451301,1136.8501 c 0,0 -3.95452,6.8494 -3.95452,6.8494"
         style="fill:none;stroke:#000000;stroke-width:0.0377953;stroke-miterlimit:4;stroke-dasharray:none;stroke-opacity:1"
         id="path1094" />
      <path
         d="m 50.358387,1136.8501 c 0,0 -3.954519,6.8494 -3.954519,6.8494"
         style="fill:none;stroke:#000000;stroke-width:0.0377953;stroke-miterlimit:4;stroke-dasharray:none;stroke-opacity:1"
         id="path1096" />
      <path
         d="m 51.265474,1136.8501 c 0,0 -3.95452,6.8494 -3.95452,6.8494"
         style="fill:none;stroke:#000000;stroke-width:0.0377953;stroke-miterlimit:4;stroke-dasharray:none;stroke-opacity:1"
         id="path1098" />
      <path
         d="m 52.172561,1136.8501 c 0,0 -3.95452,6.8494 -3.95452,6.8494"
         style="fill:none;stroke:#000000;stroke-width:0.0377953;stroke-miterlimit:4;stroke-dasharray:none;stroke-opacity:1"
         id="path1100" />
      <path
         d="m 53.096693,1136.8501 c 0,0 -3.95452,6.8494 -3.95452,6.8494"
         style="fill:none;stroke:#000000;stroke-width:0.0377953;stroke-miterlimit:4;stroke-dasharray:none;stroke-opacity:1"
         id="path1102" />
      <path
         d="m 54.00669,1136.8501 c 0,0 -3.95452,6.8494 -3.95452,6.8494"
         style="fill:none;stroke:#000000;stroke-width:0.0377953;stroke-miterlimit:4;stroke-dasharray:none;stroke-opacity:1"
         id="path1104" />
      <path
         d="m 54.913776,1136.8501 c 0,0 -3.954519,6.8494 -3.954519,6.8494"
         style="fill:none;stroke:#000000;stroke-width:0.0377953;stroke-miterlimit:4;stroke-dasharray:none;stroke-opacity:1"
         id="path1106" />
      <path
         d="m 55.828422,1136.8501 c 0,0 -3.95452,6.8494 -3.95452,6.8494"
         style="fill:none;stroke:#000000;stroke-width:0.0377953;stroke-miterlimit:4;stroke-dasharray:none;stroke-opacity:1"
         id="path1108" />
      <path
         d="m 56.735509,1136.8501 c 0,0 -3.95452,6.8494 -3.95452,6.8494"
         style="fill:none;stroke:#000000;stroke-width:0.0377953;stroke-miterlimit:4;stroke-dasharray:none;stroke-opacity:1"
         id="path1110" />
      <path
         d="m 57.680391,1136.8501 c 0,0 -3.95452,6.8494 -3.95452,6.8494"
         style="fill:none;stroke:#000000;stroke-width:0.0377953;stroke-miterlimit:4;stroke-dasharray:none;stroke-opacity:1"
         id="path1112" />
      <path
         d="m 58.587477,1136.8501 c 0,0 -3.95452,6.8494 -3.95452,6.8494"
         style="fill:none;stroke:#000000;stroke-width:0.0377953;stroke-miterlimit:4;stroke-dasharray:none;stroke-opacity:1"
         id="path1114" />
      <path
         d="m 59.494564,1136.8501 c 0,0 -3.95452,6.8494 -3.95452,6.8494"
         style="fill:none;stroke:#000000;stroke-width:0.0377953;stroke-miterlimit:4;stroke-dasharray:none;stroke-opacity:1"
         id="path1116" />
      <path
         d="m 60.40165,1136.8501 c 0,0 -3.954519,6.8494 -3.954519,6.8494"
         style="fill:none;stroke:#000000;stroke-width:0.0377953;stroke-miterlimit:4;stroke-dasharray:none;stroke-opacity:1"
         id="path1118" />
      <path
         d="m 31.975824,1144.9262 c 0,0 -3.954596,6.8495 -3.954596,6.8495"
         style="fill:none;stroke:#000000;stroke-width:0.0377953;stroke-miterlimit:4;stroke-dasharray:none;stroke-opacity:1"
         id="path1120" />
      <path
         d="m 32.88582,1144.9262 c 0,0 -3.954595,6.8495 -3.954595,6.8495"
         style="fill:none;stroke:#000000;stroke-width:0.0377953;stroke-miterlimit:4;stroke-dasharray:none;stroke-opacity:1"
         id="path1122" />
      <path
         d="m 33.792907,1144.9262 c 0,0 -3.954595,6.8495 -3.954595,6.8495"
         style="fill:none;stroke:#000000;stroke-width:0.0377953;stroke-miterlimit:4;stroke-dasharray:none;stroke-opacity:1"
         id="path1124" />
      <path
         d="m 34.707553,1144.9262 c 0,0 -3.954596,6.8495 -3.954596,6.8495"
         style="fill:none;stroke:#000000;stroke-width:0.0377953;stroke-miterlimit:4;stroke-dasharray:none;stroke-opacity:1"
         id="path1126" />
      <path
         d="m 35.614639,1144.9262 c 0,0 -3.954595,6.8495 -3.954595,6.8495"
         style="fill:none;stroke:#000000;stroke-width:0.0377953;stroke-miterlimit:4;stroke-dasharray:none;stroke-opacity:1"
         id="path1128" />
      <path
         d="m 36.559521,1144.9262 c 0,0 -3.954595,6.8495 -3.954595,6.8495"
         style="fill:none;stroke:#000000;stroke-width:0.0377953;stroke-miterlimit:4;stroke-dasharray:none;stroke-opacity:1"
         id="path1130" />
      <path
         d="m 37.466608,1144.9262 c 0,0 -3.954595,6.8495 -3.954595,6.8495"
         style="fill:none;stroke:#000000;stroke-width:0.0377953;stroke-miterlimit:4;stroke-dasharray:none;stroke-opacity:1"
         id="path1132" />
      <path
         d="m 38.373694,1144.9262 c 0,0 -3.954595,6.8495 -3.954595,6.8495"
         style="fill:none;stroke:#000000;stroke-width:0.0377953;stroke-miterlimit:4;stroke-dasharray:none;stroke-opacity:1"
         id="path1134" />
      <path
         d="m 39.280781,1144.9262 c 0,0 -3.954595,6.8495 -3.954595,6.8495"
         style="fill:none;stroke:#000000;stroke-width:0.0377953;stroke-miterlimit:4;stroke-dasharray:none;stroke-opacity:1"
         id="path1136" />
      <path
         d="m 40.204876,1144.9262 c 0,0 -3.954596,6.8495 -3.954596,6.8495"
         style="fill:none;stroke:#000000;stroke-width:0.0377953;stroke-miterlimit:4;stroke-dasharray:none;stroke-opacity:1"
         id="path1138" />
      <path
         d="m 41.114872,1144.9262 c 0,0 -3.954595,6.8495 -3.954595,6.8495"
         style="fill:none;stroke:#000000;stroke-width:0.0377953;stroke-miterlimit:4;stroke-dasharray:none;stroke-opacity:1"
         id="path1140" />
      <path
         d="m 42.021959,1144.9262 c 0,0 -3.954595,6.8495 -3.954595,6.8495"
         style="fill:none;stroke:#000000;stroke-width:0.0377953;stroke-miterlimit:4;stroke-dasharray:none;stroke-opacity:1"
         id="path1142" />
      <path
         d="m 42.936605,1144.9262 c 0,0 -3.954596,6.8495 -3.954596,6.8495"
         style="fill:none;stroke:#000000;stroke-width:0.0377953;stroke-miterlimit:4;stroke-dasharray:none;stroke-opacity:1"
         id="path1144" />
      <path
         d="m 43.843691,1144.9262 c 0,0 -3.954595,6.8495 -3.954595,6.8495"
         style="fill:none;stroke:#000000;stroke-width:0.0377953;stroke-miterlimit:4;stroke-dasharray:none;stroke-opacity:1"
         id="path1146" />
      <path
         d="m 44.788573,1144.9262 c 0,0 -3.954595,6.8495 -3.954595,6.8495"
         style="fill:none;stroke:#000000;stroke-width:0.0377953;stroke-miterlimit:4;stroke-dasharray:none;stroke-opacity:1"
         id="path1148" />
      <path
         d="m 45.69566,1144.9262 c 0,0 -3.954595,6.8495 -3.954595,6.8495"
         style="fill:none;stroke:#000000;stroke-width:0.0377953;stroke-miterlimit:4;stroke-dasharray:none;stroke-opacity:1"
         id="path1150" />
      <path
         d="m 46.602746,1144.9262 c 0,0 -3.954595,6.8495 -3.954595,6.8495"
         style="fill:none;stroke:#000000;stroke-width:0.0377953;stroke-miterlimit:4;stroke-dasharray:none;stroke-opacity:1"
         id="path1152" />
      <path
         d="m 47.509833,1144.9262 c 0,0 -3.954595,6.8495 -3.954595,6.8495"
         style="fill:none;stroke:#000000;stroke-width:0.0377953;stroke-miterlimit:4;stroke-dasharray:none;stroke-opacity:1"
         id="path1154" />
      <path
         d="m 48.433965,1144.9262 c 0,0 -3.954595,6.8495 -3.954595,6.8495"
         style="fill:none;stroke:#000000;stroke-width:0.0377953;stroke-miterlimit:4;stroke-dasharray:none;stroke-opacity:1"
         id="path1156" />
      <path
         d="m 49.343962,1144.9262 c 0,0 -3.954595,6.8495 -3.954595,6.8495"
         style="fill:none;stroke:#000000;stroke-width:0.0377953;stroke-miterlimit:4;stroke-dasharray:none;stroke-opacity:1"
         id="path1158" />
      <path
         d="m 50.251049,1144.9262 c 0,0 -3.954595,6.8495 -3.954595,6.8495"
         style="fill:none;stroke:#000000;stroke-width:0.0377953;stroke-miterlimit:4;stroke-dasharray:none;stroke-opacity:1"
         id="path1160" />
      <path
         d="m 51.165694,1144.9262 c 0,0 -3.954595,6.8495 -3.954595,6.8495"
         style="fill:none;stroke:#000000;stroke-width:0.0377953;stroke-miterlimit:4;stroke-dasharray:none;stroke-opacity:1"
         id="path1162" />
      <path
         d="m 52.072781,1144.9262 c 0,0 -3.954595,6.8495 -3.954595,6.8495"
         style="fill:none;stroke:#000000;stroke-width:0.0377953;stroke-miterlimit:4;stroke-dasharray:none;stroke-opacity:1"
         id="path1164" />
      <path
         d="m 53.017663,1144.9262 c 0,0 -3.954595,6.8495 -3.954595,6.8495"
         style="fill:none;stroke:#000000;stroke-width:0.0377953;stroke-miterlimit:4;stroke-dasharray:none;stroke-opacity:1"
         id="path1166" />
      <path
         d="m 53.92475,1144.9262 c 0,0 -3.954596,6.8495 -3.954596,6.8495"
         style="fill:none;stroke:#000000;stroke-width:0.0377953;stroke-miterlimit:4;stroke-dasharray:none;stroke-opacity:1"
         id="path1168" />
      <path
         d="m 54.831836,1144.9262 c 0,0 -3.954595,6.8495 -3.954595,6.8495"
         style="fill:none;stroke:#000000;stroke-width:0.0377953;stroke-miterlimit:4;stroke-dasharray:none;stroke-opacity:1"
         id="path1170" />
      <path
         d="m 55.738923,1144.9262 c 0,0 -3.954595,6.8495 -3.954595,6.8495"
         style="fill:none;stroke:#000000;stroke-width:0.0377953;stroke-miterlimit:4;stroke-dasharray:none;stroke-opacity:1"
         id="path1172" />
      <path
         d="m 62.326488,1151.8591 c 0,0 -113.469165,0 -113.469165,0"
         style="fill:none;stroke:#000000;stroke-width:0.0377953;stroke-miterlimit:4;stroke-dasharray:none;stroke-opacity:1"
         id="path1174" />
      <path
         d="m -51.142677,1136.8577 c 0,0 113.469165,0 113.469165,0"
         style="fill:none;stroke:#000000;stroke-width:0.0377953;stroke-miterlimit:4;stroke-dasharray:none;stroke-opacity:1"
         id="path1176" />
      <path
         d="m -51.142677,1148.7521 c 0,0 0,-3.678 0,-3.678"
         style="fill:none;stroke:#000000;stroke-width:0.0377953;stroke-miterlimit:4;stroke-dasharray:none;stroke-opacity:1"
         id="path1178" />
      <path
         d="m -51.142677,1151.8591 c 0,0 0,-1.7494 0,-1.7494"
         style="fill:none;stroke:#000000;stroke-width:0.0377953;stroke-miterlimit:4;stroke-dasharray:none;stroke-opacity:1"
         id="path1180" />
      <path
         d="m -51.142677,1138.5618 c 0,0 0,-1.7041 0,-1.7041"
         style="fill:none;stroke:#000000;stroke-width:0.0377953;stroke-miterlimit:4;stroke-dasharray:none;stroke-opacity:1"
         id="path1182" />
      <path
         d="m -51.142677,1143.5992 c 0,0 0,-3.687 0,-3.687"
         style="fill:none;stroke:#000000;stroke-width:0.0377953;stroke-miterlimit:4;stroke-dasharray:none;stroke-opacity:1"
         id="path1184" />
      <path
         d="m -51.16868,1138.5593 c 0,0 1.298041,0 1.298041,0 0,0 0,0 0.0093,-0.019"
         style="fill:none;stroke:#000000;stroke-width:0.0377953;stroke-miterlimit:4;stroke-dasharray:none;stroke-opacity:1"
         id="path1186" />
      <path
         d="m -49.86138,1138.54 c 0.267289,-0.5566 0.837506,-0.9162 1.452586,-0.9162 0,0 0.889059,0 1.612385,0.7234 0,0.889 0,0.889 0,1.7781 -0.723326,0.7234 -1.612385,0.7234 -1.612385,0.7234 -0.61508,0 -1.185297,-0.3597 -1.452586,-0.9162"
         style="fill:none;stroke:#000000;stroke-width:0.0377953;stroke-miterlimit:4;stroke-dasharray:none;stroke-opacity:1"
         id="path1188" />
      <path
         d="m -49.86138,1139.9325 c 0,0 -0.0093,-0.019 -0.0093,-0.019 0,0 0,0 -1.298041,0"
         style="fill:none;stroke:#000000;stroke-width:0.0377953;stroke-miterlimit:4;stroke-dasharray:none;stroke-opacity:1"
         id="path1190" />
      <path
         d="m -51.16868,1148.7522 c 0,0 1.298041,0 1.298041,0 0,0 0,0 0.0093,-0.019"
         style="fill:none;stroke:#000000;stroke-width:0.0377953;stroke-miterlimit:4;stroke-dasharray:none;stroke-opacity:1"
         id="path1192" />
      <path
         d="m -49.86138,1148.7329 c 0.267289,-0.5566 0.837506,-0.9162 1.452586,-0.9162 0,0 0.889059,0 1.612385,0.7234 0,0.889 0,0.889 0,1.7781 -0.723326,0.7234 -1.612385,0.7234 -1.612385,0.7234 -0.61508,0 -1.185297,-0.3597 -1.452586,-0.9162"
         style="fill:none;stroke:#000000;stroke-width:0.0377953;stroke-miterlimit:4;stroke-dasharray:none;stroke-opacity:1"
         id="path1194" />
      <path
         d="m -49.86138,1150.1254 c 0,0 -0.0093,-0.019 -0.0093,-0.019 0,0 0,0 -1.298041,0"
         style="fill:none;stroke:#000000;stroke-width:0.0377953;stroke-miterlimit:4;stroke-dasharray:none;stroke-opacity:1"
         id="path1196" />
      <path
         d="m -51.142677,1143.5992 c 0,0 -1.223547,0 -1.223547,0"
         style="fill:none;stroke:#000000;stroke-width:0.0377953;stroke-miterlimit:4;stroke-dasharray:none;stroke-opacity:1"
         id="path1198" />
      <path
         d="m -52.366224,1145.0741 c 0,0 1.223547,0 1.223547,0"
         style="fill:none;stroke:#000000;stroke-width:0.0377953;stroke-miterlimit:4;stroke-dasharray:none;stroke-opacity:1"
         id="path1200" />
      <path
         d="m 62.329814,1140.0212 c 0,0 -0.0033,3.6762 -0.0033,3.6762"
         style="fill:none;stroke:#000000;stroke-width:0.0377953;stroke-miterlimit:4;stroke-dasharray:none;stroke-opacity:1"
         id="path1202" />
      <path
         d="m 62.326488,1136.8577 c 0,0 0.0033,1.6885 0.0033,1.6885"
         style="fill:none;stroke:#000000;stroke-width:0.0377953;stroke-miterlimit:4;stroke-dasharray:none;stroke-opacity:1"
         id="path1204" />
      <path
         d="m 62.331175,1150.2226 c 0,0 -0.0047,1.6365 -0.0047,1.6365"
         style="fill:none;stroke:#000000;stroke-width:0.0377953;stroke-miterlimit:4;stroke-dasharray:none;stroke-opacity:1"
         id="path1206" />
      <path
         d="m 62.326488,1145.0531 c 0,0 0.0047,3.6945 0.0047,3.6945"
         style="fill:none;stroke:#000000;stroke-width:0.0377953;stroke-miterlimit:4;stroke-dasharray:none;stroke-opacity:1"
         id="path1208" />
      <path
         d="m 62.348069,1145.0571 c 0,0 -1.298041,0 -1.298041,0 0,0 0,0 -0.0093,0.019"
         style="fill:none;stroke:#000000;stroke-width:0.0377953;stroke-miterlimit:4;stroke-dasharray:none;stroke-opacity:1"
         id="path1210" />
      <path
         d="m 61.040769,1145.0764 c -0.267289,0.5566 -0.837506,0.9162 -1.452586,0.9162 0,0 -0.889059,0 -1.612385,-0.7234 0,-0.889 0,-0.889 0,-1.7781 0.723326,-0.7234 1.612385,-0.7234 1.612385,-0.7234 0.61508,0 1.185297,0.3597 1.452586,0.9162"
         style="fill:none;stroke:#000000;stroke-width:0.0377953;stroke-miterlimit:4;stroke-dasharray:none;stroke-opacity:1"
         id="path1212" />
      <path
         d="m 61.040769,1143.6839 c 0,0 0.0093,0.019 0.0093,0.019 0,0 0,0 1.298041,0"
         style="fill:none;stroke:#000000;stroke-width:0.0377953;stroke-miterlimit:4;stroke-dasharray:none;stroke-opacity:1"
         id="path1214" />
      <path
         d="m -52.368454,1143.5916 c -0.282444,-0.569 -0.870463,-0.9354 -1.50444,-0.9354 0,0 -0.926552,0 -1.680454,0.7539 0,0.9266 0,0.9266 0,1.8531 0.753902,0.7539 1.680454,0.7539 1.680454,0.7539 0.633977,0 1.221996,-0.3665 1.50444,-0.9354"
         style="fill:none;stroke:#000000;stroke-width:0.0377953;stroke-miterlimit:4;stroke-dasharray:none;stroke-opacity:1"
         id="path1216" />
      <path
         d="m 62.329814,1138.5462 c 0,0 1.223547,0 1.223547,0"
         style="fill:none;stroke:#000000;stroke-width:0.0377953;stroke-miterlimit:4;stroke-dasharray:none;stroke-opacity:1"
         id="path1218" />
      <path
         d="m 63.553361,1140.0212 c 0,0 -1.223547,0 -1.223547,0"
         style="fill:none;stroke:#000000;stroke-width:0.0377953;stroke-miterlimit:4;stroke-dasharray:none;stroke-opacity:1"
         id="path1220" />
      <path
         d="m 63.555591,1138.5387 c 0.282444,-0.569 0.870463,-0.9355 1.50444,-0.9355 0,0 0.926552,0 1.680454,0.7539 0,0.9266 0,0.9266 0,1.8532 -0.753902,0.7539 -1.680454,0.7539 -1.680454,0.7539 -0.633977,0 -1.221996,-0.3665 -1.50444,-0.9355"
         style="fill:none;stroke:#000000;stroke-width:0.0377953;stroke-miterlimit:4;stroke-dasharray:none;stroke-opacity:1"
         id="path1222" />
      <path
         d="m 62.326488,1136.8577 c 0,0 0.0033,1.6885 0.0033,1.6885"
         style="fill:none;stroke:#000000;stroke-width:0.0377953;stroke-miterlimit:4;stroke-dasharray:none;stroke-opacity:1"
         id="path1224" />
      <path
         d="m 62.331175,1148.7476 c 0,0 1.223546,0 1.223546,0"
         style="fill:none;stroke:#000000;stroke-width:0.0377953;stroke-miterlimit:4;stroke-dasharray:none;stroke-opacity:1"
         id="path1226" />
      <path
         d="m 63.554721,1150.2226 c 0,0 -1.223546,0 -1.223546,0"
         style="fill:none;stroke:#000000;stroke-width:0.0377953;stroke-miterlimit:4;stroke-dasharray:none;stroke-opacity:1"
         id="path1228" />
      <path
         d="m 63.556951,1148.7401 c 0.282444,-0.569 0.870463,-0.9355 1.504441,-0.9355 0,0 0.926551,0 1.680454,0.7539 0,0.9266 0,0.9266 0,1.8532 -0.753903,0.7539 -1.680454,0.7539 -1.680454,0.7539 -0.633978,0 -1.221997,-0.3665 -1.504441,-0.9355"
         style="fill:none;stroke:#000000;stroke-width:0.0377953;stroke-miterlimit:4;stroke-dasharray:none;stroke-opacity:1"
         id="path1230" />
      <path
         d="m -37.796636,1137.3733 c 0,0 -7.700901,13.3384 -7.700901,13.3384"
         style="fill:none;stroke:#000000;stroke-width:0.0377953;stroke-miterlimit:4;stroke-dasharray:none;stroke-opacity:1"
         id="path1232" />
      <path
         d="m -36.886639,1137.3733 c 0,0 -7.700901,13.3384 -7.700901,13.3384"
         style="fill:none;stroke:#000000;stroke-width:0.0377953;stroke-miterlimit:4;stroke-dasharray:none;stroke-opacity:1"
         id="path1234" />
      <path
         d="m -35.979553,1137.3733 c 0,0 -7.700901,13.3384 -7.700901,13.3384"
         style="fill:none;stroke:#000000;stroke-width:0.0377953;stroke-miterlimit:4;stroke-dasharray:none;stroke-opacity:1"
         id="path1236" />
      <path
         d="m -35.064907,1137.3733 c 0,0 -7.700901,13.3384 -7.700901,13.3384"
         style="fill:none;stroke:#000000;stroke-width:0.0377953;stroke-miterlimit:4;stroke-dasharray:none;stroke-opacity:1"
         id="path1238" />
      <path
         d="m -34.15782,1137.3733 c 0,0 -7.700901,13.3384 -7.700901,13.3384"
         style="fill:none;stroke:#000000;stroke-width:0.0377953;stroke-miterlimit:4;stroke-dasharray:none;stroke-opacity:1"
         id="path1240" />
      <path
         d="m -33.212939,1137.3733 c 0,0 -7.7009,13.3384 -7.7009,13.3384"
         style="fill:none;stroke:#000000;stroke-width:0.0377953;stroke-miterlimit:4;stroke-dasharray:none;stroke-opacity:1"
         id="path1242" />
      <path
         d="m -32.305852,1137.3733 c 0,0 -7.700901,13.3384 -7.700901,13.3384"
         style="fill:none;stroke:#000000;stroke-width:0.0377953;stroke-miterlimit:4;stroke-dasharray:none;stroke-opacity:1"
         id="path1244" />
      <path
         d="m -31.398765,1137.3733 c 0,0 -7.700901,13.3384 -7.700901,13.3384"
         style="fill:none;stroke:#000000;stroke-width:0.0377953;stroke-miterlimit:4;stroke-dasharray:none;stroke-opacity:1"
         id="path1246" />
      <path
         d="m -30.491679,1137.3733 c 0,0 -7.700901,13.3384 -7.700901,13.3384"
         style="fill:none;stroke:#000000;stroke-width:0.0377953;stroke-miterlimit:4;stroke-dasharray:none;stroke-opacity:1"
         id="path1248" />
      <path
         d="m -29.567584,1137.3733 c 0,0 -7.700901,13.3384 -7.700901,13.3384"
         style="fill:none;stroke:#000000;stroke-width:0.0377953;stroke-miterlimit:4;stroke-dasharray:none;stroke-opacity:1"
         id="path1250" />
      <path
         d="m -28.657587,1137.3733 c 0,0 -7.700901,13.3384 -7.700901,13.3384"
         style="fill:none;stroke:#000000;stroke-width:0.0377953;stroke-miterlimit:4;stroke-dasharray:none;stroke-opacity:1"
         id="path1252" />
      <path
         d="m -27.750501,1137.3733 c 0,0 -7.700901,13.3384 -7.700901,13.3384"
         style="fill:none;stroke:#000000;stroke-width:0.0377953;stroke-miterlimit:4;stroke-dasharray:none;stroke-opacity:1"
         id="path1254" />
      <path
         d="m -26.835855,1137.3733 c 0,0 -7.700901,13.3384 -7.700901,13.3384"
         style="fill:none;stroke:#000000;stroke-width:0.0377953;stroke-miterlimit:4;stroke-dasharray:none;stroke-opacity:1"
         id="path1256" />
      <path
         d="m -25.928769,1137.3733 c 0,0 -7.7009,13.3384 -7.7009,13.3384"
         style="fill:none;stroke:#000000;stroke-width:0.0377953;stroke-miterlimit:4;stroke-dasharray:none;stroke-opacity:1"
         id="path1258" />
      <path
         d="m -24.983887,1137.3733 c 0,0 -7.7009,13.3384 -7.7009,13.3384"
         style="fill:none;stroke:#000000;stroke-width:0.0377953;stroke-miterlimit:4;stroke-dasharray:none;stroke-opacity:1"
         id="path1260" />
      <path
         d="m -24.0768,1137.3733 c 0,0 -7.700901,13.3384 -7.700901,13.3384"
         style="fill:none;stroke:#000000;stroke-width:0.0377953;stroke-miterlimit:4;stroke-dasharray:none;stroke-opacity:1"
         id="path1262" />
      <path
         d="m -23.169713,1137.3733 c 0,0 -7.700901,13.3384 -7.700901,13.3384"
         style="fill:none;stroke:#000000;stroke-width:0.0377953;stroke-miterlimit:4;stroke-dasharray:none;stroke-opacity:1"
         id="path1264" />
      <path
         d="m -22.262627,1137.3733 c 0,0 -7.700901,13.3384 -7.700901,13.3384"
         style="fill:none;stroke:#000000;stroke-width:0.0377953;stroke-miterlimit:4;stroke-dasharray:none;stroke-opacity:1"
         id="path1266" />
      <path
         d="m -21.338494,1137.3733 c 0,0 -7.700901,13.3384 -7.700901,13.3384"
         style="fill:none;stroke:#000000;stroke-width:0.0377953;stroke-miterlimit:4;stroke-dasharray:none;stroke-opacity:1"
         id="path1268" />
      <path
         d="m -20.428498,1137.3733 c 0,0 -7.7009,13.3384 -7.7009,13.3384"
         style="fill:none;stroke:#000000;stroke-width:0.0377953;stroke-miterlimit:4;stroke-dasharray:none;stroke-opacity:1"
         id="path1270" />
      <path
         d="m -19.521411,1137.3733 c 0,0 -7.700901,13.3384 -7.700901,13.3384"
         style="fill:none;stroke:#000000;stroke-width:0.0377953;stroke-miterlimit:4;stroke-dasharray:none;stroke-opacity:1"
         id="path1272" />
      <path
         d="m -18.606765,1137.3733 c 0,0 -7.700901,13.3384 -7.700901,13.3384"
         style="fill:none;stroke:#000000;stroke-width:0.0377953;stroke-miterlimit:4;stroke-dasharray:none;stroke-opacity:1"
         id="path1274" />
      <path
         d="m -17.699679,1137.3733 c 0,0 -7.700901,13.3384 -7.700901,13.3384"
         style="fill:none;stroke:#000000;stroke-width:0.0377953;stroke-miterlimit:4;stroke-dasharray:none;stroke-opacity:1"
         id="path1276" />
      <path
         d="m -16.754797,1137.3733 c 0,0 -7.700901,13.3384 -7.700901,13.3384"
         style="fill:none;stroke:#000000;stroke-width:0.0377953;stroke-miterlimit:4;stroke-dasharray:none;stroke-opacity:1"
         id="path1278" />
      <path
         d="m -15.84771,1137.3733 c 0,0 -7.700901,13.3384 -7.700901,13.3384"
         style="fill:none;stroke:#000000;stroke-width:0.0377953;stroke-miterlimit:4;stroke-dasharray:none;stroke-opacity:1"
         id="path1280" />
      <path
         d="m -14.940624,1137.3733 c 0,0 -7.7009,13.3384 -7.7009,13.3384"
         style="fill:none;stroke:#000000;stroke-width:0.0377953;stroke-miterlimit:4;stroke-dasharray:none;stroke-opacity:1"
         id="path1282" />
      <path
         d="m -14.033537,1137.3733 c 0,0 -7.700901,13.3384 -7.700901,13.3384"
         style="fill:none;stroke:#000000;stroke-width:0.0377953;stroke-miterlimit:4;stroke-dasharray:none;stroke-opacity:1"
         id="path1284" />
      <path
         d="m -37.03782,1136.8501 c 0,0 -3.95452,6.8494 -3.95452,6.8494"
         style="fill:none;stroke:#000000;stroke-width:0.0377953;stroke-miterlimit:4;stroke-dasharray:none;stroke-opacity:1"
         id="path1286" />
      <path
         d="m -36.127824,1136.8501 c 0,0 -3.954519,6.8494 -3.954519,6.8494"
         style="fill:none;stroke:#000000;stroke-width:0.0377953;stroke-miterlimit:4;stroke-dasharray:none;stroke-opacity:1"
         id="path1288" />
      <path
         d="m -35.220737,1136.8501 c 0,0 -3.95452,6.8494 -3.95452,6.8494"
         style="fill:none;stroke:#000000;stroke-width:0.0377953;stroke-miterlimit:4;stroke-dasharray:none;stroke-opacity:1"
         id="path1290" />
      <path
         d="m -34.306091,1136.8501 c 0,0 -3.95452,6.8494 -3.95452,6.8494"
         style="fill:none;stroke:#000000;stroke-width:0.0377953;stroke-miterlimit:4;stroke-dasharray:none;stroke-opacity:1"
         id="path1292" />
      <path
         d="m -33.399005,1136.8501 c 0,0 -3.954519,6.8494 -3.954519,6.8494"
         style="fill:none;stroke:#000000;stroke-width:0.0377953;stroke-miterlimit:4;stroke-dasharray:none;stroke-opacity:1"
         id="path1294" />
      <path
         d="m -32.454123,1136.8501 c 0,0 -3.95452,6.8494 -3.95452,6.8494"
         style="fill:none;stroke:#000000;stroke-width:0.0377953;stroke-miterlimit:4;stroke-dasharray:none;stroke-opacity:1"
         id="path1296" />
      <path
         d="m -31.547036,1136.8501 c 0,0 -3.95452,6.8494 -3.95452,6.8494"
         style="fill:none;stroke:#000000;stroke-width:0.0377953;stroke-miterlimit:4;stroke-dasharray:none;stroke-opacity:1"
         id="path1298" />
      <path
         d="m -30.63995,1136.8501 c 0,0 -3.954519,6.8494 -3.954519,6.8494"
         style="fill:none;stroke:#000000;stroke-width:0.0377953;stroke-miterlimit:4;stroke-dasharray:none;stroke-opacity:1"
         id="path1300" />
      <path
         d="m -29.732863,1136.8501 c 0,0 -3.95452,6.8494 -3.95452,6.8494"
         style="fill:none;stroke:#000000;stroke-width:0.0377953;stroke-miterlimit:4;stroke-dasharray:none;stroke-opacity:1"
         id="path1302" />
      <path
         d="m -28.808769,1136.8501 c 0,0 -3.954519,6.8494 -3.954519,6.8494"
         style="fill:none;stroke:#000000;stroke-width:0.0377953;stroke-miterlimit:4;stroke-dasharray:none;stroke-opacity:1"
         id="path1304" />
      <path
         d="m -27.898772,1136.8501 c 0,0 -3.954519,6.8494 -3.954519,6.8494"
         style="fill:none;stroke:#000000;stroke-width:0.0377953;stroke-miterlimit:4;stroke-dasharray:none;stroke-opacity:1"
         id="path1306" />
      <path
         d="m -26.991685,1136.8501 c 0,0 -3.95452,6.8494 -3.95452,6.8494"
         style="fill:none;stroke:#000000;stroke-width:0.0377953;stroke-miterlimit:4;stroke-dasharray:none;stroke-opacity:1"
         id="path1308" />
      <path
         d="m -26.077039,1136.8501 c 0,0 -3.95452,6.8494 -3.95452,6.8494"
         style="fill:none;stroke:#000000;stroke-width:0.0377953;stroke-miterlimit:4;stroke-dasharray:none;stroke-opacity:1"
         id="path1310" />
      <path
         d="m -25.169953,1136.8501 c 0,0 -3.954519,6.8494 -3.954519,6.8494"
         style="fill:none;stroke:#000000;stroke-width:0.0377953;stroke-miterlimit:4;stroke-dasharray:none;stroke-opacity:1"
         id="path1312" />
      <path
         d="m -24.225071,1136.8501 c 0,0 -3.95452,6.8494 -3.95452,6.8494"
         style="fill:none;stroke:#000000;stroke-width:0.0377953;stroke-miterlimit:4;stroke-dasharray:none;stroke-opacity:1"
         id="path1314" />
      <path
         d="m -23.317984,1136.8501 c 0,0 -3.95452,6.8494 -3.95452,6.8494"
         style="fill:none;stroke:#000000;stroke-width:0.0377953;stroke-miterlimit:4;stroke-dasharray:none;stroke-opacity:1"
         id="path1316" />
      <path
         d="m -22.410898,1136.8501 c 0,0 -3.954519,6.8494 -3.954519,6.8494"
         style="fill:none;stroke:#000000;stroke-width:0.0377953;stroke-miterlimit:4;stroke-dasharray:none;stroke-opacity:1"
         id="path1318" />
      <path
         d="m -21.503811,1136.8501 c 0,0 -3.95452,6.8494 -3.95452,6.8494"
         style="fill:none;stroke:#000000;stroke-width:0.0377953;stroke-miterlimit:4;stroke-dasharray:none;stroke-opacity:1"
         id="path1320" />
      <path
         d="m -20.579679,1136.8501 c 0,0 -3.954519,6.8494 -3.954519,6.8494"
         style="fill:none;stroke:#000000;stroke-width:0.0377953;stroke-miterlimit:4;stroke-dasharray:none;stroke-opacity:1"
         id="path1322" />
      <path
         d="m -19.669682,1136.8501 c 0,0 -3.95452,6.8494 -3.95452,6.8494"
         style="fill:none;stroke:#000000;stroke-width:0.0377953;stroke-miterlimit:4;stroke-dasharray:none;stroke-opacity:1"
         id="path1324" />
      <path
         d="m -18.762595,1136.8501 c 0,0 -3.95452,6.8494 -3.95452,6.8494"
         style="fill:none;stroke:#000000;stroke-width:0.0377953;stroke-miterlimit:4;stroke-dasharray:none;stroke-opacity:1"
         id="path1326" />
      <path
         d="m -17.84795,1136.8501 c 0,0 -3.954519,6.8494 -3.954519,6.8494"
         style="fill:none;stroke:#000000;stroke-width:0.0377953;stroke-miterlimit:4;stroke-dasharray:none;stroke-opacity:1"
         id="path1328" />
      <path
         d="m -16.940863,1136.8501 c 0,0 -3.95452,6.8494 -3.95452,6.8494"
         style="fill:none;stroke:#000000;stroke-width:0.0377953;stroke-miterlimit:4;stroke-dasharray:none;stroke-opacity:1"
         id="path1330" />
      <path
         d="m -15.995981,1136.8501 c 0,0 -3.95452,6.8494 -3.95452,6.8494"
         style="fill:none;stroke:#000000;stroke-width:0.0377953;stroke-miterlimit:4;stroke-dasharray:none;stroke-opacity:1"
         id="path1332" />
      <path
         d="m -15.088894,1136.8501 c 0,0 -3.95452,6.8494 -3.95452,6.8494"
         style="fill:none;stroke:#000000;stroke-width:0.0377953;stroke-miterlimit:4;stroke-dasharray:none;stroke-opacity:1"
         id="path1334" />
      <path
         d="m -14.181808,1136.8501 c 0,0 -3.95452,6.8494 -3.95452,6.8494"
         style="fill:none;stroke:#000000;stroke-width:0.0377953;stroke-miterlimit:4;stroke-dasharray:none;stroke-opacity:1"
         id="path1336" />
      <path
         d="m -13.274721,1136.8501 c 0,0 -3.95452,6.8494 -3.95452,6.8494"
         style="fill:none;stroke:#000000;stroke-width:0.0377953;stroke-miterlimit:4;stroke-dasharray:none;stroke-opacity:1"
         id="path1338" />
      <path
         d="m -41.700548,1144.9262 c 0,0 -3.954595,6.8495 -3.954595,6.8495"
         style="fill:none;stroke:#000000;stroke-width:0.0377953;stroke-miterlimit:4;stroke-dasharray:none;stroke-opacity:1"
         id="path1340" />
      <path
         d="m -40.790551,1144.9262 c 0,0 -3.954595,6.8495 -3.954595,6.8495"
         style="fill:none;stroke:#000000;stroke-width:0.0377953;stroke-miterlimit:4;stroke-dasharray:none;stroke-opacity:1"
         id="path1342" />
      <path
         d="m -39.883465,1144.9262 c 0,0 -3.954595,6.8495 -3.954595,6.8495"
         style="fill:none;stroke:#000000;stroke-width:0.0377953;stroke-miterlimit:4;stroke-dasharray:none;stroke-opacity:1"
         id="path1344" />
      <path
         d="m -38.968819,1144.9262 c 0,0 -3.954595,6.8495 -3.954595,6.8495"
         style="fill:none;stroke:#000000;stroke-width:0.0377953;stroke-miterlimit:4;stroke-dasharray:none;stroke-opacity:1"
         id="path1346" />
      <path
         d="m -38.061732,1144.9262 c 0,0 -3.954596,6.8495 -3.954596,6.8495"
         style="fill:none;stroke:#000000;stroke-width:0.0377953;stroke-miterlimit:4;stroke-dasharray:none;stroke-opacity:1"
         id="path1348" />
      <path
         d="m -37.11685,1144.9262 c 0,0 -3.954596,6.8495 -3.954596,6.8495"
         style="fill:none;stroke:#000000;stroke-width:0.0377953;stroke-miterlimit:4;stroke-dasharray:none;stroke-opacity:1"
         id="path1350" />
      <path
         d="m -36.209764,1144.9262 c 0,0 -3.954595,6.8495 -3.954595,6.8495"
         style="fill:none;stroke:#000000;stroke-width:0.0377953;stroke-miterlimit:4;stroke-dasharray:none;stroke-opacity:1"
         id="path1352" />
      <path
         d="m -35.302677,1144.9262 c 0,0 -3.954595,6.8495 -3.954595,6.8495"
         style="fill:none;stroke:#000000;stroke-width:0.0377953;stroke-miterlimit:4;stroke-dasharray:none;stroke-opacity:1"
         id="path1354" />
      <path
         d="m -34.395591,1144.9262 c 0,0 -3.954595,6.8495 -3.954595,6.8495"
         style="fill:none;stroke:#000000;stroke-width:0.0377953;stroke-miterlimit:4;stroke-dasharray:none;stroke-opacity:1"
         id="path1356" />
      <path
         d="m -33.471496,1144.9262 c 0,0 -3.954595,6.8495 -3.954595,6.8495"
         style="fill:none;stroke:#000000;stroke-width:0.0377953;stroke-miterlimit:4;stroke-dasharray:none;stroke-opacity:1"
         id="path1358" />
      <path
         d="m -32.561499,1144.9262 c 0,0 -3.954595,6.8495 -3.954595,6.8495"
         style="fill:none;stroke:#000000;stroke-width:0.0377953;stroke-miterlimit:4;stroke-dasharray:none;stroke-opacity:1"
         id="path1360" />
      <path
         d="m -31.654413,1144.9262 c 0,0 -3.954595,6.8495 -3.954595,6.8495"
         style="fill:none;stroke:#000000;stroke-width:0.0377953;stroke-miterlimit:4;stroke-dasharray:none;stroke-opacity:1"
         id="path1362" />
      <path
         d="m -30.739767,1144.9262 c 0,0 -3.954595,6.8495 -3.954595,6.8495"
         style="fill:none;stroke:#000000;stroke-width:0.0377953;stroke-miterlimit:4;stroke-dasharray:none;stroke-opacity:1"
         id="path1364" />
      <path
         d="m -29.83268,1144.9262 c 0,0 -3.954596,6.8495 -3.954596,6.8495"
         style="fill:none;stroke:#000000;stroke-width:0.0377953;stroke-miterlimit:4;stroke-dasharray:none;stroke-opacity:1"
         id="path1366" />
      <path
         d="m -28.887798,1144.9262 c 0,0 -3.954596,6.8495 -3.954596,6.8495"
         style="fill:none;stroke:#000000;stroke-width:0.0377953;stroke-miterlimit:4;stroke-dasharray:none;stroke-opacity:1"
         id="path1368" />
      <path
         d="m -27.980712,1144.9262 c 0,0 -3.954595,6.8495 -3.954595,6.8495"
         style="fill:none;stroke:#000000;stroke-width:0.0377953;stroke-miterlimit:4;stroke-dasharray:none;stroke-opacity:1"
         id="path1370" />
      <path
         d="m -27.073625,1144.9262 c 0,0 -3.954595,6.8495 -3.954595,6.8495"
         style="fill:none;stroke:#000000;stroke-width:0.0377953;stroke-miterlimit:4;stroke-dasharray:none;stroke-opacity:1"
         id="path1372" />
      <path
         d="m -26.166539,1144.9262 c 0,0 -3.954595,6.8495 -3.954595,6.8495"
         style="fill:none;stroke:#000000;stroke-width:0.0377953;stroke-miterlimit:4;stroke-dasharray:none;stroke-opacity:1"
         id="path1374" />
      <path
         d="m -25.242406,1144.9262 c 0,0 -3.954596,6.8495 -3.954596,6.8495"
         style="fill:none;stroke:#000000;stroke-width:0.0377953;stroke-miterlimit:4;stroke-dasharray:none;stroke-opacity:1"
         id="path1376" />
      <path
         d="m -24.332409,1144.9262 c 0,0 -3.954596,6.8495 -3.954596,6.8495"
         style="fill:none;stroke:#000000;stroke-width:0.0377953;stroke-miterlimit:4;stroke-dasharray:none;stroke-opacity:1"
         id="path1378" />
      <path
         d="m -23.425323,1144.9262 c 0,0 -3.954595,6.8495 -3.954595,6.8495"
         style="fill:none;stroke:#000000;stroke-width:0.0377953;stroke-miterlimit:4;stroke-dasharray:none;stroke-opacity:1"
         id="path1380" />
      <path
         d="m -22.510677,1144.9262 c 0,0 -3.954595,6.8495 -3.954595,6.8495"
         style="fill:none;stroke:#000000;stroke-width:0.0377953;stroke-miterlimit:4;stroke-dasharray:none;stroke-opacity:1"
         id="path1382" />
      <path
         d="m -21.603591,1144.9262 c 0,0 -3.954595,6.8495 -3.954595,6.8495"
         style="fill:none;stroke:#000000;stroke-width:0.0377953;stroke-miterlimit:4;stroke-dasharray:none;stroke-opacity:1"
         id="path1384" />
      <path
         d="m -20.658709,1144.9262 c 0,0 -3.954595,6.8495 -3.954595,6.8495"
         style="fill:none;stroke:#000000;stroke-width:0.0377953;stroke-miterlimit:4;stroke-dasharray:none;stroke-opacity:1"
         id="path1386" />
      <path
         d="m -19.751622,1144.9262 c 0,0 -3.954595,6.8495 -3.954595,6.8495"
         style="fill:none;stroke:#000000;stroke-width:0.0377953;stroke-miterlimit:4;stroke-dasharray:none;stroke-opacity:1"
         id="path1388" />
      <path
         d="m -18.844535,1144.9262 c 0,0 -3.954596,6.8495 -3.954596,6.8495"
         style="fill:none;stroke:#000000;stroke-width:0.0377953;stroke-miterlimit:4;stroke-dasharray:none;stroke-opacity:1"
         id="path1390" />
      <path
         d="m -17.937449,1144.9262 c 0,0 -3.954595,6.8495 -3.954595,6.8495"
         style="fill:none;stroke:#000000;stroke-width:0.0377953;stroke-miterlimit:4;stroke-dasharray:none;stroke-opacity:1"
         id="path1392" />
    </g>
  </g>
  <desc
     id="desc1396">moebius1h.dxf - scale = 1.000000, origin = (0.000000, 0.000000), method = manual</desc>
</svg>
