%!PS-Adobe-3.0
%%Creator: PCBNEW
%%CreationDate: Mon Jun  3 21:16:16 2019
%%Title: /home/allard/Documents/gitRepos/kicad_board/Gerbers/rockClimbingHoldBoard-NPTH-drl_map.ps
%%Pages: 1
%%PageOrder: Ascend
%%BoundingBox: 0 0 596 842
%%DocumentMedia: A4 595 842 0 () ()
%%Orientation: Landscape
%%EndComments
%%BeginProlog
/line { newpath moveto lineto stroke } bind def
/cir0 { newpath 0 360 arc stroke } bind def
/cir1 { newpath 0 360 arc gsave fill grestore stroke } bind def
/cir2 { newpath 0 360 arc gsave fill grestore stroke } bind def
/arc0 { newpath arc stroke } bind def
/arc1 { newpath 4 index 4 index moveto arc closepath gsave fill
    grestore stroke } bind def
/arc2 { newpath 4 index 4 index moveto arc closepath gsave fill
    grestore stroke } bind def
/poly0 { stroke } bind def
/poly1 { closepath gsave fill grestore stroke } bind def
/poly2 { closepath gsave fill grestore stroke } bind def
/rect0 { rectstroke } bind def
/rect1 { rectfill } bind def
/rect2 { rectfill } bind def
/linemode0 { 0 setlinecap 0 setlinejoin 0 setlinewidth } bind def
/linemode1 { 1 setlinecap 1 setlinejoin } bind def
/dashedline { [200] 100 setdash } bind def
/solidline { [] 0 setdash } bind def
/phantomshow { moveto
    /KicadFont findfont 0.000001 scalefont setfont
    show } bind def
/textshow { gsave
    findfont exch scalefont setfont concat 1 scale 0 0 moveto show
    } bind def
/reencodefont {
  findfont dup length dict begin
  { 1 index /FID ne
    { def }
    { pop pop } ifelse
  } forall
  /Encoding ISOLatin1Encoding def
  currentdict
  end } bind def
/KicadFont /Helvetica reencodefont definefont pop
/KicadFont-Bold /Helvetica-Bold reencodefont definefont pop
/KicadFont-Oblique /Helvetica-Oblique reencodefont definefont pop
/KicadFont-BoldOblique /Helvetica-BoldOblique reencodefont definefont pop
%%EndProlog
%%Page: 1 1
%%BeginPageSetup
gsave
0.0072 0.0072 scale
linemode1
82680 0 translate 90 rotate
50.2105 setlinewidth
%%EndPageSetup
0 0 0 setrgbcolor
59.3037 setlinewidth
newpath
67051 60135.5 moveto
67051 64152.3 lineto
stroke
0 0 0 setrgbcolor
newpath
67753.9 60135.5 moveto
67051 60135.5 lineto
stroke
0 0 0 setrgbcolor
newpath
68959 58930.4 moveto
67753.9 60135.5 lineto
stroke
0 0 0 setrgbcolor
newpath
68959 50294.2 moveto
68959 58930.4 lineto
stroke
0 0 0 setrgbcolor
newpath
68356.5 49792.1 moveto
68959 50294.2 lineto
stroke
0 0 0 setrgbcolor
newpath
68055.2 49792.1 moveto
68356.5 49792.1 lineto
stroke
0 0 0 setrgbcolor
newpath
68055.2 49390.4 moveto
68055.2 49792.1 lineto
stroke
0 0 0 setrgbcolor
newpath
66950.6 49390.4 moveto
68055.2 49390.4 lineto
stroke
0 0 0 setrgbcolor
newpath
67051 64152.3 moveto
67653.5 65959.9 lineto
stroke
0 0 0 setrgbcolor
79.0716 setlinewidth
newpath
66950.6 46177 moveto
66950.6 49390.4 lineto
stroke
0 0 0 setrgbcolor
newpath
65845.9 42863.1 moveto
66950.6 46177 lineto
stroke
0 0 0 setrgbcolor
59.3037 setlinewidth
newpath
61929.5 59834.2 moveto
61929.5 58729.6 lineto
stroke
0 0 0 setrgbcolor
newpath
59318.6 62646 moveto
61929.5 59834.2 lineto
stroke
0 0 0 setrgbcolor
newpath
52992.1 78713.3 moveto
48272.3 74094 lineto
stroke
0 0 0 setrgbcolor
newpath
47971 49993 moveto
47971 39549.2 lineto
stroke
0 0 0 setrgbcolor
newpath
61929.5 58729.6 moveto
61929.5 49993 lineto
stroke
0 0 0 setrgbcolor
newpath
48372.7 62746.4 moveto
59318.6 62646 lineto
stroke
0 0 0 setrgbcolor
newpath
48272.3 74094 moveto
48372.7 62746.4 lineto
stroke
0 0 0 setrgbcolor
newpath
55100.9 78713.3 moveto
52992.1 78713.3 lineto
stroke
0 0 0 setrgbcolor
newpath
47971 49993 moveto
61929.5 49993 lineto
stroke
0 0 0 setrgbcolor
newpath
48975.2 37842 moveto
47971 39649.6 lineto
stroke
0 0 0 setrgbcolor
newpath
50983.6 37038.7 moveto
48975.2 37842 lineto
stroke
0 0 0 setrgbcolor
newpath
61427.4 37038.7 moveto
50983.6 37038.7 lineto
stroke
0 0 0 setrgbcolor
newpath
65845.9 42863.1 moveto
61427.4 37038.7 lineto
stroke
0 0 0 setrgbcolor
newpath
55100.9 78713.3 moveto
67653.5 65959.9 lineto
stroke
78.7399 setlinewidth
118.11 setlinewidth
0 0 0 setrgbcolor
0 0 0 setrgbcolor
newpath
49069 35175.5 moveto
49069 36356.6 lineto
49350.2 36356.6 lineto
49519 36300.3 lineto
49631.5 36187.9 lineto
49687.7 36075.4 lineto
49743.9 35850.4 lineto
49743.9 35681.7 lineto
49687.7 35456.7 lineto
49631.5 35344.2 lineto
49519 35231.7 lineto
49350.2 35175.5 lineto
49069 35175.5 lineto
stroke
newpath
50250.1 35175.5 moveto
50250.1 35962.9 lineto
stroke
newpath
50250.1 35737.9 moveto
50306.4 35850.4 lineto
50362.6 35906.6 lineto
50475.1 35962.9 lineto
50587.6 35962.9 lineto
stroke
newpath
50981.3 35175.5 moveto
50981.3 35962.9 lineto
stroke
newpath
50981.3 36356.6 moveto
50925.1 36300.3 lineto
50981.3 36244.1 lineto
51037.5 36300.3 lineto
50981.3 36356.6 lineto
50981.3 36244.1 lineto
stroke
newpath
51712.5 35175.5 moveto
51600 35231.7 lineto
51543.7 35344.2 lineto
51543.7 36356.6 lineto
stroke
newpath
52331.1 35175.5 moveto
52218.6 35231.7 lineto
52162.4 35344.2 lineto
52162.4 36356.6 lineto
stroke
newpath
53681 35175.5 moveto
53681 36356.6 lineto
54074.7 35512.9 lineto
54468.4 36356.6 lineto
54468.4 35175.5 lineto
stroke
newpath
55537 35175.5 moveto
55537 35794.2 lineto
55480.7 35906.6 lineto
55368.2 35962.9 lineto
55143.3 35962.9 lineto
55030.8 35906.6 lineto
stroke
newpath
55537 35231.7 moveto
55424.5 35175.5 lineto
55143.3 35175.5 lineto
55030.8 35231.7 lineto
54974.5 35344.2 lineto
54974.5 35456.7 lineto
55030.8 35569.2 lineto
55143.3 35625.4 lineto
55424.5 35625.4 lineto
55537 35681.7 lineto
stroke
newpath
56099.4 35962.9 moveto
56099.4 34781.8 lineto
stroke
newpath
56099.4 35906.6 moveto
56211.9 35962.9 lineto
56436.9 35962.9 lineto
56549.3 35906.6 lineto
56605.6 35850.4 lineto
56661.8 35737.9 lineto
56661.8 35400.5 lineto
56605.6 35288 lineto
56549.3 35231.7 lineto
56436.9 35175.5 lineto
56211.9 35175.5 lineto
56099.4 35231.7 lineto
stroke
newpath
57168 35288 moveto
57224.3 35231.7 lineto
57168 35175.5 lineto
57111.8 35231.7 lineto
57168 35288 lineto
57168 35175.5 lineto
stroke
newpath
57168 35906.6 moveto
57224.3 35850.4 lineto
57168 35794.2 lineto
57111.8 35850.4 lineto
57168 35906.6 lineto
57168 35794.2 lineto
stroke
showpage
grestore
%%EOF
