%!PS-Adobe-3.0
%%Creator: PCBNEW
%%CreationDate: Mon Jun  3 21:16:16 2019
%%Title: /home/allard/Documents/gitRepos/kicad_board/Gerbers/rockClimbingHoldBoard-PTH-drl_map.ps
%%Pages: 1
%%PageOrder: Ascend
%%BoundingBox: 0 0 596 842
%%DocumentMedia: A4 595 842 0 () ()
%%Orientation: Landscape
%%EndComments
%%BeginProlog
/line { newpath moveto lineto stroke } bind def
/cir0 { newpath 0 360 arc stroke } bind def
/cir1 { newpath 0 360 arc gsave fill grestore stroke } bind def
/cir2 { newpath 0 360 arc gsave fill grestore stroke } bind def
/arc0 { newpath arc stroke } bind def
/arc1 { newpath 4 index 4 index moveto arc closepath gsave fill
    grestore stroke } bind def
/arc2 { newpath 4 index 4 index moveto arc closepath gsave fill
    grestore stroke } bind def
/poly0 { stroke } bind def
/poly1 { closepath gsave fill grestore stroke } bind def
/poly2 { closepath gsave fill grestore stroke } bind def
/rect0 { rectstroke } bind def
/rect1 { rectfill } bind def
/rect2 { rectfill } bind def
/linemode0 { 0 setlinecap 0 setlinejoin 0 setlinewidth } bind def
/linemode1 { 1 setlinecap 1 setlinejoin } bind def
/dashedline { [200] 100 setdash } bind def
/solidline { [] 0 setdash } bind def
/phantomshow { moveto
    /KicadFont findfont 0.000001 scalefont setfont
    show } bind def
/textshow { gsave
    findfont exch scalefont setfont concat 1 scale 0 0 moveto show
    } bind def
/reencodefont {
  findfont dup length dict begin
  { 1 index /FID ne
    { def }
    { pop pop } ifelse
  } forall
  /Encoding ISOLatin1Encoding def
  currentdict
  end } bind def
/KicadFont /Helvetica reencodefont definefont pop
/KicadFont-Bold /Helvetica-Bold reencodefont definefont pop
/KicadFont-Oblique /Helvetica-Oblique reencodefont definefont pop
/KicadFont-BoldOblique /Helvetica-BoldOblique reencodefont definefont pop
%%EndProlog
%%Page: 1 1
%%BeginPageSetup
gsave
0.0072 0.0072 scale
linemode1
82680 0 translate 90 rotate
50.2105 setlinewidth
%%EndPageSetup
0 0 0 setrgbcolor
59.3037 setlinewidth
newpath
67051 60135.5 moveto
67051 64152.3 lineto
stroke
0 0 0 setrgbcolor
newpath
67753.9 60135.5 moveto
67051 60135.5 lineto
stroke
0 0 0 setrgbcolor
newpath
68959 58930.4 moveto
67753.9 60135.5 lineto
stroke
0 0 0 setrgbcolor
newpath
68959 50294.2 moveto
68959 58930.4 lineto
stroke
0 0 0 setrgbcolor
newpath
68356.5 49792.1 moveto
68959 50294.2 lineto
stroke
0 0 0 setrgbcolor
newpath
68055.2 49792.1 moveto
68356.5 49792.1 lineto
stroke
0 0 0 setrgbcolor
newpath
68055.2 49390.4 moveto
68055.2 49792.1 lineto
stroke
0 0 0 setrgbcolor
newpath
66950.6 49390.4 moveto
68055.2 49390.4 lineto
stroke
0 0 0 setrgbcolor
newpath
67051 64152.3 moveto
67653.5 65959.9 lineto
stroke
0 0 0 setrgbcolor
79.0716 setlinewidth
newpath
66950.6 46177 moveto
66950.6 49390.4 lineto
stroke
0 0 0 setrgbcolor
newpath
65845.9 42863.1 moveto
66950.6 46177 lineto
stroke
0 0 0 setrgbcolor
59.3037 setlinewidth
newpath
61929.5 59834.2 moveto
61929.5 58729.6 lineto
stroke
0 0 0 setrgbcolor
newpath
59318.6 62646 moveto
61929.5 59834.2 lineto
stroke
0 0 0 setrgbcolor
newpath
52992.1 78713.3 moveto
48272.3 74094 lineto
stroke
0 0 0 setrgbcolor
newpath
47971 49993 moveto
47971 39549.2 lineto
stroke
0 0 0 setrgbcolor
newpath
61929.5 58729.6 moveto
61929.5 49993 lineto
stroke
0 0 0 setrgbcolor
newpath
48372.7 62746.4 moveto
59318.6 62646 lineto
stroke
0 0 0 setrgbcolor
newpath
48272.3 74094 moveto
48372.7 62746.4 lineto
stroke
0 0 0 setrgbcolor
newpath
55100.9 78713.3 moveto
52992.1 78713.3 lineto
stroke
0 0 0 setrgbcolor
newpath
47971 49993 moveto
61929.5 49993 lineto
stroke
0 0 0 setrgbcolor
newpath
48975.2 37842 moveto
47971 39649.6 lineto
stroke
0 0 0 setrgbcolor
newpath
50983.6 37038.7 moveto
48975.2 37842 lineto
stroke
0 0 0 setrgbcolor
newpath
61427.4 37038.7 moveto
50983.6 37038.7 lineto
stroke
0 0 0 setrgbcolor
newpath
65845.9 42863.1 moveto
61427.4 37038.7 lineto
stroke
0 0 0 setrgbcolor
newpath
55100.9 78713.3 moveto
67653.5 65959.9 lineto
stroke
78.7399 setlinewidth
newpath
64658.3 55286 moveto
64776.9 55167.4 lineto
stroke
newpath
64776.9 55286 moveto
64658.3 55167.4 lineto
stroke
newpath
64658.3 54772 moveto
64776.9 54653.4 lineto
stroke
newpath
64776.9 54772 moveto
64658.3 54653.4 lineto
stroke
newpath
64658.3 54258.1 moveto
64776.9 54139.5 lineto
stroke
newpath
64776.9 54258.1 moveto
64658.3 54139.5 lineto
stroke
newpath
65172.2 55286 moveto
65290.9 55167.4 lineto
stroke
newpath
65290.9 55286 moveto
65172.2 55167.4 lineto
stroke
newpath
65172.2 54772 moveto
65290.9 54653.4 lineto
stroke
newpath
65290.9 54772 moveto
65172.2 54653.4 lineto
stroke
newpath
65172.2 54258.1 moveto
65290.9 54139.5 lineto
stroke
newpath
65290.9 54258.1 moveto
65172.2 54139.5 lineto
stroke
newpath
65686.2 55286 moveto
65804.8 55167.4 lineto
stroke
newpath
65804.8 55286 moveto
65686.2 55167.4 lineto
stroke
newpath
65686.2 54772 moveto
65804.8 54653.4 lineto
stroke
newpath
65804.8 54772 moveto
65686.2 54653.4 lineto
stroke
newpath
65686.2 54258.1 moveto
65804.8 54139.5 lineto
stroke
newpath
65804.8 54258.1 moveto
65686.2 54139.5 lineto
stroke
newpath
66200.2 55286 moveto
66318.8 55167.4 lineto
stroke
newpath
66318.8 55286 moveto
66200.2 55167.4 lineto
stroke
newpath
66200.2 54772 moveto
66318.8 54653.4 lineto
stroke
newpath
66318.8 54772 moveto
66200.2 54653.4 lineto
stroke
newpath
66200.2 54258.1 moveto
66318.8 54139.5 lineto
stroke
newpath
66318.8 54258.1 moveto
66200.2 54139.5 lineto
stroke
newpath
66714.1 55286 moveto
66832.8 55167.4 lineto
stroke
newpath
66832.8 55286 moveto
66714.1 55167.4 lineto
stroke
newpath
66714.1 54772 moveto
66832.8 54653.4 lineto
stroke
newpath
66832.8 54772 moveto
66714.1 54653.4 lineto
stroke
newpath
66714.1 54258.1 moveto
66832.8 54139.5 lineto
stroke
newpath
66832.8 54258.1 moveto
66714.1 54139.5 lineto
stroke
49176.1 44670.6 79.0716 cir0
49376.9 70077.1 79.0716 cir0
49376.9 38846.2 79.0716 cir0
49678.2 66060.3 79.0716 cir0
49979.4 71483 79.0716 cir0
50079.9 46879.9 79.0716 cir0
50481.5 68068.7 79.0716 cir0
50582 64252.7 79.0716 cir0
51485.7 38344.1 79.0716 cir0
51787 75700.7 79.0716 cir0
51787 40352.6 79.0716 cir0
52088.3 43766.9 79.0716 cir0
52188.7 39147.5 79.0716 cir0
52289.1 40955.1 79.0716 cir0
52389.5 48386.2 79.0716 cir0
52490 46277.4 79.0716 cir0
52590.4 68570.8 79.0716 cir0
52590.4 49290 79.0716 cir0
53092.5 40653.8 79.0716 cir0
53293.3 47482.4 79.0716 cir0
53293.3 43766.9 79.0716 cir0
53393.7 44771.1 79.0716 cir0
54126.2 42377.3 79.0716 cir0
54598.8 42059.7 79.0716 cir0
54699.2 63650.2 79.0716 cir0
54699.2 38545 79.0716 cir0
55100.9 63348.9 79.0716 cir0
55100.9 42561.8 79.0716 cir0
55287.5 39239.2 79.0716 cir0
55502.6 41356.8 79.0716 cir0
55703.4 73391 79.0716 cir0
56205.5 48085 79.0716 cir0
56205.5 45976.1 79.0716 cir0
56808.1 46879.9 79.0716 cir0
56908.5 45875.7 79.0716 cir0
56988.5 40131.4 79.0716 cir0
57008.9 44570.2 79.0716 cir0
57209.7 64152.3 79.0716 cir0
57209.7 44068.1 79.0716 cir0
57410.6 68671.2 79.0716 cir0
58013.1 63650.2 79.0716 cir0
58916.9 40955.1 79.0716 cir0
59478.3 70393.4 79.0716 cir0
60246.6 38420.3 79.0716 cir0
60322.8 40453 79.0716 cir0
60523.6 49290 79.0716 cir0
60717.3 38050.1 79.0716 cir0
60824.9 43365.2 79.0716 cir0
60824.9 42160.1 79.0716 cir0
61327 48285.8 79.0716 cir0
61427.4 65558.2 79.0716 cir0
61613.2 68337.6 79.0716 cir0
62245.8 40741.6 79.0716 cir0
62404 66044.5 79.0716 cir0
62632.5 64353.1 79.0716 cir0
62732.9 40453 79.0716 cir0
62833.3 56319.5 79.0716 cir0
62933.7 53005.6 79.0716 cir0
63134.6 45976.1 79.0716 cir0
63235 54813.2 79.0716 cir0
63235 47181.2 79.0716 cir0
63435.8 49290 79.0716 cir0
63636.7 61842.6 79.0716 cir0
64138.8 55616.5 79.0716 cir0
64138.8 52804.7 79.0716 cir0
65645.1 60637.6 79.0716 cir0
65745.5 44269 79.0716 cir0
67452.7 54813.2 79.0716 cir0
67452.7 52704.3 79.0716 cir0
67653.5 57122.8 79.0716 cir0
67753.9 52001.4 79.0716 cir0
newpath
64741.3 48585.5 moveto
64741.3 48387.8 lineto
stroke
newpath
64642.5 48486.6 moveto
64840.1 48486.6 lineto
stroke
newpath
64741.3 48091.3 moveto
64741.3 47893.6 lineto
stroke
newpath
64642.5 47992.4 moveto
64840.1 47992.4 lineto
stroke
newpath
64485.6 45143.8 moveto
64485.6 45353.5 lineto
64275.9 45353.5 lineto
64275.9 45143.8 lineto
64485.6 45143.8 lineto
poly0
newpath
64485.6 44353.1 moveto
64485.6 44562.8 lineto
64275.9 44562.8 lineto
64275.9 44353.1 lineto
64485.6 44353.1 lineto
poly0
newpath
54101.7 39694.8 moveto
54252.3 39845.4 lineto
54101.7 39996.1 lineto
53951.1 39845.4 lineto
54101.7 39694.8 lineto
poly0
newpath
63760 61317.6 moveto
64115.9 60961.8 lineto
stroke
newpath
64115.9 61317.6 moveto
63760 60961.8 lineto
stroke
63937.9 61139.7 177.911 cir0
newpath
64470.1 62027.7 moveto
64825.9 61671.9 lineto
stroke
newpath
64825.9 62027.7 moveto
64470.1 61671.9 lineto
stroke
64648 61849.8 177.911 cir0
newpath
51107 45953.2 moveto
51462.8 45597.4 lineto
stroke
newpath
51462.8 45953.2 moveto
51107 45597.4 lineto
stroke
51284.9 45775.3 177.911 cir0
newpath
51107 44949 moveto
51462.8 44593.2 lineto
stroke
newpath
51462.8 44949 moveto
51107 44593.2 lineto
stroke
51284.9 44771.1 177.911 cir0
newpath
50906.2 48765 moveto
51262 48409.2 lineto
stroke
newpath
51262 48765 moveto
50906.2 48409.2 lineto
stroke
51084.1 48587.1 177.911 cir0
newpath
50906.2 47760.8 moveto
51262 47404.9 lineto
stroke
newpath
51262 47760.8 moveto
50906.2 47404.9 lineto
stroke
51084.1 47582.9 177.911 cir0
newpath
51006.6 42840.1 moveto
51362.4 42484.3 lineto
stroke
newpath
51362.4 42840.1 moveto
51006.6 42484.3 lineto
stroke
51184.5 42662.2 177.911 cir0
newpath
51006.6 41835.9 moveto
51362.4 41480.1 lineto
stroke
newpath
51362.4 41835.9 moveto
51006.6 41480.1 lineto
stroke
51184.5 41658 177.911 cir0
newpath
51577.1 66107.4 moveto
51972.4 65712 lineto
stroke
newpath
51972.4 66107.4 moveto
51577.1 65712 lineto
stroke
newpath
51774.8 66107.4 moveto
51774.8 65712 lineto
stroke
newpath
51577.1 65909.7 moveto
51972.4 65909.7 lineto
stroke
newpath
51616.4 66305 moveto
51616.4 65514.3 lineto
stroke
newpath
51933.1 66305 moveto
51933.1 65514.3 lineto
stroke
51774.8 65514.3 158.309 180 360 arc0
51774.8 66305 158.309 0 180 arc0
newpath
52763.1 64249.2 moveto
53158.5 63853.8 lineto
stroke
newpath
53158.5 64249.2 moveto
52763.1 63853.8 lineto
stroke
newpath
52960.8 64249.2 moveto
52960.8 63853.8 lineto
stroke
newpath
52763.1 64051.5 moveto
53158.5 64051.5 lineto
stroke
newpath
52565.5 63893.2 moveto
53356.2 63893.2 lineto
stroke
newpath
52565.5 64209.8 moveto
53356.2 64209.8 lineto
stroke
53356.2 64051.5 158.309 270 450 arc0
52565.5 64051.5 158.309 90 270 arc0
newpath
53949.2 66107.4 moveto
54344.6 65712 lineto
stroke
newpath
54344.6 66107.4 moveto
53949.2 65712 lineto
stroke
newpath
54146.9 66107.4 moveto
54146.9 65712 lineto
stroke
newpath
53949.2 65909.7 moveto
54344.6 65909.7 lineto
stroke
newpath
53988.6 66305 moveto
53988.6 65514.3 lineto
stroke
newpath
54305.2 66305 moveto
54305.2 65514.3 lineto
stroke
54146.9 65514.3 158.309 180 360 arc0
54146.9 66305 158.309 0 180 arc0
newpath
54602 77505.1 moveto
54997.3 77109.8 lineto
stroke
newpath
54997.3 77505.1 moveto
54602 77109.8 lineto
stroke
newpath
54799.6 77505.1 moveto
54799.6 77109.8 lineto
stroke
newpath
54602 77307.4 moveto
54997.3 77307.4 lineto
stroke
newpath
55312 76795 moveto
55707.4 76399.7 lineto
stroke
newpath
55707.4 76795 moveto
55312 76399.7 lineto
stroke
newpath
55509.7 76795 moveto
55509.7 76399.7 lineto
stroke
newpath
55312 76597.4 moveto
55707.4 76597.4 lineto
stroke
newpath
56022.1 76085 moveto
56417.5 75689.6 lineto
stroke
newpath
56417.5 76085 moveto
56022.1 75689.6 lineto
stroke
newpath
56219.8 76085 moveto
56219.8 75689.6 lineto
stroke
newpath
56022.1 75887.3 moveto
56417.5 75887.3 lineto
stroke
newpath
56732.2 75374.9 moveto
57127.6 74979.5 lineto
stroke
newpath
57127.6 75374.9 moveto
56732.2 74979.5 lineto
stroke
newpath
56929.9 75374.9 moveto
56929.9 74979.5 lineto
stroke
newpath
56732.2 75177.2 moveto
57127.6 75177.2 lineto
stroke
newpath
57442.3 74664.8 moveto
57837.6 74269.4 lineto
stroke
newpath
57837.6 74664.8 moveto
57442.3 74269.4 lineto
stroke
newpath
57640 74664.8 moveto
57640 74269.4 lineto
stroke
newpath
57442.3 74467.1 moveto
57837.6 74467.1 lineto
stroke
newpath
58152.4 73954.7 moveto
58547.7 73559.4 lineto
stroke
newpath
58547.7 73954.7 moveto
58152.4 73559.4 lineto
stroke
newpath
58350.1 73954.7 moveto
58350.1 73559.4 lineto
stroke
newpath
58152.4 73757 moveto
58547.7 73757 lineto
stroke
newpath
58862.5 73244.6 moveto
59257.8 72849.3 lineto
stroke
newpath
59257.8 73244.6 moveto
58862.5 72849.3 lineto
stroke
newpath
59060.1 73244.6 moveto
59060.1 72849.3 lineto
stroke
newpath
58862.5 73046.9 moveto
59257.8 73046.9 lineto
stroke
newpath
59572.5 72534.5 moveto
59967.9 72139.2 lineto
stroke
newpath
59967.9 72534.5 moveto
59572.5 72139.2 lineto
stroke
newpath
59770.2 72534.5 moveto
59770.2 72139.2 lineto
stroke
newpath
59572.5 72336.9 moveto
59967.9 72336.9 lineto
stroke
newpath
60282.6 71824.5 moveto
60678 71429.1 lineto
stroke
newpath
60678 71824.5 moveto
60282.6 71429.1 lineto
stroke
newpath
60480.3 71824.5 moveto
60480.3 71429.1 lineto
stroke
newpath
60282.6 71626.8 moveto
60678 71626.8 lineto
stroke
newpath
60992.7 71114.4 moveto
61388.1 70719 lineto
stroke
newpath
61388.1 71114.4 moveto
60992.7 70719 lineto
stroke
newpath
61190.4 71114.4 moveto
61190.4 70719 lineto
stroke
newpath
60992.7 70916.7 moveto
61388.1 70916.7 lineto
stroke
newpath
61702.8 70404.3 moveto
62098.1 70008.9 lineto
stroke
newpath
62098.1 70404.3 moveto
61702.8 70008.9 lineto
stroke
newpath
61900.5 70404.3 moveto
61900.5 70008.9 lineto
stroke
newpath
61702.8 70206.6 moveto
62098.1 70206.6 lineto
stroke
newpath
62412.9 69694.2 moveto
62808.2 69298.9 lineto
stroke
newpath
62808.2 69694.2 moveto
62412.9 69298.9 lineto
stroke
newpath
62610.6 69694.2 moveto
62610.6 69298.9 lineto
stroke
newpath
62412.9 69496.5 moveto
62808.2 69496.5 lineto
stroke
newpath
63123 68984.1 moveto
63518.3 68588.8 lineto
stroke
newpath
63518.3 68984.1 moveto
63123 68588.8 lineto
stroke
newpath
63320.6 68984.1 moveto
63320.6 68588.8 lineto
stroke
newpath
63123 68786.4 moveto
63518.3 68786.4 lineto
stroke
newpath
63833 68274 moveto
64228.4 67878.7 lineto
stroke
newpath
64228.4 68274 moveto
63833 67878.7 lineto
stroke
newpath
64030.7 68274 moveto
64030.7 67878.7 lineto
stroke
newpath
63833 68076.4 moveto
64228.4 68076.4 lineto
stroke
newpath
64543.1 67564 moveto
64938.5 67168.6 lineto
stroke
newpath
64938.5 67564 moveto
64543.1 67168.6 lineto
stroke
newpath
64740.8 67564 moveto
64740.8 67168.6 lineto
stroke
newpath
64543.1 67366.3 moveto
64938.5 67366.3 lineto
stroke
newpath
65253.2 66853.9 moveto
65648.6 66458.5 lineto
stroke
newpath
65648.6 66853.9 moveto
65253.2 66458.5 lineto
stroke
newpath
65450.9 66853.9 moveto
65450.9 66458.5 lineto
stroke
newpath
65253.2 66656.2 moveto
65648.6 66656.2 lineto
stroke
newpath
65963.3 66143.8 moveto
66358.6 65748.4 lineto
stroke
newpath
66358.6 66143.8 moveto
65963.3 65748.4 lineto
stroke
newpath
66161 66143.8 moveto
66161 65748.4 lineto
stroke
newpath
65963.3 65946.1 moveto
66358.6 65946.1 lineto
stroke
newpath
50384.9 73222.9 moveto
50780.2 72827.5 lineto
stroke
newpath
50780.2 73222.9 moveto
50384.9 72827.5 lineto
stroke
newpath
50582.6 73222.9 moveto
50582.6 72827.5 lineto
stroke
newpath
50384.9 73025.2 moveto
50780.2 73025.2 lineto
stroke
newpath
51095 72512.8 moveto
51490.3 72117.5 lineto
stroke
newpath
51490.3 72512.8 moveto
51095 72117.5 lineto
stroke
newpath
51292.6 72512.8 moveto
51292.6 72117.5 lineto
stroke
newpath
51095 72315.1 moveto
51490.3 72315.1 lineto
stroke
newpath
51805.1 71802.7 moveto
52200.4 71407.4 lineto
stroke
newpath
52200.4 71802.7 moveto
51805.1 71407.4 lineto
stroke
newpath
52002.7 71802.7 moveto
52002.7 71407.4 lineto
stroke
newpath
51805.1 71605.1 moveto
52200.4 71605.1 lineto
stroke
newpath
52515.1 71092.7 moveto
52910.5 70697.3 lineto
stroke
newpath
52910.5 71092.7 moveto
52515.1 70697.3 lineto
stroke
newpath
52712.8 71092.7 moveto
52712.8 70697.3 lineto
stroke
newpath
52515.1 70895 moveto
52910.5 70895 lineto
stroke
newpath
53225.2 70382.6 moveto
53620.6 69987.2 lineto
stroke
newpath
53620.6 70382.6 moveto
53225.2 69987.2 lineto
stroke
newpath
53422.9 70382.6 moveto
53422.9 69987.2 lineto
stroke
newpath
53225.2 70184.9 moveto
53620.6 70184.9 lineto
stroke
newpath
53935.3 69672.5 moveto
54330.7 69277.1 lineto
stroke
newpath
54330.7 69672.5 moveto
53935.3 69277.1 lineto
stroke
newpath
54133 69672.5 moveto
54133 69277.1 lineto
stroke
newpath
53935.3 69474.8 moveto
54330.7 69474.8 lineto
stroke
newpath
54645.4 68962.4 moveto
55040.7 68567.1 lineto
stroke
newpath
55040.7 68962.4 moveto
54645.4 68567.1 lineto
stroke
newpath
54843.1 68962.4 moveto
54843.1 68567.1 lineto
stroke
newpath
54645.4 68764.7 moveto
55040.7 68764.7 lineto
stroke
newpath
55355.5 68252.3 moveto
55750.8 67857 lineto
stroke
newpath
55750.8 68252.3 moveto
55355.5 67857 lineto
stroke
newpath
55553.1 68252.3 moveto
55553.1 67857 lineto
stroke
newpath
55355.5 68054.6 moveto
55750.8 68054.6 lineto
stroke
newpath
56065.6 67542.2 moveto
56460.9 67146.9 lineto
stroke
newpath
56460.9 67542.2 moveto
56065.6 67146.9 lineto
stroke
newpath
56263.2 67542.2 moveto
56263.2 67146.9 lineto
stroke
newpath
56065.6 67344.6 moveto
56460.9 67344.6 lineto
stroke
newpath
56775.6 66832.2 moveto
57171 66436.8 lineto
stroke
newpath
57171 66832.2 moveto
56775.6 66436.8 lineto
stroke
newpath
56973.3 66832.2 moveto
56973.3 66436.8 lineto
stroke
newpath
56775.6 66634.5 moveto
57171 66634.5 lineto
stroke
newpath
57485.7 66122.1 moveto
57881.1 65726.7 lineto
stroke
newpath
57881.1 66122.1 moveto
57485.7 65726.7 lineto
stroke
newpath
57683.4 66122.1 moveto
57683.4 65726.7 lineto
stroke
newpath
57485.7 65924.4 moveto
57881.1 65924.4 lineto
stroke
newpath
58195.8 65412 moveto
58591.2 65016.6 lineto
stroke
newpath
58591.2 65412 moveto
58195.8 65016.6 lineto
stroke
newpath
58393.5 65412 moveto
58393.5 65016.6 lineto
stroke
newpath
58195.8 65214.3 moveto
58591.2 65214.3 lineto
stroke
newpath
58905.9 64701.9 moveto
59301.2 64306.6 lineto
stroke
newpath
59301.2 64701.9 moveto
58905.9 64306.6 lineto
stroke
newpath
59103.6 64701.9 moveto
59103.6 64306.6 lineto
stroke
newpath
58905.9 64504.2 moveto
59301.2 64504.2 lineto
stroke
newpath
59616 63991.8 moveto
60011.3 63596.5 lineto
stroke
newpath
60011.3 63991.8 moveto
59616 63596.5 lineto
stroke
newpath
59813.6 63991.8 moveto
59813.6 63596.5 lineto
stroke
newpath
59616 63794.1 moveto
60011.3 63794.1 lineto
stroke
newpath
60326.1 63281.7 moveto
60721.4 62886.4 lineto
stroke
newpath
60721.4 63281.7 moveto
60326.1 62886.4 lineto
stroke
newpath
60523.7 63281.7 moveto
60523.7 62886.4 lineto
stroke
newpath
60326.1 63084.1 moveto
60721.4 63084.1 lineto
stroke
newpath
61036.1 62571.7 moveto
61431.5 62176.3 lineto
stroke
newpath
61431.5 62571.7 moveto
61036.1 62176.3 lineto
stroke
newpath
61233.8 62571.7 moveto
61233.8 62176.3 lineto
stroke
newpath
61036.1 62374 moveto
61431.5 62374 lineto
stroke
newpath
61746.2 61861.6 moveto
62141.6 61466.2 lineto
stroke
newpath
62141.6 61861.6 moveto
61746.2 61466.2 lineto
stroke
newpath
61943.9 61861.6 moveto
61943.9 61466.2 lineto
stroke
newpath
61746.2 61663.9 moveto
62141.6 61663.9 lineto
stroke
newpath
65310.6 46812.7 moveto
66180.4 45942.9 lineto
stroke
newpath
66180.4 46812.7 moveto
65310.6 45942.9 lineto
stroke
newpath
66053 46070.3 moveto
66053 46685.3 lineto
65438 46685.3 lineto
65438 46070.3 lineto
66053 46070.3 lineto
poly0
newpath
50649.2 70009.9 moveto
51519 69140.1 lineto
stroke
newpath
51519 70009.9 moveto
50649.2 69140.1 lineto
stroke
newpath
51391.6 69267.5 moveto
51391.6 69882.6 lineto
50776.5 69882.6 lineto
50776.5 69267.5 lineto
51391.6 69267.5 lineto
poly0
118.11 setlinewidth
0 0 0 setrgbcolor
0 0 0 setrgbcolor
newpath
49069 35175.5 moveto
49069 36356.6 lineto
49350.2 36356.6 lineto
49519 36300.3 lineto
49631.5 36187.9 lineto
49687.7 36075.4 lineto
49743.9 35850.4 lineto
49743.9 35681.7 lineto
49687.7 35456.7 lineto
49631.5 35344.2 lineto
49519 35231.7 lineto
49350.2 35175.5 lineto
49069 35175.5 lineto
stroke
newpath
50250.1 35175.5 moveto
50250.1 35962.9 lineto
stroke
newpath
50250.1 35737.9 moveto
50306.4 35850.4 lineto
50362.6 35906.6 lineto
50475.1 35962.9 lineto
50587.6 35962.9 lineto
stroke
newpath
50981.3 35175.5 moveto
50981.3 35962.9 lineto
stroke
newpath
50981.3 36356.6 moveto
50925.1 36300.3 lineto
50981.3 36244.1 lineto
51037.5 36300.3 lineto
50981.3 36356.6 lineto
50981.3 36244.1 lineto
stroke
newpath
51712.5 35175.5 moveto
51600 35231.7 lineto
51543.7 35344.2 lineto
51543.7 36356.6 lineto
stroke
newpath
52331.1 35175.5 moveto
52218.6 35231.7 lineto
52162.4 35344.2 lineto
52162.4 36356.6 lineto
stroke
newpath
53681 35175.5 moveto
53681 36356.6 lineto
54074.7 35512.9 lineto
54468.4 36356.6 lineto
54468.4 35175.5 lineto
stroke
newpath
55537 35175.5 moveto
55537 35794.2 lineto
55480.7 35906.6 lineto
55368.2 35962.9 lineto
55143.3 35962.9 lineto
55030.8 35906.6 lineto
stroke
newpath
55537 35231.7 moveto
55424.5 35175.5 lineto
55143.3 35175.5 lineto
55030.8 35231.7 lineto
54974.5 35344.2 lineto
54974.5 35456.7 lineto
55030.8 35569.2 lineto
55143.3 35625.4 lineto
55424.5 35625.4 lineto
55537 35681.7 lineto
stroke
newpath
56099.4 35962.9 moveto
56099.4 34781.8 lineto
stroke
newpath
56099.4 35906.6 moveto
56211.9 35962.9 lineto
56436.9 35962.9 lineto
56549.3 35906.6 lineto
56605.6 35850.4 lineto
56661.8 35737.9 lineto
56661.8 35400.5 lineto
56605.6 35288 lineto
56549.3 35231.7 lineto
56436.9 35175.5 lineto
56211.9 35175.5 lineto
56099.4 35231.7 lineto
stroke
newpath
57168 35288 moveto
57224.3 35231.7 lineto
57168 35175.5 lineto
57111.8 35231.7 lineto
57168 35288 lineto
57168 35175.5 lineto
stroke
newpath
57168 35906.6 moveto
57224.3 35850.4 lineto
57168 35794.2 lineto
57111.8 35850.4 lineto
57168 35906.6 lineto
57168 35794.2 lineto
stroke
newpath
47822.8 33288.8 moveto
47941.4 33170.2 lineto
stroke
newpath
47941.4 33288.8 moveto
47822.8 33170.2 lineto
stroke
0 0 0 setrgbcolor
0 0 0 setrgbcolor
newpath
49294 33876.3 moveto
49406.5 33876.3 lineto
49519 33820 lineto
49575.2 33763.8 lineto
49631.5 33651.3 lineto
49687.7 33426.3 lineto
49687.7 33145.1 lineto
49631.5 32920.1 lineto
49575.2 32807.7 lineto
49519 32751.4 lineto
49406.5 32695.2 lineto
49294 32695.2 lineto
49181.5 32751.4 lineto
49125.3 32807.7 lineto
49069 32920.1 lineto
49012.8 33145.1 lineto
49012.8 33426.3 lineto
49069 33651.3 lineto
49125.3 33763.8 lineto
49181.5 33820 lineto
49294 33876.3 lineto
stroke
newpath
50193.9 32807.7 moveto
50250.1 32751.4 lineto
50193.9 32695.2 lineto
50137.6 32751.4 lineto
50193.9 32807.7 lineto
50193.9 32695.2 lineto
stroke
newpath
50643.8 33876.3 moveto
51375 33876.3 lineto
50981.3 33426.3 lineto
51150 33426.3 lineto
51262.5 33370.1 lineto
51318.8 33313.8 lineto
51375 33201.4 lineto
51375 32920.1 lineto
51318.8 32807.7 lineto
51262.5 32751.4 lineto
51150 32695.2 lineto
50812.6 32695.2 lineto
50700.1 32751.4 lineto
50643.8 32807.7 lineto
stroke
newpath
52106.2 33876.3 moveto
52218.6 33876.3 lineto
52331.1 33820 lineto
52387.4 33763.8 lineto
52443.6 33651.3 lineto
52499.9 33426.3 lineto
52499.9 33145.1 lineto
52443.6 32920.1 lineto
52387.4 32807.7 lineto
52331.1 32751.4 lineto
52218.6 32695.2 lineto
52106.2 32695.2 lineto
51993.7 32751.4 lineto
51937.4 32807.7 lineto
51881.2 32920.1 lineto
51824.9 33145.1 lineto
51824.9 33426.3 lineto
51881.2 33651.3 lineto
51937.4 33763.8 lineto
51993.7 33820 lineto
52106.2 33876.3 lineto
stroke
newpath
53006 32695.2 moveto
53006 33482.6 lineto
stroke
newpath
53006 33370.1 moveto
53062.3 33426.3 lineto
53174.8 33482.6 lineto
53343.5 33482.6 lineto
53456 33426.3 lineto
53512.2 33313.8 lineto
53512.2 32695.2 lineto
stroke
newpath
53512.2 33313.8 moveto
53568.5 33426.3 lineto
53681 33482.6 lineto
53849.7 33482.6 lineto
53962.2 33426.3 lineto
54018.4 33313.8 lineto
54018.4 32695.2 lineto
stroke
newpath
54580.8 32695.2 moveto
54580.8 33482.6 lineto
stroke
newpath
54580.8 33370.1 moveto
54637.1 33426.3 lineto
54749.6 33482.6 lineto
54918.3 33482.6 lineto
55030.8 33426.3 lineto
55087 33313.8 lineto
55087 32695.2 lineto
stroke
newpath
55087 33313.8 moveto
55143.3 33426.3 lineto
55255.8 33482.6 lineto
55424.5 33482.6 lineto
55537 33426.3 lineto
55593.2 33313.8 lineto
55593.2 32695.2 lineto
stroke
newpath
57899.2 33932.5 moveto
56886.8 32414 lineto
stroke
newpath
59417.7 33876.3 moveto
59530.2 33876.3 lineto
59642.7 33820 lineto
59699 33763.8 lineto
59755.2 33651.3 lineto
59811.4 33426.3 lineto
59811.4 33145.1 lineto
59755.2 32920.1 lineto
59699 32807.7 lineto
59642.7 32751.4 lineto
59530.2 32695.2 lineto
59417.7 32695.2 lineto
59305.3 32751.4 lineto
59249 32807.7 lineto
59192.8 32920.1 lineto
59136.5 33145.1 lineto
59136.5 33426.3 lineto
59192.8 33651.3 lineto
59249 33763.8 lineto
59305.3 33820 lineto
59417.7 33876.3 lineto
stroke
newpath
60317.6 32807.7 moveto
60373.9 32751.4 lineto
60317.6 32695.2 lineto
60261.4 32751.4 lineto
60317.6 32807.7 lineto
60317.6 32695.2 lineto
stroke
newpath
61105 33876.3 moveto
61217.5 33876.3 lineto
61330 33820 lineto
61386.2 33763.8 lineto
61442.5 33651.3 lineto
61498.7 33426.3 lineto
61498.7 33145.1 lineto
61442.5 32920.1 lineto
61386.2 32807.7 lineto
61330 32751.4 lineto
61217.5 32695.2 lineto
61105 32695.2 lineto
60992.5 32751.4 lineto
60936.3 32807.7 lineto
60880.1 32920.1 lineto
60823.8 33145.1 lineto
60823.8 33426.3 lineto
60880.1 33651.3 lineto
60936.3 33763.8 lineto
60992.5 33820 lineto
61105 33876.3 lineto
stroke
newpath
62623.6 32695.2 moveto
61948.7 32695.2 lineto
stroke
newpath
62286.1 32695.2 moveto
62286.1 33876.3 lineto
62173.6 33707.5 lineto
62061.2 33595.1 lineto
61948.7 33538.8 lineto
stroke
newpath
63073.5 33763.8 moveto
63129.8 33820 lineto
63242.3 33876.3 lineto
63523.5 33876.3 lineto
63636 33820 lineto
63692.2 33763.8 lineto
63748.4 33651.3 lineto
63748.4 33538.8 lineto
63692.2 33370.1 lineto
63017.3 32695.2 lineto
63748.4 32695.2 lineto
stroke
newpath
64198.4 33876.3 moveto
64198.4 33651.3 lineto
stroke
newpath
64648.3 33876.3 moveto
64648.3 33651.3 lineto
stroke
newpath
66391.9 32245.2 moveto
66335.6 32301.5 lineto
66223.1 32470.2 lineto
66166.9 32582.7 lineto
66110.7 32751.4 lineto
66054.4 33032.6 lineto
66054.4 33257.6 lineto
66110.7 33538.8 lineto
66166.9 33707.5 lineto
66223.1 33820 lineto
66335.6 33988.8 lineto
66391.9 34045 lineto
stroke
newpath
67460.5 32695.2 moveto
66785.6 32695.2 lineto
stroke
newpath
67123 32695.2 moveto
67123 33876.3 lineto
67010.5 33707.5 lineto
66898.1 33595.1 lineto
66785.6 33538.8 lineto
stroke
newpath
68529.1 33876.3 moveto
67966.7 33876.3 lineto
67910.4 33313.8 lineto
67966.7 33370.1 lineto
68079.2 33426.3 lineto
68360.4 33426.3 lineto
68472.9 33370.1 lineto
68529.1 33313.8 lineto
68585.3 33201.4 lineto
68585.3 32920.1 lineto
68529.1 32807.7 lineto
68472.9 32751.4 lineto
68360.4 32695.2 lineto
68079.2 32695.2 lineto
67966.7 32751.4 lineto
67910.4 32807.7 lineto
stroke
newpath
69991.4 32695.2 moveto
69991.4 33876.3 lineto
stroke
newpath
70497.6 32695.2 moveto
70497.6 33313.8 lineto
70441.4 33426.3 lineto
70328.9 33482.6 lineto
70160.1 33482.6 lineto
70047.7 33426.3 lineto
69991.4 33370.1 lineto
stroke
newpath
71228.8 32695.2 moveto
71116.3 32751.4 lineto
71060 32807.7 lineto
71003.8 32920.1 lineto
71003.8 33257.6 lineto
71060 33370.1 lineto
71116.3 33426.3 lineto
71228.8 33482.6 lineto
71397.5 33482.6 lineto
71510 33426.3 lineto
71566.2 33370.1 lineto
71622.5 33257.6 lineto
71622.5 32920.1 lineto
71566.2 32807.7 lineto
71510 32751.4 lineto
71397.5 32695.2 lineto
71228.8 32695.2 lineto
stroke
newpath
72297.4 32695.2 moveto
72184.9 32751.4 lineto
72128.6 32863.9 lineto
72128.6 33876.3 lineto
stroke
newpath
73197.3 32751.4 moveto
73084.8 32695.2 lineto
72859.8 32695.2 lineto
72747.3 32751.4 lineto
72691.1 32863.9 lineto
72691.1 33313.8 lineto
72747.3 33426.3 lineto
72859.8 33482.6 lineto
73084.8 33482.6 lineto
73197.3 33426.3 lineto
73253.5 33313.8 lineto
73253.5 33201.4 lineto
72691.1 33088.9 lineto
stroke
newpath
73703.5 32751.4 moveto
73815.9 32695.2 lineto
74040.9 32695.2 lineto
74153.4 32751.4 lineto
74209.6 32863.9 lineto
74209.6 32920.1 lineto
74153.4 33032.6 lineto
74040.9 33088.9 lineto
73872.2 33088.9 lineto
73759.7 33145.1 lineto
73703.5 33257.6 lineto
73703.5 33313.8 lineto
73759.7 33426.3 lineto
73872.2 33482.6 lineto
74040.9 33482.6 lineto
74153.4 33426.3 lineto
stroke
newpath
74603.3 32245.2 moveto
74659.6 32301.5 lineto
74772.1 32470.2 lineto
74828.3 32582.7 lineto
74884.6 32751.4 lineto
74940.8 33032.6 lineto
74940.8 33257.6 lineto
74884.6 33538.8 lineto
74828.3 33707.5 lineto
74772.1 33820 lineto
74659.6 33988.8 lineto
74603.3 34045 lineto
stroke
47862.3 31670.4 79.0716 cir0
0 0 0 setrgbcolor
0 0 0 setrgbcolor
newpath
49294 32317.2 moveto
49406.5 32317.2 lineto
49519 32261 lineto
49575.2 32204.7 lineto
49631.5 32092.2 lineto
49687.7 31867.3 lineto
49687.7 31586.1 lineto
49631.5 31361.1 lineto
49575.2 31248.6 lineto
49519 31192.4 lineto
49406.5 31136.1 lineto
49294 31136.1 lineto
49181.5 31192.4 lineto
49125.3 31248.6 lineto
49069 31361.1 lineto
49012.8 31586.1 lineto
49012.8 31867.3 lineto
49069 32092.2 lineto
49125.3 32204.7 lineto
49181.5 32261 lineto
49294 32317.2 lineto
stroke
newpath
50193.9 31248.6 moveto
50250.1 31192.4 lineto
50193.9 31136.1 lineto
50137.6 31192.4 lineto
50193.9 31248.6 lineto
50193.9 31136.1 lineto
stroke
newpath
51262.5 31923.5 moveto
51262.5 31136.1 lineto
stroke
newpath
50981.3 32373.5 moveto
50700.1 31529.8 lineto
51431.2 31529.8 lineto
stroke
newpath
52106.2 32317.2 moveto
52218.6 32317.2 lineto
52331.1 32261 lineto
52387.4 32204.7 lineto
52443.6 32092.2 lineto
52499.9 31867.3 lineto
52499.9 31586.1 lineto
52443.6 31361.1 lineto
52387.4 31248.6 lineto
52331.1 31192.4 lineto
52218.6 31136.1 lineto
52106.2 31136.1 lineto
51993.7 31192.4 lineto
51937.4 31248.6 lineto
51881.2 31361.1 lineto
51824.9 31586.1 lineto
51824.9 31867.3 lineto
51881.2 32092.2 lineto
51937.4 32204.7 lineto
51993.7 32261 lineto
52106.2 32317.2 lineto
stroke
newpath
53006 31136.1 moveto
53006 31923.5 lineto
stroke
newpath
53006 31811 moveto
53062.3 31867.3 lineto
53174.8 31923.5 lineto
53343.5 31923.5 lineto
53456 31867.3 lineto
53512.2 31754.8 lineto
53512.2 31136.1 lineto
stroke
newpath
53512.2 31754.8 moveto
53568.5 31867.3 lineto
53681 31923.5 lineto
53849.7 31923.5 lineto
53962.2 31867.3 lineto
54018.4 31754.8 lineto
54018.4 31136.1 lineto
stroke
newpath
54580.8 31136.1 moveto
54580.8 31923.5 lineto
stroke
newpath
54580.8 31811 moveto
54637.1 31867.3 lineto
54749.6 31923.5 lineto
54918.3 31923.5 lineto
55030.8 31867.3 lineto
55087 31754.8 lineto
55087 31136.1 lineto
stroke
newpath
55087 31754.8 moveto
55143.3 31867.3 lineto
55255.8 31923.5 lineto
55424.5 31923.5 lineto
55537 31867.3 lineto
55593.2 31754.8 lineto
55593.2 31136.1 lineto
stroke
newpath
57899.2 32373.5 moveto
56886.8 30854.9 lineto
stroke
newpath
59417.7 32317.2 moveto
59530.2 32317.2 lineto
59642.7 32261 lineto
59699 32204.7 lineto
59755.2 32092.2 lineto
59811.4 31867.3 lineto
59811.4 31586.1 lineto
59755.2 31361.1 lineto
59699 31248.6 lineto
59642.7 31192.4 lineto
59530.2 31136.1 lineto
59417.7 31136.1 lineto
59305.3 31192.4 lineto
59249 31248.6 lineto
59192.8 31361.1 lineto
59136.5 31586.1 lineto
59136.5 31867.3 lineto
59192.8 32092.2 lineto
59249 32204.7 lineto
59305.3 32261 lineto
59417.7 32317.2 lineto
stroke
newpath
60317.6 31248.6 moveto
60373.9 31192.4 lineto
60317.6 31136.1 lineto
60261.4 31192.4 lineto
60317.6 31248.6 lineto
60317.6 31136.1 lineto
stroke
newpath
61105 32317.2 moveto
61217.5 32317.2 lineto
61330 32261 lineto
61386.2 32204.7 lineto
61442.5 32092.2 lineto
61498.7 31867.3 lineto
61498.7 31586.1 lineto
61442.5 31361.1 lineto
61386.2 31248.6 lineto
61330 31192.4 lineto
61217.5 31136.1 lineto
61105 31136.1 lineto
60992.5 31192.4 lineto
60936.3 31248.6 lineto
60880.1 31361.1 lineto
60823.8 31586.1 lineto
60823.8 31867.3 lineto
60880.1 32092.2 lineto
60936.3 32204.7 lineto
60992.5 32261 lineto
61105 32317.2 lineto
stroke
newpath
62623.6 31136.1 moveto
61948.7 31136.1 lineto
stroke
newpath
62286.1 31136.1 moveto
62286.1 32317.2 lineto
62173.6 32148.5 lineto
62061.2 32036 lineto
61948.7 31979.8 lineto
stroke
newpath
63636 32317.2 moveto
63411 32317.2 lineto
63298.5 32261 lineto
63242.3 32204.7 lineto
63129.8 32036 lineto
63073.5 31811 lineto
63073.5 31361.1 lineto
63129.8 31248.6 lineto
63186 31192.4 lineto
63298.5 31136.1 lineto
63523.5 31136.1 lineto
63636 31192.4 lineto
63692.2 31248.6 lineto
63748.4 31361.1 lineto
63748.4 31642.3 lineto
63692.2 31754.8 lineto
63636 31811 lineto
63523.5 31867.3 lineto
63298.5 31867.3 lineto
63186 31811 lineto
63129.8 31754.8 lineto
63073.5 31642.3 lineto
stroke
newpath
64198.4 32317.2 moveto
64198.4 32092.2 lineto
stroke
newpath
64648.3 32317.2 moveto
64648.3 32092.2 lineto
stroke
newpath
66391.9 30686.2 moveto
66335.6 30742.4 lineto
66223.1 30911.1 lineto
66166.9 31023.6 lineto
66110.7 31192.4 lineto
66054.4 31473.6 lineto
66054.4 31698.5 lineto
66110.7 31979.8 lineto
66166.9 32148.5 lineto
66223.1 32261 lineto
66335.6 32429.7 lineto
66391.9 32485.9 lineto
stroke
newpath
66729.3 32317.2 moveto
67516.7 32317.2 lineto
67010.5 31136.1 lineto
stroke
newpath
68585.3 31136.1 moveto
67910.4 31136.1 lineto
stroke
newpath
68247.9 31136.1 moveto
68247.9 32317.2 lineto
68135.4 32148.5 lineto
68022.9 32036 lineto
67910.4 31979.8 lineto
stroke
newpath
69991.4 31136.1 moveto
69991.4 32317.2 lineto
stroke
newpath
70497.6 31136.1 moveto
70497.6 31754.8 lineto
70441.4 31867.3 lineto
70328.9 31923.5 lineto
70160.1 31923.5 lineto
70047.7 31867.3 lineto
69991.4 31811 lineto
stroke
newpath
71228.8 31136.1 moveto
71116.3 31192.4 lineto
71060 31248.6 lineto
71003.8 31361.1 lineto
71003.8 31698.5 lineto
71060 31811 lineto
71116.3 31867.3 lineto
71228.8 31923.5 lineto
71397.5 31923.5 lineto
71510 31867.3 lineto
71566.2 31811 lineto
71622.5 31698.5 lineto
71622.5 31361.1 lineto
71566.2 31248.6 lineto
71510 31192.4 lineto
71397.5 31136.1 lineto
71228.8 31136.1 lineto
stroke
newpath
72297.4 31136.1 moveto
72184.9 31192.4 lineto
72128.6 31304.8 lineto
72128.6 32317.2 lineto
stroke
newpath
73197.3 31192.4 moveto
73084.8 31136.1 lineto
72859.8 31136.1 lineto
72747.3 31192.4 lineto
72691.1 31304.8 lineto
72691.1 31754.8 lineto
72747.3 31867.3 lineto
72859.8 31923.5 lineto
73084.8 31923.5 lineto
73197.3 31867.3 lineto
73253.5 31754.8 lineto
73253.5 31642.3 lineto
72691.1 31529.8 lineto
stroke
newpath
73703.5 31192.4 moveto
73815.9 31136.1 lineto
74040.9 31136.1 lineto
74153.4 31192.4 lineto
74209.6 31304.8 lineto
74209.6 31361.1 lineto
74153.4 31473.6 lineto
74040.9 31529.8 lineto
73872.2 31529.8 lineto
73759.7 31586.1 lineto
73703.5 31698.5 lineto
73703.5 31754.8 lineto
73759.7 31867.3 lineto
73872.2 31923.5 lineto
74040.9 31923.5 lineto
74153.4 31867.3 lineto
stroke
newpath
74603.3 30686.2 moveto
74659.6 30742.4 lineto
74772.1 30911.1 lineto
74828.3 31023.6 lineto
74884.6 31192.4 lineto
74940.8 31473.6 lineto
74940.8 31698.5 lineto
74884.6 31979.8 lineto
74828.3 32148.5 lineto
74772.1 32261 lineto
74659.6 32429.7 lineto
74603.3 32485.9 lineto
stroke
newpath
47842.5 30210.2 moveto
47842.5 30012.5 lineto
stroke
newpath
47743.7 30111.4 moveto
47941.4 30111.4 lineto
stroke
0 0 0 setrgbcolor
0 0 0 setrgbcolor
newpath
49294 30758.2 moveto
49406.5 30758.2 lineto
49519 30701.9 lineto
49575.2 30645.7 lineto
49631.5 30533.2 lineto
49687.7 30308.2 lineto
49687.7 30027 lineto
49631.5 29802 lineto
49575.2 29689.5 lineto
49519 29633.3 lineto
49406.5 29577.1 lineto
49294 29577.1 lineto
49181.5 29633.3 lineto
49125.3 29689.5 lineto
49069 29802 lineto
49012.8 30027 lineto
49012.8 30308.2 lineto
49069 30533.2 lineto
49125.3 30645.7 lineto
49181.5 30701.9 lineto
49294 30758.2 lineto
stroke
newpath
50193.9 29689.5 moveto
50250.1 29633.3 lineto
50193.9 29577.1 lineto
50137.6 29633.3 lineto
50193.9 29689.5 lineto
50193.9 29577.1 lineto
stroke
newpath
51318.8 30758.2 moveto
50756.3 30758.2 lineto
50700.1 30195.7 lineto
50756.3 30252 lineto
50868.8 30308.2 lineto
51150 30308.2 lineto
51262.5 30252 lineto
51318.8 30195.7 lineto
51375 30083.2 lineto
51375 29802 lineto
51318.8 29689.5 lineto
51262.5 29633.3 lineto
51150 29577.1 lineto
50868.8 29577.1 lineto
50756.3 29633.3 lineto
50700.1 29689.5 lineto
stroke
newpath
52106.2 30758.2 moveto
52218.6 30758.2 lineto
52331.1 30701.9 lineto
52387.4 30645.7 lineto
52443.6 30533.2 lineto
52499.9 30308.2 lineto
52499.9 30027 lineto
52443.6 29802 lineto
52387.4 29689.5 lineto
52331.1 29633.3 lineto
52218.6 29577.1 lineto
52106.2 29577.1 lineto
51993.7 29633.3 lineto
51937.4 29689.5 lineto
51881.2 29802 lineto
51824.9 30027 lineto
51824.9 30308.2 lineto
51881.2 30533.2 lineto
51937.4 30645.7 lineto
51993.7 30701.9 lineto
52106.2 30758.2 lineto
stroke
newpath
53006 29577.1 moveto
53006 30364.5 lineto
stroke
newpath
53006 30252 moveto
53062.3 30308.2 lineto
53174.8 30364.5 lineto
53343.5 30364.5 lineto
53456 30308.2 lineto
53512.2 30195.7 lineto
53512.2 29577.1 lineto
stroke
newpath
53512.2 30195.7 moveto
53568.5 30308.2 lineto
53681 30364.5 lineto
53849.7 30364.5 lineto
53962.2 30308.2 lineto
54018.4 30195.7 lineto
54018.4 29577.1 lineto
stroke
newpath
54580.8 29577.1 moveto
54580.8 30364.5 lineto
stroke
newpath
54580.8 30252 moveto
54637.1 30308.2 lineto
54749.6 30364.5 lineto
54918.3 30364.5 lineto
55030.8 30308.2 lineto
55087 30195.7 lineto
55087 29577.1 lineto
stroke
newpath
55087 30195.7 moveto
55143.3 30308.2 lineto
55255.8 30364.5 lineto
55424.5 30364.5 lineto
55537 30308.2 lineto
55593.2 30195.7 lineto
55593.2 29577.1 lineto
stroke
newpath
57899.2 30814.4 moveto
56886.8 29295.8 lineto
stroke
newpath
59417.7 30758.2 moveto
59530.2 30758.2 lineto
59642.7 30701.9 lineto
59699 30645.7 lineto
59755.2 30533.2 lineto
59811.4 30308.2 lineto
59811.4 30027 lineto
59755.2 29802 lineto
59699 29689.5 lineto
59642.7 29633.3 lineto
59530.2 29577.1 lineto
59417.7 29577.1 lineto
59305.3 29633.3 lineto
59249 29689.5 lineto
59192.8 29802 lineto
59136.5 30027 lineto
59136.5 30308.2 lineto
59192.8 30533.2 lineto
59249 30645.7 lineto
59305.3 30701.9 lineto
59417.7 30758.2 lineto
stroke
newpath
60317.6 29689.5 moveto
60373.9 29633.3 lineto
60317.6 29577.1 lineto
60261.4 29633.3 lineto
60317.6 29689.5 lineto
60317.6 29577.1 lineto
stroke
newpath
61105 30758.2 moveto
61217.5 30758.2 lineto
61330 30701.9 lineto
61386.2 30645.7 lineto
61442.5 30533.2 lineto
61498.7 30308.2 lineto
61498.7 30027 lineto
61442.5 29802 lineto
61386.2 29689.5 lineto
61330 29633.3 lineto
61217.5 29577.1 lineto
61105 29577.1 lineto
60992.5 29633.3 lineto
60936.3 29689.5 lineto
60880.1 29802 lineto
60823.8 30027 lineto
60823.8 30308.2 lineto
60880.1 30533.2 lineto
60936.3 30645.7 lineto
60992.5 30701.9 lineto
61105 30758.2 lineto
stroke
newpath
61948.7 30645.7 moveto
62004.9 30701.9 lineto
62117.4 30758.2 lineto
62398.6 30758.2 lineto
62511.1 30701.9 lineto
62567.3 30645.7 lineto
62623.6 30533.2 lineto
62623.6 30420.7 lineto
62567.3 30252 lineto
61892.4 29577.1 lineto
62623.6 29577.1 lineto
stroke
newpath
63354.7 30758.2 moveto
63467.2 30758.2 lineto
63579.7 30701.9 lineto
63636 30645.7 lineto
63692.2 30533.2 lineto
63748.4 30308.2 lineto
63748.4 30027 lineto
63692.2 29802 lineto
63636 29689.5 lineto
63579.7 29633.3 lineto
63467.2 29577.1 lineto
63354.7 29577.1 lineto
63242.3 29633.3 lineto
63186 29689.5 lineto
63129.8 29802 lineto
63073.5 30027 lineto
63073.5 30308.2 lineto
63129.8 30533.2 lineto
63186 30645.7 lineto
63242.3 30701.9 lineto
63354.7 30758.2 lineto
stroke
newpath
64198.4 30758.2 moveto
64198.4 30533.2 lineto
stroke
newpath
64648.3 30758.2 moveto
64648.3 30533.2 lineto
stroke
newpath
66391.9 29127.1 moveto
66335.6 29183.4 lineto
66223.1 29352.1 lineto
66166.9 29464.6 lineto
66110.7 29633.3 lineto
66054.4 29914.5 lineto
66054.4 30139.5 lineto
66110.7 30420.7 lineto
66166.9 30589.4 lineto
66223.1 30701.9 lineto
66335.6 30870.7 lineto
66391.9 30926.9 lineto
stroke
newpath
66785.6 30645.7 moveto
66841.8 30701.9 lineto
66954.3 30758.2 lineto
67235.5 30758.2 lineto
67348 30701.9 lineto
67404.2 30645.7 lineto
67460.5 30533.2 lineto
67460.5 30420.7 lineto
67404.2 30252 lineto
66729.3 29577.1 lineto
67460.5 29577.1 lineto
stroke
newpath
68866.6 29577.1 moveto
68866.6 30758.2 lineto
stroke
newpath
69372.7 29577.1 moveto
69372.7 30195.7 lineto
69316.5 30308.2 lineto
69204 30364.5 lineto
69035.3 30364.5 lineto
68922.8 30308.2 lineto
68866.6 30252 lineto
stroke
newpath
70103.9 29577.1 moveto
69991.4 29633.3 lineto
69935.2 29689.5 lineto
69878.9 29802 lineto
69878.9 30139.5 lineto
69935.2 30252 lineto
69991.4 30308.2 lineto
70103.9 30364.5 lineto
70272.6 30364.5 lineto
70385.1 30308.2 lineto
70441.4 30252 lineto
70497.6 30139.5 lineto
70497.6 29802 lineto
70441.4 29689.5 lineto
70385.1 29633.3 lineto
70272.6 29577.1 lineto
70103.9 29577.1 lineto
stroke
newpath
71172.5 29577.1 moveto
71060 29633.3 lineto
71003.8 29745.8 lineto
71003.8 30758.2 lineto
stroke
newpath
72072.4 29633.3 moveto
71959.9 29577.1 lineto
71734.9 29577.1 lineto
71622.5 29633.3 lineto
71566.2 29745.8 lineto
71566.2 30195.7 lineto
71622.5 30308.2 lineto
71734.9 30364.5 lineto
71959.9 30364.5 lineto
72072.4 30308.2 lineto
72128.6 30195.7 lineto
72128.6 30083.2 lineto
71566.2 29970.8 lineto
stroke
newpath
72578.6 29633.3 moveto
72691.1 29577.1 lineto
72916 29577.1 lineto
73028.5 29633.3 lineto
73084.8 29745.8 lineto
73084.8 29802 lineto
73028.5 29914.5 lineto
72916 29970.8 lineto
72747.3 29970.8 lineto
72634.8 30027 lineto
72578.6 30139.5 lineto
72578.6 30195.7 lineto
72634.8 30308.2 lineto
72747.3 30364.5 lineto
72916 30364.5 lineto
73028.5 30308.2 lineto
stroke
newpath
73478.5 29127.1 moveto
73534.7 29183.4 lineto
73647.2 29352.1 lineto
73703.5 29464.6 lineto
73759.7 29633.3 lineto
73815.9 29914.5 lineto
73815.9 30139.5 lineto
73759.7 30420.7 lineto
73703.5 30589.4 lineto
73647.2 30701.9 lineto
73534.7 30870.7 lineto
73478.5 30926.9 lineto
stroke
newpath
47897.9 28447.5 moveto
47897.9 28657.2 lineto
47688.3 28657.2 lineto
47688.3 28447.5 lineto
47897.9 28447.5 lineto
poly0
0 0 0 setrgbcolor
0 0 0 setrgbcolor
newpath
49294 29199.1 moveto
49406.5 29199.1 lineto
49519 29142.9 lineto
49575.2 29086.6 lineto
49631.5 28974.1 lineto
49687.7 28749.2 lineto
49687.7 28468 lineto
49631.5 28243 lineto
49575.2 28130.5 lineto
49519 28074.2 lineto
49406.5 28018 lineto
49294 28018 lineto
49181.5 28074.2 lineto
49125.3 28130.5 lineto
49069 28243 lineto
49012.8 28468 lineto
49012.8 28749.2 lineto
49069 28974.1 lineto
49125.3 29086.6 lineto
49181.5 29142.9 lineto
49294 29199.1 lineto
stroke
newpath
50193.9 28130.5 moveto
50250.1 28074.2 lineto
50193.9 28018 lineto
50137.6 28074.2 lineto
50193.9 28130.5 lineto
50193.9 28018 lineto
stroke
newpath
50643.8 29199.1 moveto
51431.2 29199.1 lineto
50925.1 28018 lineto
stroke
newpath
52443.6 29199.1 moveto
51881.2 29199.1 lineto
51824.9 28636.7 lineto
51881.2 28692.9 lineto
51993.7 28749.2 lineto
52274.9 28749.2 lineto
52387.4 28692.9 lineto
52443.6 28636.7 lineto
52499.9 28524.2 lineto
52499.9 28243 lineto
52443.6 28130.5 lineto
52387.4 28074.2 lineto
52274.9 28018 lineto
51993.7 28018 lineto
51881.2 28074.2 lineto
51824.9 28130.5 lineto
stroke
newpath
53006 28018 moveto
53006 28805.4 lineto
stroke
newpath
53006 28692.9 moveto
53062.3 28749.2 lineto
53174.8 28805.4 lineto
53343.5 28805.4 lineto
53456 28749.2 lineto
53512.2 28636.7 lineto
53512.2 28018 lineto
stroke
newpath
53512.2 28636.7 moveto
53568.5 28749.2 lineto
53681 28805.4 lineto
53849.7 28805.4 lineto
53962.2 28749.2 lineto
54018.4 28636.7 lineto
54018.4 28018 lineto
stroke
newpath
54580.8 28018 moveto
54580.8 28805.4 lineto
stroke
newpath
54580.8 28692.9 moveto
54637.1 28749.2 lineto
54749.6 28805.4 lineto
54918.3 28805.4 lineto
55030.8 28749.2 lineto
55087 28636.7 lineto
55087 28018 lineto
stroke
newpath
55087 28636.7 moveto
55143.3 28749.2 lineto
55255.8 28805.4 lineto
55424.5 28805.4 lineto
55537 28749.2 lineto
55593.2 28636.7 lineto
55593.2 28018 lineto
stroke
newpath
57899.2 29255.4 moveto
56886.8 27736.8 lineto
stroke
newpath
59417.7 29199.1 moveto
59530.2 29199.1 lineto
59642.7 29142.9 lineto
59699 29086.6 lineto
59755.2 28974.1 lineto
59811.4 28749.2 lineto
59811.4 28468 lineto
59755.2 28243 lineto
59699 28130.5 lineto
59642.7 28074.2 lineto
59530.2 28018 lineto
59417.7 28018 lineto
59305.3 28074.2 lineto
59249 28130.5 lineto
59192.8 28243 lineto
59136.5 28468 lineto
59136.5 28749.2 lineto
59192.8 28974.1 lineto
59249 29086.6 lineto
59305.3 29142.9 lineto
59417.7 29199.1 lineto
stroke
newpath
60317.6 28130.5 moveto
60373.9 28074.2 lineto
60317.6 28018 lineto
60261.4 28074.2 lineto
60317.6 28130.5 lineto
60317.6 28018 lineto
stroke
newpath
61105 29199.1 moveto
61217.5 29199.1 lineto
61330 29142.9 lineto
61386.2 29086.6 lineto
61442.5 28974.1 lineto
61498.7 28749.2 lineto
61498.7 28468 lineto
61442.5 28243 lineto
61386.2 28130.5 lineto
61330 28074.2 lineto
61217.5 28018 lineto
61105 28018 lineto
60992.5 28074.2 lineto
60936.3 28130.5 lineto
60880.1 28243 lineto
60823.8 28468 lineto
60823.8 28749.2 lineto
60880.1 28974.1 lineto
60936.3 29086.6 lineto
60992.5 29142.9 lineto
61105 29199.1 lineto
stroke
newpath
61892.4 29199.1 moveto
62623.6 29199.1 lineto
62229.9 28749.2 lineto
62398.6 28749.2 lineto
62511.1 28692.9 lineto
62567.3 28636.7 lineto
62623.6 28524.2 lineto
62623.6 28243 lineto
62567.3 28130.5 lineto
62511.1 28074.2 lineto
62398.6 28018 lineto
62061.2 28018 lineto
61948.7 28074.2 lineto
61892.4 28130.5 lineto
stroke
newpath
63354.7 29199.1 moveto
63467.2 29199.1 lineto
63579.7 29142.9 lineto
63636 29086.6 lineto
63692.2 28974.1 lineto
63748.4 28749.2 lineto
63748.4 28468 lineto
63692.2 28243 lineto
63636 28130.5 lineto
63579.7 28074.2 lineto
63467.2 28018 lineto
63354.7 28018 lineto
63242.3 28074.2 lineto
63186 28130.5 lineto
63129.8 28243 lineto
63073.5 28468 lineto
63073.5 28749.2 lineto
63129.8 28974.1 lineto
63186 29086.6 lineto
63242.3 29142.9 lineto
63354.7 29199.1 lineto
stroke
newpath
64198.4 29199.1 moveto
64198.4 28974.1 lineto
stroke
newpath
64648.3 29199.1 moveto
64648.3 28974.1 lineto
stroke
newpath
66391.9 27568.1 moveto
66335.6 27624.3 lineto
66223.1 27793 lineto
66166.9 27905.5 lineto
66110.7 28074.2 lineto
66054.4 28355.5 lineto
66054.4 28580.4 lineto
66110.7 28861.7 lineto
66166.9 29030.4 lineto
66223.1 29142.9 lineto
66335.6 29311.6 lineto
66391.9 29367.8 lineto
stroke
newpath
66785.6 29086.6 moveto
66841.8 29142.9 lineto
66954.3 29199.1 lineto
67235.5 29199.1 lineto
67348 29142.9 lineto
67404.2 29086.6 lineto
67460.5 28974.1 lineto
67460.5 28861.7 lineto
67404.2 28692.9 lineto
66729.3 28018 lineto
67460.5 28018 lineto
stroke
newpath
68866.6 28018 moveto
68866.6 29199.1 lineto
stroke
newpath
69372.7 28018 moveto
69372.7 28636.7 lineto
69316.5 28749.2 lineto
69204 28805.4 lineto
69035.3 28805.4 lineto
68922.8 28749.2 lineto
68866.6 28692.9 lineto
stroke
newpath
70103.9 28018 moveto
69991.4 28074.2 lineto
69935.2 28130.5 lineto
69878.9 28243 lineto
69878.9 28580.4 lineto
69935.2 28692.9 lineto
69991.4 28749.2 lineto
70103.9 28805.4 lineto
70272.6 28805.4 lineto
70385.1 28749.2 lineto
70441.4 28692.9 lineto
70497.6 28580.4 lineto
70497.6 28243 lineto
70441.4 28130.5 lineto
70385.1 28074.2 lineto
70272.6 28018 lineto
70103.9 28018 lineto
stroke
newpath
71172.5 28018 moveto
71060 28074.2 lineto
71003.8 28186.7 lineto
71003.8 29199.1 lineto
stroke
newpath
72072.4 28074.2 moveto
71959.9 28018 lineto
71734.9 28018 lineto
71622.5 28074.2 lineto
71566.2 28186.7 lineto
71566.2 28636.7 lineto
71622.5 28749.2 lineto
71734.9 28805.4 lineto
71959.9 28805.4 lineto
72072.4 28749.2 lineto
72128.6 28636.7 lineto
72128.6 28524.2 lineto
71566.2 28411.7 lineto
stroke
newpath
72578.6 28074.2 moveto
72691.1 28018 lineto
72916 28018 lineto
73028.5 28074.2 lineto
73084.8 28186.7 lineto
73084.8 28243 lineto
73028.5 28355.5 lineto
72916 28411.7 lineto
72747.3 28411.7 lineto
72634.8 28468 lineto
72578.6 28580.4 lineto
72578.6 28636.7 lineto
72634.8 28749.2 lineto
72747.3 28805.4 lineto
72916 28805.4 lineto
73028.5 28749.2 lineto
stroke
newpath
73478.5 27568.1 moveto
73534.7 27624.3 lineto
73647.2 27793 lineto
73703.5 27905.5 lineto
73759.7 28074.2 lineto
73815.9 28355.5 lineto
73815.9 28580.4 lineto
73759.7 28861.7 lineto
73703.5 29030.4 lineto
73647.2 29142.9 lineto
73534.7 29311.6 lineto
73478.5 29367.8 lineto
stroke
newpath
47790.7 26842.6 moveto
47941.4 26993.3 lineto
47790.7 27143.9 lineto
47640.1 26993.3 lineto
47790.7 26842.6 lineto
poly0
0 0 0 setrgbcolor
0 0 0 setrgbcolor
newpath
49294 27640.1 moveto
49406.5 27640.1 lineto
49519 27583.8 lineto
49575.2 27527.6 lineto
49631.5 27415.1 lineto
49687.7 27190.1 lineto
49687.7 26908.9 lineto
49631.5 26683.9 lineto
49575.2 26571.4 lineto
49519 26515.2 lineto
49406.5 26459 lineto
49294 26459 lineto
49181.5 26515.2 lineto
49125.3 26571.4 lineto
49069 26683.9 lineto
49012.8 26908.9 lineto
49012.8 27190.1 lineto
49069 27415.1 lineto
49125.3 27527.6 lineto
49181.5 27583.8 lineto
49294 27640.1 lineto
stroke
newpath
50193.9 26571.4 moveto
50250.1 26515.2 lineto
50193.9 26459 lineto
50137.6 26515.2 lineto
50193.9 26571.4 lineto
50193.9 26459 lineto
stroke
newpath
50643.8 27640.1 moveto
51431.2 27640.1 lineto
50925.1 26459 lineto
stroke
newpath
52387.4 27640.1 moveto
52162.4 27640.1 lineto
52049.9 27583.8 lineto
51993.7 27527.6 lineto
51881.2 27358.8 lineto
51824.9 27133.9 lineto
51824.9 26683.9 lineto
51881.2 26571.4 lineto
51937.4 26515.2 lineto
52049.9 26459 lineto
52274.9 26459 lineto
52387.4 26515.2 lineto
52443.6 26571.4 lineto
52499.9 26683.9 lineto
52499.9 26965.1 lineto
52443.6 27077.6 lineto
52387.4 27133.9 lineto
52274.9 27190.1 lineto
52049.9 27190.1 lineto
51937.4 27133.9 lineto
51881.2 27077.6 lineto
51824.9 26965.1 lineto
stroke
newpath
53006 26459 moveto
53006 27246.4 lineto
stroke
newpath
53006 27133.9 moveto
53062.3 27190.1 lineto
53174.8 27246.4 lineto
53343.5 27246.4 lineto
53456 27190.1 lineto
53512.2 27077.6 lineto
53512.2 26459 lineto
stroke
newpath
53512.2 27077.6 moveto
53568.5 27190.1 lineto
53681 27246.4 lineto
53849.7 27246.4 lineto
53962.2 27190.1 lineto
54018.4 27077.6 lineto
54018.4 26459 lineto
stroke
newpath
54580.8 26459 moveto
54580.8 27246.4 lineto
stroke
newpath
54580.8 27133.9 moveto
54637.1 27190.1 lineto
54749.6 27246.4 lineto
54918.3 27246.4 lineto
55030.8 27190.1 lineto
55087 27077.6 lineto
55087 26459 lineto
stroke
newpath
55087 27077.6 moveto
55143.3 27190.1 lineto
55255.8 27246.4 lineto
55424.5 27246.4 lineto
55537 27190.1 lineto
55593.2 27077.6 lineto
55593.2 26459 lineto
stroke
newpath
57899.2 27696.3 moveto
56886.8 26177.7 lineto
stroke
newpath
59417.7 27640.1 moveto
59530.2 27640.1 lineto
59642.7 27583.8 lineto
59699 27527.6 lineto
59755.2 27415.1 lineto
59811.4 27190.1 lineto
59811.4 26908.9 lineto
59755.2 26683.9 lineto
59699 26571.4 lineto
59642.7 26515.2 lineto
59530.2 26459 lineto
59417.7 26459 lineto
59305.3 26515.2 lineto
59249 26571.4 lineto
59192.8 26683.9 lineto
59136.5 26908.9 lineto
59136.5 27190.1 lineto
59192.8 27415.1 lineto
59249 27527.6 lineto
59305.3 27583.8 lineto
59417.7 27640.1 lineto
stroke
newpath
60317.6 26571.4 moveto
60373.9 26515.2 lineto
60317.6 26459 lineto
60261.4 26515.2 lineto
60317.6 26571.4 lineto
60317.6 26459 lineto
stroke
newpath
61105 27640.1 moveto
61217.5 27640.1 lineto
61330 27583.8 lineto
61386.2 27527.6 lineto
61442.5 27415.1 lineto
61498.7 27190.1 lineto
61498.7 26908.9 lineto
61442.5 26683.9 lineto
61386.2 26571.4 lineto
61330 26515.2 lineto
61217.5 26459 lineto
61105 26459 lineto
60992.5 26515.2 lineto
60936.3 26571.4 lineto
60880.1 26683.9 lineto
60823.8 26908.9 lineto
60823.8 27190.1 lineto
60880.1 27415.1 lineto
60936.3 27527.6 lineto
60992.5 27583.8 lineto
61105 27640.1 lineto
stroke
newpath
61892.4 27640.1 moveto
62623.6 27640.1 lineto
62229.9 27190.1 lineto
62398.6 27190.1 lineto
62511.1 27133.9 lineto
62567.3 27077.6 lineto
62623.6 26965.1 lineto
62623.6 26683.9 lineto
62567.3 26571.4 lineto
62511.1 26515.2 lineto
62398.6 26459 lineto
62061.2 26459 lineto
61948.7 26515.2 lineto
61892.4 26571.4 lineto
stroke
newpath
63354.7 27640.1 moveto
63467.2 27640.1 lineto
63579.7 27583.8 lineto
63636 27527.6 lineto
63692.2 27415.1 lineto
63748.4 27190.1 lineto
63748.4 26908.9 lineto
63692.2 26683.9 lineto
63636 26571.4 lineto
63579.7 26515.2 lineto
63467.2 26459 lineto
63354.7 26459 lineto
63242.3 26515.2 lineto
63186 26571.4 lineto
63129.8 26683.9 lineto
63073.5 26908.9 lineto
63073.5 27190.1 lineto
63129.8 27415.1 lineto
63186 27527.6 lineto
63242.3 27583.8 lineto
63354.7 27640.1 lineto
stroke
newpath
64198.4 27640.1 moveto
64198.4 27415.1 lineto
stroke
newpath
64648.3 27640.1 moveto
64648.3 27415.1 lineto
stroke
newpath
66391.9 26009 moveto
66335.6 26065.3 lineto
66223.1 26234 lineto
66166.9 26346.5 lineto
66110.7 26515.2 lineto
66054.4 26796.4 lineto
66054.4 27021.4 lineto
66110.7 27302.6 lineto
66166.9 27471.3 lineto
66223.1 27583.8 lineto
66335.6 27752.5 lineto
66391.9 27808.8 lineto
stroke
newpath
67460.5 26459 moveto
66785.6 26459 lineto
stroke
newpath
67123 26459 moveto
67123 27640.1 lineto
67010.5 27471.3 lineto
66898.1 27358.8 lineto
66785.6 27302.6 lineto
stroke
newpath
68866.6 26459 moveto
68866.6 27640.1 lineto
stroke
newpath
69372.7 26459 moveto
69372.7 27077.6 lineto
69316.5 27190.1 lineto
69204 27246.4 lineto
69035.3 27246.4 lineto
68922.8 27190.1 lineto
68866.6 27133.9 lineto
stroke
newpath
70103.9 26459 moveto
69991.4 26515.2 lineto
69935.2 26571.4 lineto
69878.9 26683.9 lineto
69878.9 27021.4 lineto
69935.2 27133.9 lineto
69991.4 27190.1 lineto
70103.9 27246.4 lineto
70272.6 27246.4 lineto
70385.1 27190.1 lineto
70441.4 27133.9 lineto
70497.6 27021.4 lineto
70497.6 26683.9 lineto
70441.4 26571.4 lineto
70385.1 26515.2 lineto
70272.6 26459 lineto
70103.9 26459 lineto
stroke
newpath
71172.5 26459 moveto
71060 26515.2 lineto
71003.8 26627.7 lineto
71003.8 27640.1 lineto
stroke
newpath
72072.4 26515.2 moveto
71959.9 26459 lineto
71734.9 26459 lineto
71622.5 26515.2 lineto
71566.2 26627.7 lineto
71566.2 27077.6 lineto
71622.5 27190.1 lineto
71734.9 27246.4 lineto
71959.9 27246.4 lineto
72072.4 27190.1 lineto
72128.6 27077.6 lineto
72128.6 26965.1 lineto
71566.2 26852.7 lineto
stroke
newpath
72522.3 26009 moveto
72578.6 26065.3 lineto
72691.1 26234 lineto
72747.3 26346.5 lineto
72803.6 26515.2 lineto
72859.8 26796.4 lineto
72859.8 27021.4 lineto
72803.6 27302.6 lineto
72747.3 27471.3 lineto
72691.1 27583.8 lineto
72578.6 27752.5 lineto
72522.3 27808.8 lineto
stroke
newpath
47585.5 25612.1 moveto
47941.4 25256.3 lineto
stroke
newpath
47941.4 25612.1 moveto
47585.5 25256.3 lineto
stroke
47763.5 25434.2 177.911 cir0
0 0 0 setrgbcolor
0 0 0 setrgbcolor
newpath
49294 26081 moveto
49406.5 26081 lineto
49519 26024.8 lineto
49575.2 25968.5 lineto
49631.5 25856 lineto
49687.7 25631.1 lineto
49687.7 25349.8 lineto
49631.5 25124.9 lineto
49575.2 25012.4 lineto
49519 24956.1 lineto
49406.5 24899.9 lineto
49294 24899.9 lineto
49181.5 24956.1 lineto
49125.3 25012.4 lineto
49069 25124.9 lineto
49012.8 25349.8 lineto
49012.8 25631.1 lineto
49069 25856 lineto
49125.3 25968.5 lineto
49181.5 26024.8 lineto
49294 26081 lineto
stroke
newpath
50193.9 25012.4 moveto
50250.1 24956.1 lineto
50193.9 24899.9 lineto
50137.6 24956.1 lineto
50193.9 25012.4 lineto
50193.9 24899.9 lineto
stroke
newpath
50812.6 24899.9 moveto
51037.5 24899.9 lineto
51150 24956.1 lineto
51206.3 25012.4 lineto
51318.8 25181.1 lineto
51375 25406.1 lineto
51375 25856 lineto
51318.8 25968.5 lineto
51262.5 26024.8 lineto
51150 26081 lineto
50925.1 26081 lineto
50812.6 26024.8 lineto
50756.3 25968.5 lineto
50700.1 25856 lineto
50700.1 25574.8 lineto
50756.3 25462.3 lineto
50812.6 25406.1 lineto
50925.1 25349.8 lineto
51150 25349.8 lineto
51262.5 25406.1 lineto
51318.8 25462.3 lineto
51375 25574.8 lineto
stroke
newpath
52106.2 26081 moveto
52218.6 26081 lineto
52331.1 26024.8 lineto
52387.4 25968.5 lineto
52443.6 25856 lineto
52499.9 25631.1 lineto
52499.9 25349.8 lineto
52443.6 25124.9 lineto
52387.4 25012.4 lineto
52331.1 24956.1 lineto
52218.6 24899.9 lineto
52106.2 24899.9 lineto
51993.7 24956.1 lineto
51937.4 25012.4 lineto
51881.2 25124.9 lineto
51824.9 25349.8 lineto
51824.9 25631.1 lineto
51881.2 25856 lineto
51937.4 25968.5 lineto
51993.7 26024.8 lineto
52106.2 26081 lineto
stroke
newpath
53006 24899.9 moveto
53006 25687.3 lineto
stroke
newpath
53006 25574.8 moveto
53062.3 25631.1 lineto
53174.8 25687.3 lineto
53343.5 25687.3 lineto
53456 25631.1 lineto
53512.2 25518.6 lineto
53512.2 24899.9 lineto
stroke
newpath
53512.2 25518.6 moveto
53568.5 25631.1 lineto
53681 25687.3 lineto
53849.7 25687.3 lineto
53962.2 25631.1 lineto
54018.4 25518.6 lineto
54018.4 24899.9 lineto
stroke
newpath
54580.8 24899.9 moveto
54580.8 25687.3 lineto
stroke
newpath
54580.8 25574.8 moveto
54637.1 25631.1 lineto
54749.6 25687.3 lineto
54918.3 25687.3 lineto
55030.8 25631.1 lineto
55087 25518.6 lineto
55087 24899.9 lineto
stroke
newpath
55087 25518.6 moveto
55143.3 25631.1 lineto
55255.8 25687.3 lineto
55424.5 25687.3 lineto
55537 25631.1 lineto
55593.2 25518.6 lineto
55593.2 24899.9 lineto
stroke
newpath
57899.2 26137.2 moveto
56886.8 24618.7 lineto
stroke
newpath
59417.7 26081 moveto
59530.2 26081 lineto
59642.7 26024.8 lineto
59699 25968.5 lineto
59755.2 25856 lineto
59811.4 25631.1 lineto
59811.4 25349.8 lineto
59755.2 25124.9 lineto
59699 25012.4 lineto
59642.7 24956.1 lineto
59530.2 24899.9 lineto
59417.7 24899.9 lineto
59305.3 24956.1 lineto
59249 25012.4 lineto
59192.8 25124.9 lineto
59136.5 25349.8 lineto
59136.5 25631.1 lineto
59192.8 25856 lineto
59249 25968.5 lineto
59305.3 26024.8 lineto
59417.7 26081 lineto
stroke
newpath
60317.6 25012.4 moveto
60373.9 24956.1 lineto
60317.6 24899.9 lineto
60261.4 24956.1 lineto
60317.6 25012.4 lineto
60317.6 24899.9 lineto
stroke
newpath
61105 26081 moveto
61217.5 26081 lineto
61330 26024.8 lineto
61386.2 25968.5 lineto
61442.5 25856 lineto
61498.7 25631.1 lineto
61498.7 25349.8 lineto
61442.5 25124.9 lineto
61386.2 25012.4 lineto
61330 24956.1 lineto
61217.5 24899.9 lineto
61105 24899.9 lineto
60992.5 24956.1 lineto
60936.3 25012.4 lineto
60880.1 25124.9 lineto
60823.8 25349.8 lineto
60823.8 25631.1 lineto
60880.1 25856 lineto
60936.3 25968.5 lineto
60992.5 26024.8 lineto
61105 26081 lineto
stroke
newpath
61892.4 26081 moveto
62623.6 26081 lineto
62229.9 25631.1 lineto
62398.6 25631.1 lineto
62511.1 25574.8 lineto
62567.3 25518.6 lineto
62623.6 25406.1 lineto
62623.6 25124.9 lineto
62567.3 25012.4 lineto
62511.1 24956.1 lineto
62398.6 24899.9 lineto
62061.2 24899.9 lineto
61948.7 24956.1 lineto
61892.4 25012.4 lineto
stroke
newpath
63692.2 26081 moveto
63129.8 26081 lineto
63073.5 25518.6 lineto
63129.8 25574.8 lineto
63242.3 25631.1 lineto
63523.5 25631.1 lineto
63636 25574.8 lineto
63692.2 25518.6 lineto
63748.4 25406.1 lineto
63748.4 25124.9 lineto
63692.2 25012.4 lineto
63636 24956.1 lineto
63523.5 24899.9 lineto
63242.3 24899.9 lineto
63129.8 24956.1 lineto
63073.5 25012.4 lineto
stroke
newpath
64198.4 26081 moveto
64198.4 25856 lineto
stroke
newpath
64648.3 26081 moveto
64648.3 25856 lineto
stroke
newpath
66391.9 24450 moveto
66335.6 24506.2 lineto
66223.1 24674.9 lineto
66166.9 24787.4 lineto
66110.7 24956.1 lineto
66054.4 25237.4 lineto
66054.4 25462.3 lineto
66110.7 25743.5 lineto
66166.9 25912.3 lineto
66223.1 26024.8 lineto
66335.6 26193.5 lineto
66391.9 26249.7 lineto
stroke
newpath
67010.5 25574.8 moveto
66898.1 25631.1 lineto
66841.8 25687.3 lineto
66785.6 25799.8 lineto
66785.6 25856 lineto
66841.8 25968.5 lineto
66898.1 26024.8 lineto
67010.5 26081 lineto
67235.5 26081 lineto
67348 26024.8 lineto
67404.2 25968.5 lineto
67460.5 25856 lineto
67460.5 25799.8 lineto
67404.2 25687.3 lineto
67348 25631.1 lineto
67235.5 25574.8 lineto
67010.5 25574.8 lineto
66898.1 25518.6 lineto
66841.8 25462.3 lineto
66785.6 25349.8 lineto
66785.6 25124.9 lineto
66841.8 25012.4 lineto
66898.1 24956.1 lineto
67010.5 24899.9 lineto
67235.5 24899.9 lineto
67348 24956.1 lineto
67404.2 25012.4 lineto
67460.5 25124.9 lineto
67460.5 25349.8 lineto
67404.2 25462.3 lineto
67348 25518.6 lineto
67235.5 25574.8 lineto
stroke
newpath
68866.6 24899.9 moveto
68866.6 26081 lineto
stroke
newpath
69372.7 24899.9 moveto
69372.7 25518.6 lineto
69316.5 25631.1 lineto
69204 25687.3 lineto
69035.3 25687.3 lineto
68922.8 25631.1 lineto
68866.6 25574.8 lineto
stroke
newpath
70103.9 24899.9 moveto
69991.4 24956.1 lineto
69935.2 25012.4 lineto
69878.9 25124.9 lineto
69878.9 25462.3 lineto
69935.2 25574.8 lineto
69991.4 25631.1 lineto
70103.9 25687.3 lineto
70272.6 25687.3 lineto
70385.1 25631.1 lineto
70441.4 25574.8 lineto
70497.6 25462.3 lineto
70497.6 25124.9 lineto
70441.4 25012.4 lineto
70385.1 24956.1 lineto
70272.6 24899.9 lineto
70103.9 24899.9 lineto
stroke
newpath
71172.5 24899.9 moveto
71060 24956.1 lineto
71003.8 25068.6 lineto
71003.8 26081 lineto
stroke
newpath
72072.4 24956.1 moveto
71959.9 24899.9 lineto
71734.9 24899.9 lineto
71622.5 24956.1 lineto
71566.2 25068.6 lineto
71566.2 25518.6 lineto
71622.5 25631.1 lineto
71734.9 25687.3 lineto
71959.9 25687.3 lineto
72072.4 25631.1 lineto
72128.6 25518.6 lineto
72128.6 25406.1 lineto
71566.2 25293.6 lineto
stroke
newpath
72578.6 24956.1 moveto
72691.1 24899.9 lineto
72916 24899.9 lineto
73028.5 24956.1 lineto
73084.8 25068.6 lineto
73084.8 25124.9 lineto
73028.5 25237.4 lineto
72916 25293.6 lineto
72747.3 25293.6 lineto
72634.8 25349.8 lineto
72578.6 25462.3 lineto
72578.6 25518.6 lineto
72634.8 25631.1 lineto
72747.3 25687.3 lineto
72916 25687.3 lineto
73028.5 25631.1 lineto
stroke
newpath
73478.5 24450 moveto
73534.7 24506.2 lineto
73647.2 24674.9 lineto
73703.5 24787.4 lineto
73759.7 24956.1 lineto
73815.9 25237.4 lineto
73815.9 25462.3 lineto
73759.7 25743.5 lineto
73703.5 25912.3 lineto
73647.2 26024.8 lineto
73534.7 26193.5 lineto
73478.5 26249.7 lineto
stroke
newpath
47546 24072.8 moveto
47941.4 23677.5 lineto
stroke
newpath
47941.4 24072.8 moveto
47546 23677.5 lineto
stroke
newpath
47743.7 24072.8 moveto
47743.7 23677.5 lineto
stroke
newpath
47546 23875.1 moveto
47941.4 23875.1 lineto
stroke
0 0 0 setrgbcolor
0 0 0 setrgbcolor
newpath
49687.7 23340.8 moveto
49012.8 23340.8 lineto
stroke
newpath
49350.2 23340.8 moveto
49350.2 24521.9 lineto
49237.8 24353.2 lineto
49125.3 24240.7 lineto
49012.8 24184.5 lineto
stroke
newpath
50193.9 23453.3 moveto
50250.1 23397.1 lineto
50193.9 23340.8 lineto
50137.6 23397.1 lineto
50193.9 23453.3 lineto
50193.9 23340.8 lineto
stroke
newpath
50981.3 24521.9 moveto
51093.8 24521.9 lineto
51206.3 24465.7 lineto
51262.5 24409.5 lineto
51318.8 24297 lineto
51375 24072 lineto
51375 23790.8 lineto
51318.8 23565.8 lineto
51262.5 23453.3 lineto
51206.3 23397.1 lineto
51093.8 23340.8 lineto
50981.3 23340.8 lineto
50868.8 23397.1 lineto
50812.6 23453.3 lineto
50756.3 23565.8 lineto
50700.1 23790.8 lineto
50700.1 24072 lineto
50756.3 24297 lineto
50812.6 24409.5 lineto
50868.8 24465.7 lineto
50981.3 24521.9 lineto
stroke
newpath
52106.2 24521.9 moveto
52218.6 24521.9 lineto
52331.1 24465.7 lineto
52387.4 24409.5 lineto
52443.6 24297 lineto
52499.9 24072 lineto
52499.9 23790.8 lineto
52443.6 23565.8 lineto
52387.4 23453.3 lineto
52331.1 23397.1 lineto
52218.6 23340.8 lineto
52106.2 23340.8 lineto
51993.7 23397.1 lineto
51937.4 23453.3 lineto
51881.2 23565.8 lineto
51824.9 23790.8 lineto
51824.9 24072 lineto
51881.2 24297 lineto
51937.4 24409.5 lineto
51993.7 24465.7 lineto
52106.2 24521.9 lineto
stroke
newpath
53006 23340.8 moveto
53006 24128.2 lineto
stroke
newpath
53006 24015.8 moveto
53062.3 24072 lineto
53174.8 24128.2 lineto
53343.5 24128.2 lineto
53456 24072 lineto
53512.2 23959.5 lineto
53512.2 23340.8 lineto
stroke
newpath
53512.2 23959.5 moveto
53568.5 24072 lineto
53681 24128.2 lineto
53849.7 24128.2 lineto
53962.2 24072 lineto
54018.4 23959.5 lineto
54018.4 23340.8 lineto
stroke
newpath
54580.8 23340.8 moveto
54580.8 24128.2 lineto
stroke
newpath
54580.8 24015.8 moveto
54637.1 24072 lineto
54749.6 24128.2 lineto
54918.3 24128.2 lineto
55030.8 24072 lineto
55087 23959.5 lineto
55087 23340.8 lineto
stroke
newpath
55087 23959.5 moveto
55143.3 24072 lineto
55255.8 24128.2 lineto
55424.5 24128.2 lineto
55537 24072 lineto
55593.2 23959.5 lineto
55593.2 23340.8 lineto
stroke
newpath
57899.2 24578.2 moveto
56886.8 23059.6 lineto
stroke
newpath
59417.7 24521.9 moveto
59530.2 24521.9 lineto
59642.7 24465.7 lineto
59699 24409.5 lineto
59755.2 24297 lineto
59811.4 24072 lineto
59811.4 23790.8 lineto
59755.2 23565.8 lineto
59699 23453.3 lineto
59642.7 23397.1 lineto
59530.2 23340.8 lineto
59417.7 23340.8 lineto
59305.3 23397.1 lineto
59249 23453.3 lineto
59192.8 23565.8 lineto
59136.5 23790.8 lineto
59136.5 24072 lineto
59192.8 24297 lineto
59249 24409.5 lineto
59305.3 24465.7 lineto
59417.7 24521.9 lineto
stroke
newpath
60317.6 23453.3 moveto
60373.9 23397.1 lineto
60317.6 23340.8 lineto
60261.4 23397.1 lineto
60317.6 23453.3 lineto
60317.6 23340.8 lineto
stroke
newpath
61105 24521.9 moveto
61217.5 24521.9 lineto
61330 24465.7 lineto
61386.2 24409.5 lineto
61442.5 24297 lineto
61498.7 24072 lineto
61498.7 23790.8 lineto
61442.5 23565.8 lineto
61386.2 23453.3 lineto
61330 23397.1 lineto
61217.5 23340.8 lineto
61105 23340.8 lineto
60992.5 23397.1 lineto
60936.3 23453.3 lineto
60880.1 23565.8 lineto
60823.8 23790.8 lineto
60823.8 24072 lineto
60880.1 24297 lineto
60936.3 24409.5 lineto
60992.5 24465.7 lineto
61105 24521.9 lineto
stroke
newpath
61892.4 24521.9 moveto
62623.6 24521.9 lineto
62229.9 24072 lineto
62398.6 24072 lineto
62511.1 24015.8 lineto
62567.3 23959.5 lineto
62623.6 23847 lineto
62623.6 23565.8 lineto
62567.3 23453.3 lineto
62511.1 23397.1 lineto
62398.6 23340.8 lineto
62061.2 23340.8 lineto
61948.7 23397.1 lineto
61892.4 23453.3 lineto
stroke
newpath
63186 23340.8 moveto
63411 23340.8 lineto
63523.5 23397.1 lineto
63579.7 23453.3 lineto
63692.2 23622.1 lineto
63748.4 23847 lineto
63748.4 24297 lineto
63692.2 24409.5 lineto
63636 24465.7 lineto
63523.5 24521.9 lineto
63298.5 24521.9 lineto
63186 24465.7 lineto
63129.8 24409.5 lineto
63073.5 24297 lineto
63073.5 24015.8 lineto
63129.8 23903.3 lineto
63186 23847 lineto
63298.5 23790.8 lineto
63523.5 23790.8 lineto
63636 23847 lineto
63692.2 23903.3 lineto
63748.4 24015.8 lineto
stroke
newpath
64198.4 24521.9 moveto
64198.4 24297 lineto
stroke
newpath
64648.3 24521.9 moveto
64648.3 24297 lineto
stroke
newpath
66391.9 22890.9 moveto
66335.6 22947.1 lineto
66223.1 23115.9 lineto
66166.9 23228.4 lineto
66110.7 23397.1 lineto
66054.4 23678.3 lineto
66054.4 23903.3 lineto
66110.7 24184.5 lineto
66166.9 24353.2 lineto
66223.1 24465.7 lineto
66335.6 24634.4 lineto
66391.9 24690.7 lineto
stroke
newpath
66729.3 24521.9 moveto
67460.5 24521.9 lineto
67066.8 24072 lineto
67235.5 24072 lineto
67348 24015.8 lineto
67404.2 23959.5 lineto
67460.5 23847 lineto
67460.5 23565.8 lineto
67404.2 23453.3 lineto
67348 23397.1 lineto
67235.5 23340.8 lineto
66898.1 23340.8 lineto
66785.6 23397.1 lineto
66729.3 23453.3 lineto
stroke
newpath
68472.9 24128.2 moveto
68472.9 23340.8 lineto
stroke
newpath
68191.6 24578.2 moveto
67910.4 23734.5 lineto
68641.6 23734.5 lineto
stroke
newpath
69991.4 23340.8 moveto
69991.4 24521.9 lineto
stroke
newpath
70497.6 23340.8 moveto
70497.6 23959.5 lineto
70441.4 24072 lineto
70328.9 24128.2 lineto
70160.1 24128.2 lineto
70047.7 24072 lineto
69991.4 24015.8 lineto
stroke
newpath
71228.8 23340.8 moveto
71116.3 23397.1 lineto
71060 23453.3 lineto
71003.8 23565.8 lineto
71003.8 23903.3 lineto
71060 24015.8 lineto
71116.3 24072 lineto
71228.8 24128.2 lineto
71397.5 24128.2 lineto
71510 24072 lineto
71566.2 24015.8 lineto
71622.5 23903.3 lineto
71622.5 23565.8 lineto
71566.2 23453.3 lineto
71510 23397.1 lineto
71397.5 23340.8 lineto
71228.8 23340.8 lineto
stroke
newpath
72297.4 23340.8 moveto
72184.9 23397.1 lineto
72128.6 23509.6 lineto
72128.6 24521.9 lineto
stroke
newpath
73197.3 23397.1 moveto
73084.8 23340.8 lineto
72859.8 23340.8 lineto
72747.3 23397.1 lineto
72691.1 23509.6 lineto
72691.1 23959.5 lineto
72747.3 24072 lineto
72859.8 24128.2 lineto
73084.8 24128.2 lineto
73197.3 24072 lineto
73253.5 23959.5 lineto
73253.5 23847 lineto
72691.1 23734.5 lineto
stroke
newpath
73703.5 23397.1 moveto
73815.9 23340.8 lineto
74040.9 23340.8 lineto
74153.4 23397.1 lineto
74209.6 23509.6 lineto
74209.6 23565.8 lineto
74153.4 23678.3 lineto
74040.9 23734.5 lineto
73872.2 23734.5 lineto
73759.7 23790.8 lineto
73703.5 23903.3 lineto
73703.5 23959.5 lineto
73759.7 24072 lineto
73872.2 24128.2 lineto
74040.9 24128.2 lineto
74153.4 24072 lineto
stroke
newpath
75615.7 23790.8 moveto
76515.6 23790.8 lineto
stroke
newpath
76065.7 23340.8 moveto
76065.7 24240.7 lineto
stroke
newpath
77865.4 24521.9 moveto
78596.6 24521.9 lineto
78202.9 24072 lineto
78371.6 24072 lineto
78484.1 24015.8 lineto
78540.3 23959.5 lineto
78596.6 23847 lineto
78596.6 23565.8 lineto
78540.3 23453.3 lineto
78484.1 23397.1 lineto
78371.6 23340.8 lineto
78034.2 23340.8 lineto
77921.7 23397.1 lineto
77865.4 23453.3 lineto
stroke
newpath
79946.4 23397.1 moveto
80058.9 23340.8 lineto
80283.9 23340.8 lineto
80396.4 23397.1 lineto
80452.6 23509.6 lineto
80452.6 23565.8 lineto
80396.4 23678.3 lineto
80283.9 23734.5 lineto
80115.1 23734.5 lineto
80002.7 23790.8 lineto
79946.4 23903.3 lineto
79946.4 23959.5 lineto
80002.7 24072 lineto
80115.1 24128.2 lineto
80283.9 24128.2 lineto
80396.4 24072 lineto
stroke
newpath
81127.5 23340.8 moveto
81015 23397.1 lineto
80958.8 23509.6 lineto
80958.8 24521.9 lineto
stroke
newpath
81746.2 23340.8 moveto
81633.7 23397.1 lineto
81577.5 23453.3 lineto
81521.2 23565.8 lineto
81521.2 23903.3 lineto
81577.5 24015.8 lineto
81633.7 24072 lineto
81746.2 24128.2 lineto
81914.9 24128.2 lineto
82027.4 24072 lineto
82083.7 24015.8 lineto
82139.9 23903.3 lineto
82139.9 23565.8 lineto
82083.7 23453.3 lineto
82027.4 23397.1 lineto
81914.9 23340.8 lineto
81746.2 23340.8 lineto
stroke
newpath
82477.4 24128.2 moveto
82927.3 24128.2 lineto
stroke
newpath
82646.1 24521.9 moveto
82646.1 23509.6 lineto
82702.3 23397.1 lineto
82814.8 23340.8 lineto
82927.3 23340.8 lineto
stroke
newpath
83264.8 23397.1 moveto
83377.2 23340.8 lineto
83602.2 23340.8 lineto
83714.7 23397.1 lineto
83770.9 23509.6 lineto
83770.9 23565.8 lineto
83714.7 23678.3 lineto
83602.2 23734.5 lineto
83433.5 23734.5 lineto
83321 23790.8 lineto
83264.8 23903.3 lineto
83264.8 23959.5 lineto
83321 24072 lineto
83433.5 24128.2 lineto
83602.2 24128.2 lineto
83714.7 24072 lineto
stroke
newpath
84164.6 22890.9 moveto
84220.9 22947.1 lineto
84333.4 23115.9 lineto
84389.6 23228.4 lineto
84445.9 23397.1 lineto
84502.1 23678.3 lineto
84502.1 23903.3 lineto
84445.9 24184.5 lineto
84389.6 24353.2 lineto
84333.4 24465.7 lineto
84220.9 24634.4 lineto
84164.6 24690.7 lineto
stroke
newpath
47071.6 22751 moveto
47941.4 21881.2 lineto
stroke
newpath
47941.4 22751 moveto
47071.6 21881.2 lineto
stroke
newpath
47814 22008.6 moveto
47814 22623.6 lineto
47198.9 22623.6 lineto
47198.9 22008.6 lineto
47814 22008.6 lineto
poly0
0 0 0 setrgbcolor
0 0 0 setrgbcolor
newpath
49012.8 22850.4 moveto
49069 22906.6 lineto
49181.5 22962.9 lineto
49462.7 22962.9 lineto
49575.2 22906.6 lineto
49631.5 22850.4 lineto
49687.7 22737.9 lineto
49687.7 22625.4 lineto
49631.5 22456.7 lineto
48956.5 21781.8 lineto
49687.7 21781.8 lineto
stroke
newpath
50193.9 21894.3 moveto
50250.1 21838 lineto
50193.9 21781.8 lineto
50137.6 21838 lineto
50193.9 21894.3 lineto
50193.9 21781.8 lineto
stroke
newpath
50700.1 22850.4 moveto
50756.3 22906.6 lineto
50868.8 22962.9 lineto
51150 22962.9 lineto
51262.5 22906.6 lineto
51318.8 22850.4 lineto
51375 22737.9 lineto
51375 22625.4 lineto
51318.8 22456.7 lineto
50643.8 21781.8 lineto
51375 21781.8 lineto
stroke
newpath
52106.2 22962.9 moveto
52218.6 22962.9 lineto
52331.1 22906.6 lineto
52387.4 22850.4 lineto
52443.6 22737.9 lineto
52499.9 22512.9 lineto
52499.9 22231.7 lineto
52443.6 22006.8 lineto
52387.4 21894.3 lineto
52331.1 21838 lineto
52218.6 21781.8 lineto
52106.2 21781.8 lineto
51993.7 21838 lineto
51937.4 21894.3 lineto
51881.2 22006.8 lineto
51824.9 22231.7 lineto
51824.9 22512.9 lineto
51881.2 22737.9 lineto
51937.4 22850.4 lineto
51993.7 22906.6 lineto
52106.2 22962.9 lineto
stroke
newpath
53006 21781.8 moveto
53006 22569.2 lineto
stroke
newpath
53006 22456.7 moveto
53062.3 22512.9 lineto
53174.8 22569.2 lineto
53343.5 22569.2 lineto
53456 22512.9 lineto
53512.2 22400.5 lineto
53512.2 21781.8 lineto
stroke
newpath
53512.2 22400.5 moveto
53568.5 22512.9 lineto
53681 22569.2 lineto
53849.7 22569.2 lineto
53962.2 22512.9 lineto
54018.4 22400.5 lineto
54018.4 21781.8 lineto
stroke
newpath
54580.8 21781.8 moveto
54580.8 22569.2 lineto
stroke
newpath
54580.8 22456.7 moveto
54637.1 22512.9 lineto
54749.6 22569.2 lineto
54918.3 22569.2 lineto
55030.8 22512.9 lineto
55087 22400.5 lineto
55087 21781.8 lineto
stroke
newpath
55087 22400.5 moveto
55143.3 22512.9 lineto
55255.8 22569.2 lineto
55424.5 22569.2 lineto
55537 22512.9 lineto
55593.2 22400.5 lineto
55593.2 21781.8 lineto
stroke
newpath
57899.2 23019.1 moveto
56886.8 21500.6 lineto
stroke
newpath
59417.7 22962.9 moveto
59530.2 22962.9 lineto
59642.7 22906.6 lineto
59699 22850.4 lineto
59755.2 22737.9 lineto
59811.4 22512.9 lineto
59811.4 22231.7 lineto
59755.2 22006.8 lineto
59699 21894.3 lineto
59642.7 21838 lineto
59530.2 21781.8 lineto
59417.7 21781.8 lineto
59305.3 21838 lineto
59249 21894.3 lineto
59192.8 22006.8 lineto
59136.5 22231.7 lineto
59136.5 22512.9 lineto
59192.8 22737.9 lineto
59249 22850.4 lineto
59305.3 22906.6 lineto
59417.7 22962.9 lineto
stroke
newpath
60317.6 21894.3 moveto
60373.9 21838 lineto
60317.6 21781.8 lineto
60261.4 21838 lineto
60317.6 21894.3 lineto
60317.6 21781.8 lineto
stroke
newpath
61105 22962.9 moveto
61217.5 22962.9 lineto
61330 22906.6 lineto
61386.2 22850.4 lineto
61442.5 22737.9 lineto
61498.7 22512.9 lineto
61498.7 22231.7 lineto
61442.5 22006.8 lineto
61386.2 21894.3 lineto
61330 21838 lineto
61217.5 21781.8 lineto
61105 21781.8 lineto
60992.5 21838 lineto
60936.3 21894.3 lineto
60880.1 22006.8 lineto
60823.8 22231.7 lineto
60823.8 22512.9 lineto
60880.1 22737.9 lineto
60936.3 22850.4 lineto
60992.5 22906.6 lineto
61105 22962.9 lineto
stroke
newpath
62173.6 22456.7 moveto
62061.2 22512.9 lineto
62004.9 22569.2 lineto
61948.7 22681.7 lineto
61948.7 22737.9 lineto
62004.9 22850.4 lineto
62061.2 22906.6 lineto
62173.6 22962.9 lineto
62398.6 22962.9 lineto
62511.1 22906.6 lineto
62567.3 22850.4 lineto
62623.6 22737.9 lineto
62623.6 22681.7 lineto
62567.3 22569.2 lineto
62511.1 22512.9 lineto
62398.6 22456.7 lineto
62173.6 22456.7 lineto
62061.2 22400.5 lineto
62004.9 22344.2 lineto
61948.7 22231.7 lineto
61948.7 22006.8 lineto
62004.9 21894.3 lineto
62061.2 21838 lineto
62173.6 21781.8 lineto
62398.6 21781.8 lineto
62511.1 21838 lineto
62567.3 21894.3 lineto
62623.6 22006.8 lineto
62623.6 22231.7 lineto
62567.3 22344.2 lineto
62511.1 22400.5 lineto
62398.6 22456.7 lineto
stroke
newpath
63017.3 22962.9 moveto
63804.7 22962.9 lineto
63298.5 21781.8 lineto
stroke
newpath
64198.4 22962.9 moveto
64198.4 22737.9 lineto
stroke
newpath
64648.3 22962.9 moveto
64648.3 22737.9 lineto
stroke
newpath
66391.9 21331.8 moveto
66335.6 21388.1 lineto
66223.1 21556.8 lineto
66166.9 21669.3 lineto
66110.7 21838 lineto
66054.4 22119.2 lineto
66054.4 22344.2 lineto
66110.7 22625.4 lineto
66166.9 22794.2 lineto
66223.1 22906.6 lineto
66335.6 23075.4 lineto
66391.9 23131.6 lineto
stroke
newpath
66785.6 22850.4 moveto
66841.8 22906.6 lineto
66954.3 22962.9 lineto
67235.5 22962.9 lineto
67348 22906.6 lineto
67404.2 22850.4 lineto
67460.5 22737.9 lineto
67460.5 22625.4 lineto
67404.2 22456.7 lineto
66729.3 21781.8 lineto
67460.5 21781.8 lineto
stroke
newpath
68866.6 21781.8 moveto
68866.6 22962.9 lineto
stroke
newpath
69372.7 21781.8 moveto
69372.7 22400.5 lineto
69316.5 22512.9 lineto
69204 22569.2 lineto
69035.3 22569.2 lineto
68922.8 22512.9 lineto
68866.6 22456.7 lineto
stroke
newpath
70103.9 21781.8 moveto
69991.4 21838 lineto
69935.2 21894.3 lineto
69878.9 22006.8 lineto
69878.9 22344.2 lineto
69935.2 22456.7 lineto
69991.4 22512.9 lineto
70103.9 22569.2 lineto
70272.6 22569.2 lineto
70385.1 22512.9 lineto
70441.4 22456.7 lineto
70497.6 22344.2 lineto
70497.6 22006.8 lineto
70441.4 21894.3 lineto
70385.1 21838 lineto
70272.6 21781.8 lineto
70103.9 21781.8 lineto
stroke
newpath
71172.5 21781.8 moveto
71060 21838 lineto
71003.8 21950.5 lineto
71003.8 22962.9 lineto
stroke
newpath
72072.4 21838 moveto
71959.9 21781.8 lineto
71734.9 21781.8 lineto
71622.5 21838 lineto
71566.2 21950.5 lineto
71566.2 22400.5 lineto
71622.5 22512.9 lineto
71734.9 22569.2 lineto
71959.9 22569.2 lineto
72072.4 22512.9 lineto
72128.6 22400.5 lineto
72128.6 22288 lineto
71566.2 22175.5 lineto
stroke
newpath
72578.6 21838 moveto
72691.1 21781.8 lineto
72916 21781.8 lineto
73028.5 21838 lineto
73084.8 21950.5 lineto
73084.8 22006.8 lineto
73028.5 22119.2 lineto
72916 22175.5 lineto
72747.3 22175.5 lineto
72634.8 22231.7 lineto
72578.6 22344.2 lineto
72578.6 22400.5 lineto
72634.8 22512.9 lineto
72747.3 22569.2 lineto
72916 22569.2 lineto
73028.5 22512.9 lineto
stroke
newpath
73478.5 21331.8 moveto
73534.7 21388.1 lineto
73647.2 21556.8 lineto
73703.5 21669.3 lineto
73759.7 21838 lineto
73815.9 22119.2 lineto
73815.9 22344.2 lineto
73759.7 22625.4 lineto
73703.5 22794.2 lineto
73647.2 22906.6 lineto
73534.7 23075.4 lineto
73478.5 23131.6 lineto
stroke
showpage
grestore
%%EOF
