EESchema Schematic File Version 4
LIBS:rockClimbingHoldBoard-cache
EELAYER 29 0
EELAYER END
$Descr A4 11693 8268
encoding utf-8
Sheet 1 1
Title ""
Date ""
Rev ""
Comp ""
Comment1 ""
Comment2 ""
Comment3 ""
Comment4 ""
$EndDescr
$Comp
L dk_PMIC-LED-Drivers:TLC59711PWPR U1
U 1 1 5B9D8310
P 4200 5100
F 0 "U1" H 4250 5800 60  0000 C CNN
F 1 "TLC59711PWPR" H 4250 5694 60  0000 C CNN
F 2 "digikey-footprints:TSSOP-20-1EP_W4.4mm" H 4400 5300 60  0001 L CNN
F 3 "http://www.ti.com/lit/ds/symlink/tlc59711.pdf" H 4400 5400 60  0001 L CNN
F 4 "296-36745-1-ND" H 4400 5500 60  0001 L CNN "Digi-Key_PN"
F 5 "TLC59711PWPR" H 4400 5600 60  0001 L CNN "MPN"
F 6 "Integrated Circuits (ICs)" H 4400 5700 60  0001 L CNN "Category"
F 7 "PMIC - LED Drivers" H 4400 5800 60  0001 L CNN "Family"
F 8 "http://www.ti.com/lit/ds/symlink/tlc59711.pdf" H 4400 5900 60  0001 L CNN "DK_Datasheet_Link"
F 9 "/product-detail/en/texas-instruments/TLC59711PWPR/296-36745-1-ND/4341358" H 4400 6000 60  0001 L CNN "DK_Detail_Page"
F 10 "IC LED DRIVER LIN 60MA 20HTSSOP" H 4400 6100 60  0001 L CNN "Description"
F 11 "Texas Instruments" H 4400 6200 60  0001 L CNN "Manufacturer"
F 12 "Active" H 4400 6300 60  0001 L CNN "Status"
	1    4200 5100
	1    0    0    -1  
$EndComp
$Comp
L LED:CLV1L-FKB D3
U 1 1 5B9D85F2
P 5950 4850
F 0 "D3" H 5950 5347 50  0000 C CNN
F 1 "CLV1L-FKB" H 5950 5256 50  0000 C CNN
F 2 "LED_SMD:LED_Cree-PLCC4_3.2x2.8mm_CCW" H 5950 4800 50  0001 C CNN
F 3 "http://www.cree.com/led-components/media/documents/CLV1L-FKB-1238.pdf" H 5950 4800 50  0001 C CNN
F 4 "CLV1L-FKB-CHMMQEHBB7673673CT-NDe" H 5950 4850 50  0001 C CNN "Digi-Key_PN"
	1    5950 4850
	1    0    0    -1  
$EndComp
$Comp
L Battery_Management:MCP73871 U3
U 1 1 5B9D8AAE
P 6550 2350
F 0 "U3" H 6550 3428 50  0000 C CNN
F 1 "MCP73871" H 6550 3337 50  0000 C CNN
F 2 "Package_DFN_QFN:QFN-20-1EP_4x4mm_P0.5mm_EP2.5x2.5mm" H 6750 1450 50  0001 L CIN
F 3 "http://www.mouser.com/ds/2/268/22090a-52174.pdf" H 6400 2900 50  0001 C CNN
F 4 "MCP73871T-2CCI/MLCT-ND" H 6550 2350 50  0001 C CNN "Digi-Key_PN"
	1    6550 2350
	1    0    0    -1  
$EndComp
$Comp
L Connector:Barrel_Jack_Switch J3
U 1 1 5B9D8D04
P 3200 1800
F 0 "J3" H 3255 2117 50  0000 C CNN
F 1 "Barrel_Jack_Switch" H 3255 2026 50  0000 C CNN
F 2 "Connector_BarrelJack:BarrelJack_Horizontal" H 3250 1760 50  0001 C CNN
F 3 "~" H 3250 1760 50  0001 C CNN
F 4 "CP-002B-ND" H 3200 1800 50  0001 C CNN "Digi-Key_PN"
	1    3200 1800
	1    0    0    -1  
$EndComp
$Comp
L Diode:MBR0520 D1
U 1 1 5B9D9999
P 4150 1700
F 0 "D1" H 4150 1484 50  0000 C CNN
F 1 "MBR0520" H 4150 1575 50  0000 C CNN
F 2 "Diode_SMD:D_SOD-123" H 4150 1525 50  0001 C CNN
F 3 "http://www.mccsemi.com/up_pdf/MBR0520~MBR0580(SOD123).pdf" H 4150 1700 50  0001 C CNN
F 4 "MBR0520LCT-ND" H 4150 1700 50  0001 C CNN "Digi-Key_PN"
	1    4150 1700
	-1   0    0    1   
$EndComp
$Comp
L Connector_Generic:Conn_01x02 J4
U 1 1 5B9DA331
P 8850 1800
F 0 "J4" H 8930 1792 50  0000 L CNN
F 1 "Conn_01x02" H 8930 1701 50  0000 L CNN
F 2 "Connector_JST:JST_PH_B2B-PH-K_1x02_P2.00mm_Vertical" H 8850 1800 50  0001 C CNN
F 3 "~" H 8850 1800 50  0001 C CNN
	1    8850 1800
	1    0    0    -1  
$EndComp
$Comp
L LED:CLV1L-FKB D4
U 1 1 5B9DA523
P 6400 6000
F 0 "D4" H 6400 6497 50  0000 C CNN
F 1 "CLV1L-FKB" H 6400 6406 50  0000 C CNN
F 2 "LED_SMD:LED_Cree-PLCC4_3.2x2.8mm_CCW" H 6400 5950 50  0001 C CNN
F 3 "http://www.cree.com/led-components/media/documents/CLV1L-FKB-1238.pdf" H 6400 5950 50  0001 C CNN
F 4 "CLV1L-FKB-CHMMQEHBB7673673CT-ND" H 6400 6000 50  0001 C CNN "Digi-Key_PN"
	1    6400 6000
	1    0    0    -1  
$EndComp
$Comp
L LED:CLV1L-FKB D2
U 1 1 5B9DA6FF
P 5600 5550
F 0 "D2" H 5600 6047 50  0000 C CNN
F 1 "CLV1L-FKB" H 5600 5956 50  0000 C CNN
F 2 "LED_SMD:LED_Cree-PLCC4_3.2x2.8mm_CCW" H 5600 5500 50  0001 C CNN
F 3 "http://www.cree.com/led-components/media/documents/CLV1L-FKB-1238.pdf" H 5600 5500 50  0001 C CNN
F 4 "CLV1L-FKB-CHMMQEHBB7673673CT-ND" H 5600 5550 50  0001 C CNN "Digi-Key_PN"
	1    5600 5550
	1    0    0    -1  
$EndComp
Wire Wire Line
	4000 1700 3500 1700
Wire Wire Line
	3500 1800 3500 1900
Wire Wire Line
	3500 2000 3500 1900
Connection ~ 3500 1900
Text Label 3800 2000 0    50   ~ 0
GND
Text Label 3700 1700 0    50   ~ 0
Vin
Wire Wire Line
	5850 2750 5850 2950
Wire Wire Line
	5850 2250 5650 2250
Wire Wire Line
	5650 2250 5650 2750
Wire Wire Line
	5650 2750 5850 2750
Connection ~ 5850 2750
Wire Wire Line
	5850 1950 5650 1950
Wire Wire Line
	5650 1950 5650 2250
Connection ~ 5650 2250
Wire Wire Line
	5400 1700 5400 1150
Wire Wire Line
	5400 1150 5800 1150
Wire Wire Line
	6550 1150 6550 1450
Wire Wire Line
	5650 1950 5400 1950
Wire Wire Line
	5400 1950 5400 1700
Connection ~ 5650 1950
Connection ~ 5400 1700
Wire Wire Line
	8650 1900 8650 2100
Text Label 8650 2100 0    50   ~ 0
GND
Wire Wire Line
	8650 1800 7250 1800
Wire Wire Line
	7250 1800 7250 1750
$Comp
L Connector_Generic:Conn_01x02 J5
U 1 1 5B9DB5C5
P 8850 2450
F 0 "J5" H 8930 2442 50  0000 L CNN
F 1 "Conn_01x02" H 8930 2351 50  0000 L CNN
F 2 "Connector_JST:JST_PH_B2B-PH-K_1x02_P2.00mm_Vertical" H 8850 2450 50  0000 C CNN
F 3 "~" H 8850 2450 50  0001 C CNN
	1    8850 2450
	1    0    0    -1  
$EndComp
Wire Wire Line
	8650 2100 8450 2100
Wire Wire Line
	8450 2100 8450 2550
Wire Wire Line
	8450 2550 8650 2550
Wire Wire Line
	7250 2050 7500 2050
Wire Wire Line
	7500 2050 7500 2250
Wire Wire Line
	7500 2450 8650 2450
Wire Wire Line
	7250 2250 7500 2250
Connection ~ 7500 2250
Wire Wire Line
	7500 2250 7500 2450
$Comp
L Device:R_US R5
U 1 1 5B9DBC79
P 5800 1350
F 0 "R5" H 5868 1396 50  0000 L CNN
F 1 "270k" H 5868 1305 50  0000 L CNN
F 2 "Resistor_SMD:R_1206_3216Metric_Pad1.42x1.75mm_HandSolder" V 5840 1340 50  0001 C CNN
F 3 "~" H 5800 1350 50  0001 C CNN
	1    5800 1350
	1    0    0    -1  
$EndComp
Wire Wire Line
	5800 1150 5800 1200
Connection ~ 5800 1150
Wire Wire Line
	5800 1150 6550 1150
Wire Wire Line
	5850 1750 5800 1750
Wire Wire Line
	5800 1750 5800 1500
$Comp
L Device:R_US R3
U 1 1 5B9DC388
P 5400 1900
F 0 "R3" V 5195 1900 50  0000 C CNN
F 1 "100k" V 5286 1900 50  0000 C CNN
F 2 "Resistor_SMD:R_1206_3216Metric_Pad1.42x1.75mm_HandSolder" V 5440 1890 50  0001 C CNN
F 3 "~" H 5400 1900 50  0001 C CNN
	1    5400 1900
	0    1    1    0   
$EndComp
Wire Wire Line
	5550 1900 5800 1900
Wire Wire Line
	5800 1900 5800 1750
Connection ~ 5800 1750
Wire Wire Line
	5250 1900 5250 2000
Wire Wire Line
	4400 1700 4300 1700
$Comp
L Device:CP1 C3
U 1 1 5B9DDA19
P 4250 2450
F 0 "C3" H 4365 2496 50  0000 L CNN
F 1 "10uF" H 4365 2405 50  0000 L CNN
F 2 "Capacitor_SMD:C_1206_3216Metric_Pad1.42x1.75mm_HandSolder" H 4250 2450 50  0001 C CNN
F 3 "~" H 4250 2450 50  0001 C CNN
	1    4250 2450
	1    0    0    -1  
$EndComp
Text Label 4250 2300 0    50   ~ 0
Vcc
Text Label 4250 2600 0    50   ~ 0
GND
$Comp
L Device:R_US R2
U 1 1 5B9DE7DC
P 5350 2650
F 0 "R2" V 5145 2650 50  0000 C CNN
F 1 "100k" V 5236 2650 50  0000 C CNN
F 2 "Resistor_SMD:R_1206_3216Metric_Pad1.42x1.75mm_HandSolder" V 5390 2640 50  0001 C CNN
F 3 "~" H 5350 2650 50  0001 C CNN
	1    5350 2650
	0    1    1    0   
$EndComp
Wire Wire Line
	5500 2650 5700 2650
Wire Wire Line
	5700 2650 5700 2350
Wire Wire Line
	5700 2350 5850 2350
Text Label 5200 2650 0    50   ~ 0
GND
$Comp
L Device:R_US R4
U 1 1 5B9DF642
P 5450 3100
F 0 "R4" H 5518 3146 50  0000 L CNN
F 1 "2k" H 5518 3055 50  0000 L CNN
F 2 "Resistor_SMD:R_1206_3216Metric_Pad1.42x1.75mm_HandSolder" V 5490 3090 50  0001 C CNN
F 3 "~" H 5450 3100 50  0001 C CNN
	1    5450 3100
	1    0    0    -1  
$EndComp
Wire Wire Line
	5450 2950 5450 2850
Wire Wire Line
	5450 2850 5550 2850
Wire Wire Line
	5550 2850 5550 2150
Wire Wire Line
	5550 2150 5850 2150
Text Label 5450 3250 0    50   ~ 0
GND
Text Label 6550 3250 0    50   ~ 0
GND
Wire Wire Line
	4200 6400 4300 6400
Text Label 4300 6400 0    50   ~ 0
GND
$Comp
L Device:LED D6
U 1 1 5B9E095E
P 7850 2850
F 0 "D6" H 7841 3066 50  0000 C CNN
F 1 "LED" H 7841 2975 50  0000 C CNN
F 2 "LED_THT:LED_D3.0mm_Clear" H 7850 2850 50  0001 C CNN
F 3 "~" H 7850 2850 50  0001 C CNN
	1    7850 2850
	1    0    0    -1  
$EndComp
$Comp
L Device:LED D7
U 1 1 5B9E09F4
P 7900 3150
F 0 "D7" H 7891 3366 50  0000 C CNN
F 1 "LED" H 7891 3275 50  0000 C CNN
F 2 "LED_THT:LED_D3.0mm_Clear" H 7900 3150 50  0001 C CNN
F 3 "~" H 7900 3150 50  0001 C CNN
	1    7900 3150
	1    0    0    -1  
$EndComp
$Comp
L Device:LED D8
U 1 1 5B9E0A6E
P 7900 3400
F 0 "D8" H 7891 3616 50  0000 C CNN
F 1 "LED" H 7891 3525 50  0000 C CNN
F 2 "LED_THT:LED_D3.0mm_Clear" H 7900 3400 50  0001 C CNN
F 3 "~" H 7900 3400 50  0001 C CNN
	1    7900 3400
	1    0    0    -1  
$EndComp
Wire Wire Line
	7700 2850 7700 2550
Wire Wire Line
	7700 2550 7250 2550
Wire Wire Line
	7750 3150 7650 3150
Wire Wire Line
	7650 3150 7650 2750
Wire Wire Line
	7650 2750 7250 2750
Wire Wire Line
	7750 3400 7500 3400
Wire Wire Line
	7500 3400 7500 2850
Wire Wire Line
	7500 2850 7250 2850
$Comp
L Device:R_US R10
U 1 1 5B9E2BB1
P 8500 2850
F 0 "R10" V 8295 2850 50  0000 C CNN
F 1 "1k" V 8386 2850 50  0000 C CNN
F 2 "Resistor_SMD:R_1206_3216Metric_Pad1.42x1.75mm_HandSolder" V 8540 2840 50  0001 C CNN
F 3 "~" H 8500 2850 50  0001 C CNN
	1    8500 2850
	0    1    1    0   
$EndComp
Wire Wire Line
	8000 2850 8350 2850
Text Label 8650 2850 0    50   ~ 0
V3.3
$Comp
L Device:R_US R11
U 1 1 5B9E45D2
P 8500 3150
F 0 "R11" V 8295 3150 50  0000 C CNN
F 1 "1k" V 8386 3150 50  0000 C CNN
F 2 "Resistor_SMD:R_1206_3216Metric_Pad1.42x1.75mm_HandSolder" V 8540 3140 50  0001 C CNN
F 3 "~" H 8500 3150 50  0001 C CNN
	1    8500 3150
	0    1    1    0   
$EndComp
$Comp
L Device:R_US R12
U 1 1 5B9E461E
P 8500 3400
F 0 "R12" V 8295 3400 50  0000 C CNN
F 1 "1k" V 8386 3400 50  0000 C CNN
F 2 "Resistor_SMD:R_1206_3216Metric_Pad1.42x1.75mm_HandSolder" V 8540 3390 50  0001 C CNN
F 3 "~" H 8500 3400 50  0001 C CNN
	1    8500 3400
	0    1    1    0   
$EndComp
Wire Wire Line
	8050 3150 8350 3150
Wire Wire Line
	8350 3400 8050 3400
Wire Wire Line
	8650 3400 8650 3150
Wire Wire Line
	8650 3150 8650 2850
Connection ~ 8650 3150
$Comp
L Connector:Conn_01x17_Male J1
U 1 1 5B9E7EB5
P 1400 5150
F 0 "J1" H 1506 6128 50  0000 C CNN
F 1 "Conn_01x17_Male" H 1506 6037 50  0000 C CNN
F 2 "Connector_PinHeader_2.54mm:PinHeader_1x17_P2.54mm_Vertical" H 1400 5150 50  0001 C CNN
F 3 "~" H 1400 5150 50  0001 C CNN
	1    1400 5150
	1    0    0    -1  
$EndComp
$Comp
L Connector:Conn_01x17_Male J2
U 1 1 5B9E7F3D
P 2450 5150
F 0 "J2" H 2556 6128 50  0000 C CNN
F 1 "Conn_01x17_Male" H 2556 6037 50  0000 C CNN
F 2 "Connector_PinHeader_2.54mm:PinHeader_1x17_P2.54mm_Vertical" H 2450 5150 50  0001 C CNN
F 3 "~" H 2450 5150 50  0001 C CNN
	1    2450 5150
	1    0    0    -1  
$EndComp
Text Label 7750 1800 0    50   ~ 0
V3.3
Text Label 7900 2450 0    50   ~ 0
batCharg
Text Label 4200 4600 0    50   ~ 0
V3.3
Wire Wire Line
	5750 5050 5650 5050
Wire Wire Line
	5650 5050 5650 4800
Wire Wire Line
	5650 4800 4700 4800
Wire Wire Line
	5400 5750 5200 5750
Wire Wire Line
	5200 5750 5200 4900
Wire Wire Line
	5200 4900 4700 4900
Wire Wire Line
	6200 6200 5350 6200
Wire Wire Line
	5350 6200 5350 5000
Wire Wire Line
	5350 5000 4700 5000
$Comp
L LED:CLV1L-FKB D5
U 1 1 5B9EB81A
P 6750 5100
F 0 "D5" H 6750 5597 50  0000 C CNN
F 1 "CLV1L-FKB" H 6750 5506 50  0000 C CNN
F 2 "LED_SMD:LED_Cree-PLCC4_3.2x2.8mm_CCW" H 6750 5050 50  0001 C CNN
F 3 "http://www.cree.com/led-components/media/documents/CLV1L-FKB-1238.pdf" H 6750 5050 50  0001 C CNN
F 4 "CLV1L-FKB-CHMMQEHBB7673673CT-ND" H 6750 5100 50  0001 C CNN "Digi-Key_PN"
	1    6750 5100
	1    0    0    -1  
$EndComp
Wire Wire Line
	5150 5300 5150 5100
Wire Wire Line
	5150 5100 4700 5100
Wire Wire Line
	5750 4850 5100 4850
Wire Wire Line
	5100 4850 5100 5200
Wire Wire Line
	5100 5200 4700 5200
Wire Wire Line
	5400 5550 5400 5400
Wire Wire Line
	5400 5400 5100 5400
Wire Wire Line
	5100 5400 5100 5300
Wire Wire Line
	5100 5300 4700 5300
Wire Wire Line
	4700 5400 5050 5400
Wire Wire Line
	5050 5400 5050 5500
Wire Wire Line
	5050 5500 5300 5500
Wire Wire Line
	5300 5500 5300 6000
Wire Wire Line
	5300 6000 6200 6000
Wire Wire Line
	6350 5600 5000 5600
Wire Wire Line
	5000 5600 5000 5500
Wire Wire Line
	5000 5500 4700 5500
Wire Wire Line
	5150 5300 6550 5300
Wire Wire Line
	6350 5600 6350 5100
Wire Wire Line
	6350 5100 6550 5100
Wire Wire Line
	5750 4650 4950 4650
Wire Wire Line
	4950 4650 4950 5600
Wire Wire Line
	4950 5600 4700 5600
Wire Wire Line
	5400 5350 5250 5350
Wire Wire Line
	5250 5350 5250 5700
Wire Wire Line
	5250 5700 4700 5700
Wire Wire Line
	4700 5800 6200 5800
Wire Wire Line
	4700 5900 6500 5900
Wire Wire Line
	6500 5900 6500 4900
Wire Wire Line
	6500 4900 6550 4900
Wire Wire Line
	7350 5950 6600 5950
Wire Wire Line
	6600 5950 6600 6000
Wire Wire Line
	6950 5100 7250 5100
Wire Wire Line
	6400 4700 6150 4700
Wire Wire Line
	6150 4700 6150 4850
Wire Wire Line
	6400 4400 7250 4400
Wire Wire Line
	7250 4400 7250 4500
Wire Wire Line
	7350 5550 7350 4500
Wire Wire Line
	7350 4500 7250 4500
Connection ~ 7350 5550
Connection ~ 7250 4500
Text Label 6700 4400 0    50   ~ 0
V3.3
Wire Wire Line
	2650 4450 1600 4450
Wire Wire Line
	1600 4350 2650 4350
Text Label 2050 4350 0    50   ~ 0
GND
Text Label 2000 4450 0    50   ~ 0
V3.3
Wire Wire Line
	1600 4550 2650 4550
Text Label 1850 4550 0    50   ~ 0
V3.3
$Comp
L Device:CP1 C1
U 1 1 5BA2A10C
P 4800 4250
F 0 "C1" H 4915 4296 50  0000 L CNN
F 1 "10uF" H 4915 4205 50  0000 L CNN
F 2 "Capacitor_SMD:C_1206_3216Metric_Pad1.42x1.75mm_HandSolder" H 4800 4250 50  0001 C CNN
F 3 "~" H 4800 4250 50  0001 C CNN
	1    4800 4250
	1    0    0    -1  
$EndComp
Text Label 4800 4100 0    50   ~ 0
V3.3
Text Label 4800 4400 0    50   ~ 0
GND
Wire Wire Line
	2650 5250 3800 5250
Wire Wire Line
	3800 5250 3800 5200
Wire Wire Line
	2650 5150 3800 5150
Wire Wire Line
	3800 5150 3800 5100
$Comp
L Device:R_US R1
U 1 1 5BA3269B
P 3500 4550
F 0 "R1" H 3568 4596 50  0000 L CNN
F 1 "DNI" H 3568 4505 50  0000 L CNN
F 2 "Resistor_SMD:R_1206_3216Metric_Pad1.42x1.75mm_HandSolder" V 3540 4540 50  0001 C CNN
F 3 "~" H 3500 4550 50  0001 C CNN
	1    3500 4550
	1    0    0    -1  
$EndComp
Wire Wire Line
	3500 4700 3500 5000
Wire Wire Line
	3500 5000 3800 5000
Text Label 3500 4400 0    50   ~ 0
GND
Wire Wire Line
	7250 4500 7250 5100
Wire Wire Line
	5800 5550 7350 5550
Wire Wire Line
	7350 5550 7350 5950
Wire Wire Line
	6400 4700 6400 4400
Text Label 4700 6200 0    50   ~ 0
V3.3
Text Label 2650 4750 0    50   ~ 0
batCharg
$Comp
L Device:R_US R6
U 1 1 5BE7F532
P 5750 3400
F 0 "R6" H 5818 3446 50  0000 L CNN
F 1 "2k" H 5818 3355 50  0000 L CNN
F 2 "Resistor_SMD:R_1206_3216Metric_Pad1.42x1.75mm_HandSolder" V 5790 3390 50  0001 C CNN
F 3 "~" H 5750 3400 50  0001 C CNN
	1    5750 3400
	1    0    0    -1  
$EndComp
Text Label 5750 3550 0    50   ~ 0
GND
Wire Wire Line
	5850 2550 5850 2650
Wire Wire Line
	5850 2650 5750 2650
Wire Wire Line
	5750 2650 5750 3250
Text Label 3400 3700 0    50   ~ 0
GND
$Comp
L Device:CP1 CT1
U 1 1 5C98CAEC
P 2750 3600
F 0 "CT1" H 2865 3646 50  0000 L CNN
F 1 "470pF" H 2865 3555 50  0000 L CNN
F 2 "Capacitor_SMD:C_0805_2012Metric_Pad1.15x1.40mm_HandSolder" H 2750 3600 50  0001 C CNN
F 3 "~" H 2750 3600 50  0001 C CNN
	1    2750 3600
	1    0    0    -1  
$EndComp
$Comp
L Device:CP1 CO1
U 1 1 5C98DE55
P 4550 3650
F 0 "CO1" H 4665 3696 50  0000 L CNN
F 1 "470uF" H 4665 3605 50  0000 L CNN
F 2 "Capacitor_SMD:CP_Elec_6.3x3.9" H 4550 3650 50  0001 C CNN
F 3 "~" H 4550 3650 50  0001 C CNN
	1    4550 3650
	1    0    0    -1  
$EndComp
$Comp
L Device:R_US R2_MC1
U 1 1 5C99EBCD
P 4250 3500
F 0 "R2_MC1" H 4318 3546 50  0000 L CNN
F 1 "3.8k" H 4318 3455 50  0000 L CNN
F 2 "Resistor_SMD:R_0603_1608Metric_Pad1.05x0.95mm_HandSolder" V 4290 3490 50  0001 C CNN
F 3 "~" H 4250 3500 50  0001 C CNN
	1    4250 3500
	0    1    1    0   
$EndComp
$Comp
L Device:R_US R1_MC1
U 1 1 5C99FDA3
P 3800 3650
F 0 "R1_MC1" H 3868 3696 50  0000 L CNN
F 1 "1.2k" H 3868 3605 50  0000 L CNN
F 2 "Resistor_SMD:R_0603_1608Metric_Pad1.05x0.95mm_HandSolder" V 3840 3640 50  0001 C CNN
F 3 "~" H 3800 3650 50  0001 C CNN
	1    3800 3650
	1    0    0    -1  
$EndComp
Text Label 3800 3800 0    50   ~ 0
GND
Wire Wire Line
	4400 3500 4450 3500
Wire Wire Line
	4100 3500 3800 3500
Text Label 4550 3800 0    50   ~ 0
GND
Wire Wire Line
	2750 3450 2750 3400
Wire Wire Line
	2750 3400 3000 3400
Text Label 2750 3750 0    50   ~ 0
GND
$Comp
L Device:R_US RSC_MC1
U 1 1 5C9EE74D
P 3400 2650
F 0 "RSC_MC1" H 3468 2696 50  0000 L CNN
F 1 "0.33" H 3468 2605 50  0000 L CNN
F 2 "Resistor_SMD:R_1206_3216Metric_Pad1.42x1.75mm_HandSolder" V 3440 2640 50  0001 C CNN
F 3 "~" H 3400 2650 50  0001 C CNN
	1    3400 2650
	0    -1   -1   0   
$EndComp
Wire Wire Line
	3250 2650 3000 2650
Wire Wire Line
	3000 2650 3000 2800
Wire Wire Line
	3550 2650 3800 2650
$Comp
L Diode:1N5819 D9
U 1 1 5CA017F7
P 4350 3100
F 0 "D9" H 4350 3316 50  0000 C CNN
F 1 "1N5819" H 4350 3225 50  0000 C CNN
F 2 "Diode_SMD:D_SOD-123" H 4350 2925 50  0001 C CNN
F 3 "http://www.vishay.com/docs/88525/1n5817.pdf" H 4350 3100 50  0001 C CNN
F 4 "1N5819HW-FDICT-ND" H 4350 3100 50  0001 C CNN "Digi-Key_PN"
	1    4350 3100
	1    0    0    -1  
$EndComp
Wire Wire Line
	4200 3100 4200 3200
Wire Wire Line
	4200 3200 4100 3200
Wire Wire Line
	3900 3200 3900 3400
Wire Wire Line
	3900 3400 3800 3400
Text Label 4500 3100 0    50   ~ 0
GND
$Comp
L Device:L 220uH1
U 1 1 5CA18A3A
P 4250 3300
F 0 "220uH1" V 4069 3300 50  0000 C CNN
F 1 "L" V 4160 3300 50  0000 C CNN
F 2 "Inductor_SMD:L_Bourns_SRR1210A" H 4250 3300 50  0001 C CNN
F 3 "~" H 4250 3300 50  0001 C CNN
F 4 "SRR1210-221MCT-ND" V 4250 3300 50  0001 C CNN "Digi-Key_PN"
	1    4250 3300
	0    1    1    0   
$EndComp
Wire Wire Line
	4100 3300 4100 3200
Connection ~ 4100 3200
Wire Wire Line
	4100 3200 3900 3200
Wire Wire Line
	4400 3300 4400 3400
Wire Wire Line
	4400 3400 4450 3400
Wire Wire Line
	4450 3400 4450 3500
Connection ~ 4450 3500
Wire Wire Line
	4450 3500 4550 3500
Wire Wire Line
	5000 1700 5400 1700
Wire Wire Line
	3500 2000 5250 2000
Wire Wire Line
	4400 1700 4400 1200
Wire Wire Line
	4400 1200 2850 1200
Wire Wire Line
	2850 1200 2850 2800
Wire Wire Line
	2850 2800 3000 2800
Connection ~ 3000 2800
Wire Wire Line
	3000 2800 3000 3000
Wire Wire Line
	5000 1700 5000 3400
Wire Wire Line
	5000 3400 4450 3400
Connection ~ 4450 3400
Wire Wire Line
	3800 3200 3800 3100
Connection ~ 3800 3100
Wire Wire Line
	3800 2650 3800 3000
Wire Wire Line
	3800 3000 3800 3100
Connection ~ 3800 3000
Connection ~ 3800 3500
$Comp
L Regulator_Switching:MC34063AD U4
U 1 1 5C9605F4
P 3400 3200
F 0 "U4" H 3400 3667 50  0000 C CNN
F 1 "MC34063AD" H 3400 3576 50  0000 C CNN
F 2 "Package_SO:SOIC-8_3.9x4.9mm_P1.27mm" H 3450 2750 50  0001 L CNN
F 3 "http://www.onsemi.com/pub_link/Collateral/MC34063A-D.PDF" H 3900 3100 50  0001 C CNN
F 4 "296-17765-1-ND" H 3400 3200 50  0001 C CNN "Digi-Key_PN"
	1    3400 3200
	1    0    0    -1  
$EndComp
$Comp
L Device:D_Photo D10
U 1 1 5C985712
P 3050 6400
F 0 "D10" H 3000 6695 50  0000 C CNN
F 1 "D_Photo" H 3000 6604 50  0000 C CNN
F 2 "Diode_THT:D_A-405_P2.54mm_Vertical_AnodeUp" H 3000 6400 50  0001 C CNN
F 3 "~" H 3000 6400 50  0001 C CNN
	1    3050 6400
	1    0    0    -1  
$EndComp
$Comp
L Device:R_US RPD1
U 1 1 5C986A38
P 3350 5850
F 0 "RPD1" H 3418 5896 50  0000 L CNN
F 1 "1k" H 3418 5805 50  0000 L CNN
F 2 "Resistor_SMD:R_1206_3216Metric_Pad1.42x1.75mm_HandSolder" V 3390 5840 50  0001 C CNN
F 3 "~" H 3350 5850 50  0001 C CNN
	1    3350 5850
	0    -1   -1   0   
$EndComp
Wire Wire Line
	3200 5850 3200 6400
Wire Wire Line
	3200 6400 3150 6400
Wire Wire Line
	3500 5850 3500 6550
Wire Wire Line
	3500 6550 4700 6550
Wire Wire Line
	4700 6550 4700 6200
Text Label 2850 6400 0    50   ~ 0
GND
Wire Wire Line
	2650 4850 3200 4850
Wire Wire Line
	3200 4850 3200 5850
Connection ~ 3200 5850
$EndSCHEMATC
