{
	"info": {
		"_postman_id": "e2e3d8cb-7387-49c6-8909-c5927b911201",
		"name": "CarStore",
		"schema": "https://schema.getpostman.com/json/collection/v2.1.0/collection.json",
		"_exporter_id": "20817622"
	},
	"item": [
		{
			"name": "login",
			"request": {
				"method": "POST",
				"header": [],
				"body": {
					"mode": "raw",
					"raw": "{\"email\":\"admin@carstore.com\",\"password\":\"admin\"}",
					"options": {
						"raw": {
							"language": "json"
						}
					}
				},
				"url": {
					"raw": "localhost:8080/api/login",
					"host": [
						"localhost"
					],
					"port": "8080",
					"path": [
						"api",
						"login"
					]
				}
			},
			"response": []
		},
		{
			"name": "history-log",
			"request": {
				"method": "GET",
				"header": [
					{
						"key": "Authorization",
						"value": "Bearer eyJhbGciOiJIUzUxMiJ9.eyJzdWIiOiJhZG1pbkBjYXJzdG9yZS5jb20iLCJhdXRoIjoiUk9MRV9BRE1JTiIsImV4cCI6MTY3MzYzOTI5OH0.u5qdLhbYq3CPEi93OBUYXIegJIF8G03sj3TcIXTnVRCHSbXfyrquNC9kWpe0_TVAPAUbZbC622dvy8tbVGdy_w",
						"type": "text"
					}
				],
				"url": {
					"raw": "http://localhost:8080/api/history-log",
					"protocol": "http",
					"host": [
						"localhost"
					],
					"port": "8080",
					"path": [
						"api",
						"history-log"
					]
				}
			},
			"response": []
		},
		{
			"name": "batch-create-users",
			"request": {
				"method": "POST",
				"header": [],
				"body": {
					"mode": "raw",
					"raw": "[{\"firstName\":\"u1\",\"lastName\":\"u1\",\"email\":\"u1@carstore.com\",\"password\":\"u1\", \"budget\":11111.0, \"authority\":\"ROLE_USER\"},\n{\"firstName\":\"u2\",\"lastName\":\"u2\",\"email\":\"u2@carstore.com\",\"password\":\"u2\", \"budget\":22222.0, \"authority\":\"ROLE_USER\"}]",
					"options": {
						"raw": {
							"language": "json"
						}
					}
				},
				"url": {
					"raw": "http://localhost:8080/api/batch-create-users",
					"protocol": "http",
					"host": [
						"localhost"
					],
					"port": "8080",
					"path": [
						"api",
						"batch-create-users"
					]
				}
			},
			"response": []
		},
		{
			"name": "create-user",
			"request": {
				"method": "POST",
				"header": [],
				"body": {
					"mode": "raw",
					"raw": "{\"firstName\":\"Risto\",\"lastName\":\"Muchev\",\"email\":\"rm@carstore.com\",\"password\":\"RistoM\", \"budget\":999999.0, \"authority\":\"ROLE_USER\"}",
					"options": {
						"raw": {
							"language": "json"
						}
					}
				},
				"url": {
					"raw": "http://localhost:8080/api/create-user",
					"protocol": "http",
					"host": [
						"localhost"
					],
					"port": "8080",
					"path": [
						"api",
						"create-user"
					]
				}
			},
			"response": []
		},
		{
			"name": "list-users",
			"request": {
				"method": "GET",
				"header": [
					{
						"key": "Authorization",
						"value": "Bearer eyJhbGciOiJIUzUxMiJ9.eyJzdWIiOiJhZG1pbkBjYXJzdG9yZS5jb20iLCJhdXRoIjoiUk9MRV9BRE1JTiIsImV4cCI6MTY3MzYzOTI5OH0.u5qdLhbYq3CPEi93OBUYXIegJIF8G03sj3TcIXTnVRCHSbXfyrquNC9kWpe0_TVAPAUbZbC622dvy8tbVGdy_w",
						"type": "text"
					}
				],
				"url": {
					"raw": "http://localhost:8080/api/list-users",
					"protocol": "http",
					"host": [
						"localhost"
					],
					"port": "8080",
					"path": [
						"api",
						"list-users"
					]
				}
			},
			"response": []
		},
		{
			"name": "list-cars",
			"request": {
				"method": "GET",
				"header": [
					{
						"key": "Authorization",
						"value": "Bearer eyJhbGciOiJIUzUxMiJ9.eyJzdWIiOiJhZG1pbkBjYXJzdG9yZS5jb20iLCJhdXRoIjoiUk9MRV9BRE1JTiIsImV4cCI6MTY3MzYzOTI5OH0.u5qdLhbYq3CPEi93OBUYXIegJIF8G03sj3TcIXTnVRCHSbXfyrquNC9kWpe0_TVAPAUbZbC622dvy8tbVGdy_w",
						"type": "text"
					}
				],
				"url": {
					"raw": "http://localhost:8080/api/list-cars",
					"protocol": "http",
					"host": [
						"localhost"
					],
					"port": "8080",
					"path": [
						"api",
						"list-cars"
					]
				}
			},
			"response": []
		},
		{
			"name": "create-car",
			"request": {
				"method": "POST",
				"header": [
					{
						"key": "Authorization",
						"value": "Bearer eyJhbGciOiJIUzUxMiJ9.eyJzdWIiOiJhZG1pbkBjYXJzdG9yZS5jb20iLCJhdXRoIjoiUk9MRV9BRE1JTiIsImV4cCI6MTY3MzYzOTI5OH0.u5qdLhbYq3CPEi93OBUYXIegJIF8G03sj3TcIXTnVRCHSbXfyrquNC9kWpe0_TVAPAUbZbC622dvy8tbVGdy_w",
						"type": "text"
					}
				],
				"body": {
					"mode": "raw",
					"raw": "{\"name\":\"car name\",\n\"category\":\"SUV\",\n\"brand\":\"BMW\",\n\"description\":\"Car description\",\n\"price\":100,\n\"manufacturingDate\":\"2022-02-02\"}",
					"options": {
						"raw": {
							"language": "json"
						}
					}
				},
				"url": {
					"raw": "http://localhost:8080/api/create-car",
					"protocol": "http",
					"host": [
						"localhost"
					],
					"port": "8080",
					"path": [
						"api",
						"create-car"
					]
				}
			},
			"response": []
		},
		{
			"name": "batch-create-cars",
			"request": {
				"method": "POST",
				"header": [
					{
						"key": "Authorization",
						"value": "Bearer eyJhbGciOiJIUzUxMiJ9.eyJzdWIiOiJhZG1pbkBjYXJzdG9yZS5jb20iLCJhdXRoIjoiUk9MRV9BRE1JTiIsImV4cCI6MTY3MzYzOTI5OH0.u5qdLhbYq3CPEi93OBUYXIegJIF8G03sj3TcIXTnVRCHSbXfyrquNC9kWpe0_TVAPAUbZbC622dvy8tbVGdy_w",
						"type": "text"
					}
				],
				"body": {
					"mode": "raw",
					"raw": "[{\"name\":\"car name1\",\n\"category\":\"SUV\",\n\"brand\":\"BMW\",\n\"description\":\"Car description1\",\n\"price\":100,\n\"manufacturingDate\":\"2022-01-01\"},\n{\"name\":\"car name2\",\n\"category\":\"LIMO\",\n\"brand\":\"FIAT\",\n\"description\":\"Car description2\",\n\"price\":200,\n\"manufacturingDate\":\"2022-02-02\"}]",
					"options": {
						"raw": {
							"language": "json"
						}
					}
				},
				"url": {
					"raw": "http://localhost:8080/api/batch-create-cars",
					"protocol": "http",
					"host": [
						"localhost"
					],
					"port": "8080",
					"path": [
						"api",
						"batch-create-cars"
					]
				}
			},
			"response": []
		},
		{
			"name": "buy-car",
			"request": {
				"method": "PUT",
				"header": [
					{
						"key": "Authorization",
						"value": "Bearer eyJhbGciOiJIUzUxMiJ9.eyJzdWIiOiJ1c2VyQGNhcnN0b3JlLmNvbSIsImF1dGgiOiJST0xFX1VTRVIiLCJleHAiOjE2NzM2NDcxMjB9.TFgp2m20_7Av32wHls3cITNphdUpHcAJqyta9dtQ4ypkpOhsIqpOyuejV4KdCP_2UdJ9RoLQxcgq9EAZ2ZFM8Q",
						"type": "text"
					}
				],
				"body": {
					"mode": "raw",
					"raw": "{\"id\":1}",
					"options": {
						"raw": {
							"language": "json"
						}
					}
				},
				"url": {
					"raw": "http://localhost:8080/api/buy-car",
					"protocol": "http",
					"host": [
						"localhost"
					],
					"port": "8080",
					"path": [
						"api",
						"buy-car"
					]
				}
			},
			"response": []
		}
	]
}