{
  "name": "multiplatform.one",
  "remoteUser": "frappe",
  "dockerComposeFile": "compose.yaml",
  "service": "devcontainer",
  "workspaceFolder": "/workspace/development",
  "initializeCommand": "([ ! -f .env ] || [ .env.default -nt .env ] && cp .env.default .env || true) && mkdir -p $HOME/.local/state/frappe $HOME/.pnpm-store $HOME/.local/share/solana && touch $HOME/.npmrc",
  "postAttachCommand": "sh ${containerWorkspaceFolder}/.devcontainer/postattach.sh",
  "shutdownAction": "stopCompose",
  "mounts": [
    "source=${localEnv:HOME}/.local/state/frappe,target=/home/frappe/.local/state/frappe,type=bind,consistency=cached",
    "source=${localEnv:HOME}/.npmrc,target=/home/frappe/.npmrc,type=bind,consistency=cached",
    "source=${localEnv:HOME}/.pnpm-store,target=/home/frappe/.pnpm-store,consistency=cached",
    "source=${localEnv:HOME}/.ssh,target=/home/frappe/.ssh,type=bind,consistency=cached",
    "source=${localEnv:XAUTHORITY},target=/home/frappe/.Xauthority,type=bind",
    "source=/tmp/.X11-unix,target=/tmp/.X11-unix,type=bind"
  ],
  "remoteEnv": {
    "APP_DIR": "/workspace/development/frappe",
    "DOTENV_FILE": "/workspace/development/.env",
    "WORK_DIR": "/workspace/development/frappe",
    "DISPLAY": "${localEnv:DISPLAY}",
    "XAUTHORITY": "/home/frappe/.Xauthority",
    "LIBGL_ALWAYS_INDIRECT": "1"
  },
  "customizations": {
    "vscode": {
      "extensions": [
        "1YiB.rust-bundle",
        "ahmadalli.vscode-nginx-conf",
        "biomejs.biome",
        "eamodio.gitlens",
        "editorconfig.editorconfig",
        "graphql.vscode-graphql",
        "graphql.vscode-graphql-execution",
        "graphql.vscode-graphql-syntax",
        "juanblanco.solidity",
        "mikestead.dotenv",
        "ms-playwright.playwright",
        "ms-python.black-formatter",
        "ms-python.debugpy",
        "ms-python.python",
        "ms-vscode.makefile-tools",
        "mysten.move",
        "mysten.prettier-move",
        "prisma.prisma",
        "psioniq.psi-header",
        "streetsidesoftware.code-spell-checker",
        "tamasfe.even-better-toml",
        "tintinweb.solidity-visual-auditor",
        "wmanth.jar-viewer",
        "yoavbls.pretty-ts-errors"
      ],
      "settings": {
        "extensions.verifySignature": false,
        "terminal.integrated.defaultProfile.linux": "zsh",
        "terminal.integrated.profiles.linux": {
          "zsh": {
            "path": "/bin/zsh"
          }
        }
      }
    }
  }
}
