{
  "$schema": "https://turbo.build/schema.json",
  "pipeline": {
    "build": {
      "cache": true,
      "dependsOn": ["^build", "@service/api#generate"],
      "inputs": ["*.json", "*.ts", "*.tsx", "src/**"],
      "outputs": ["dist/**", "lib/**", "types/**"]
    },
    "test": {
      "cache": true,
      "dependsOn": ["^build"],
      "outputs": ["coverage/**"]
    },
    "@platform/*#build": {
      "cache": false,
      "dependsOn": ["^build"]
    },
    "@service/api#generate": {
      "cache": true,
      "inputs": ["prisma/**"],
      "outputs": ["generated/**"]
    },
    "@service/api#build": {
      "cache": false,
      "dependsOn": ["^build", "@service/api#generate"]
    },
    "typecheck": {
      "cache": false,
      "outputs": []
    }
  },
  "globalDependencies": ["package.json", "tsconfig.base.json", "tsconfig.json"]
}
